sbuild (Debian sbuild) 0.85.0 (04 January 2023) on debian-ci-siliconvalley

+==============================================================================+
| di 6.0.0-1 (ppc64el)                         Wed, 19 Mar 2025 19:46:04 +0000 |
+==============================================================================+

Package: di
Version: 6.0.0-1
Source Version: 6.0.0-1
Distribution: unstable
Machine Architecture: amd64
Host Architecture: ppc64el
Build Architecture: amd64
Build Profiles: cross nocheck
Build Type: any

I: NOTICE: Log filtering will replace 'var/run/schroot/mount/sid-amd64-sbuild-ad27eb18-9c86-428d-81c2-af84db518feb' with '<<CHROOT>>'
I: NOTICE: Log filtering will replace 'build/di-dMtzfO/resolver-KXg9SQ' with '<<RESOLVERDIR>>'

+------------------------------------------------------------------------------+
| Update chroot                                                                |
+------------------------------------------------------------------------------+

Get:1 http://localhost:3142/debian unstable InRelease [205 kB]
Get:2 http://localhost:3142/debian unstable/contrib Sources.diff/Index [63.3 kB]
Get:3 http://localhost:3142/debian unstable/main Sources.diff/Index [63.6 kB]
Get:4 http://localhost:3142/debian unstable/main amd64 Packages.diff/Index [63.6 kB]
Get:5 http://localhost:3142/debian unstable/contrib Sources T-2025-03-19-1410.54-F-2025-03-19-0206.55.pdiff [958 B]
Get:6 http://localhost:3142/debian unstable/main Sources T-2025-03-19-1410.54-F-2025-03-19-0206.55.pdiff [59.5 kB]
Get:5 http://localhost:3142/debian unstable/contrib Sources T-2025-03-19-1410.54-F-2025-03-19-0206.55.pdiff [958 B]
Get:6 http://localhost:3142/debian unstable/main Sources T-2025-03-19-1410.54-F-2025-03-19-0206.55.pdiff [59.5 kB]
Get:7 http://localhost:3142/debian unstable/main amd64 Packages T-2025-03-19-1410.54-F-2025-03-19-0206.55.pdiff [153 kB]
Get:7 http://localhost:3142/debian unstable/main amd64 Packages T-2025-03-19-1410.54-F-2025-03-19-0206.55.pdiff [153 kB]
Get:8 http://localhost:3142/debian unstable/main ppc64el Packages [9887 kB]
Fetched 10.5 MB in 3s (3764 kB/s)
Reading package lists...
Reading package lists...
Building dependency tree...
Reading state information...
Calculating upgrade...
0 upgraded, 0 newly installed, 0 to remove and 0 not upgraded.

+------------------------------------------------------------------------------+
| Fetch source files                                                           |
+------------------------------------------------------------------------------+


Check APT
---------

Checking available source versions...

Download source files with APT
------------------------------

Reading package lists...
NOTICE: 'di' packaging is maintained in the 'Git' version control system at:
https://salsa.debian.org/debian/di.git
Please use:
git clone https://salsa.debian.org/debian/di.git
to retrieve the latest (possibly unreleased) updates to the package.
Need to get 139 kB of source archives.
Get:1 http://localhost:3142/debian unstable/main di 6.0.0-1 (dsc) [1930 B]
Get:2 http://localhost:3142/debian unstable/main di 6.0.0-1 (tar) [133 kB]
Get:3 http://localhost:3142/debian unstable/main di 6.0.0-1 (diff) [4044 B]
Fetched 139 kB in 0s (2504 kB/s)
Download complete and in download only mode
I: NOTICE: Log filtering will replace 'build/di-dMtzfO/di-6.0.0' with '<<PKGBUILDDIR>>'
I: NOTICE: Log filtering will replace 'build/di-dMtzfO' with '<<BUILDDIR>>'

+------------------------------------------------------------------------------+
| Install package build dependencies                                           |
+------------------------------------------------------------------------------+


Setup apt archive
-----------------

Merged Build-Depends: debhelper (>= 13), debhelper-compat (= 13), cmake, gettext, libtirpc-dev, libtommath-dev, pkgconf, libc-dev, libstdc++-dev, build-essential:amd64, fakeroot:amd64, crossbuild-essential-ppc64el:amd64, libc-dev:ppc64el, libstdc++-dev:ppc64el
Filtered Build-Depends: debhelper (>= 13), debhelper-compat (= 13), cmake, gettext, libtirpc-dev, libtommath-dev, pkgconf, libc-dev, libstdc++-dev, build-essential:amd64, fakeroot:amd64, crossbuild-essential-ppc64el:amd64, libc-dev:ppc64el, libstdc++-dev:ppc64el
dpkg-deb: warning: root directory /<<RESOLVERDIR>>/sbuild-build-depends-main-dummy has unusual owner or group 1000:119
dpkg-deb: hint: you might need to pass --root-owner-group, see <https://wiki.debian.org/Teams/Dpkg/RootlessBuilds> for further details
dpkg-deb: warning: ignoring 1 warning about the control file(s)
dpkg-deb: building package 'sbuild-build-depends-main-dummy' in '/<<RESOLVERDIR>>/apt_archive/sbuild-build-depends-main-dummy.deb'.
Ign:1 copy:/<<RESOLVERDIR>>/apt_archive ./ InRelease
Get:2 copy:/<<RESOLVERDIR>>/apt_archive ./ Release [609 B]
Ign:3 copy:/<<RESOLVERDIR>>/apt_archive ./ Release.gpg
Get:4 copy:/<<RESOLVERDIR>>/apt_archive ./ Sources [794 B]
Get:5 copy:/<<RESOLVERDIR>>/apt_archive ./ Packages [839 B]
Fetched 2242 B in 0s (0 B/s)
Reading package lists...
Reading package lists...

Install main build dependencies (apt-based resolver)
----------------------------------------------------

Installing build dependencies
Reading package lists...
Building dependency tree...
Reading state information...
Execute external solver...
The following additional packages will be installed:
  autoconf automake autopoint autotools-dev binutils-powerpc64le-linux-gnu
  bsdextrautils cmake cmake-data cpp-14-powerpc64le-linux-gnu
  cpp-powerpc64le-linux-gnu crossbuild-essential-ppc64el debhelper
  dh-autoreconf dh-strip-nondeterminism dwz fakeroot file
  g++-14-powerpc64le-linux-gnu g++-powerpc64le-linux-gnu gcc-14-base:ppc64el
  gcc-14-cross-base gcc-14-powerpc64le-linux-gnu
  gcc-14-powerpc64le-linux-gnu-base gcc-powerpc64le-linux-gnu gettext
  gettext-base groff-base intltool-debian libarchive-zip-perl libarchive13t64
  libasan8:ppc64el libasan8-ppc64el-cross libatomic1:ppc64el
  libatomic1-ppc64el-cross libbrotli1 libc6:ppc64el libc6-dev:ppc64el
  libc6-dev-ppc64el-cross libc6-ppc64el-cross libcom-err2 libcom-err2:ppc64el
  libcrypt-dev:ppc64el libcrypt1:ppc64el libcurl4t64 libdebhelper-perl
  libelf1t64 libexpat1 libfakeroot libffi8 libfile-stripnondeterminism-perl
  libgcc-14-dev:ppc64el libgcc-14-dev-ppc64el-cross libgcc-s1:ppc64el
  libgcc-s1-ppc64el-cross libgnutls30t64 libgomp1:ppc64el
  libgomp1-ppc64el-cross libgssapi-krb5-2 libgssapi-krb5-2:ppc64el libicu76
  libidn2-0 libitm1:ppc64el libitm1-ppc64el-cross libjsoncpp26 libk5crypto3
  libk5crypto3:ppc64el libkeyutils1 libkeyutils1:ppc64el libkrb5-3
  libkrb5-3:ppc64el libkrb5support0 libkrb5support0:ppc64el libldap2
  liblsan0:ppc64el liblsan0-ppc64el-cross libmagic-mgc libmagic1t64
  libncursesw6 libnghttp2-14 libnghttp3-9 libp11-kit0 libpipeline1 libpkgconf3
  libproc2-0 libpsl5t64 libquadmath0:ppc64el libquadmath0-ppc64el-cross
  librhash1 librtmp1 libsasl2-2 libsasl2-modules-db libssh2-1t64
  libssl3t64:ppc64el libstdc++-14-dev:ppc64el libstdc++-14-dev-ppc64el-cross
  libstdc++6:ppc64el libstdc++6-ppc64el-cross libtasn1-6 libtirpc-common
  libtirpc-dev:ppc64el libtirpc3t64:ppc64el libtommath-dev:ppc64el
  libtommath1:ppc64el libtool libtsan2:ppc64el libtsan2-ppc64el-cross
  libubsan1:ppc64el libubsan1-ppc64el-cross libuchardet0 libunistring5
  libuv1t64 libxml2 libzstd1:ppc64el linux-libc-dev-ppc64el-cross m4 man-db
  pkgconf:ppc64el pkgconf-bin po-debconf procps sensible-utils zlib1g:ppc64el
Suggested packages:
  autoconf-archive gnu-standards autoconf-doc binutils-doc cmake-doc
  cmake-format elpa-cmake-mode ninja-build gcc-14-locales cpp-14-doc cpp-doc
  dh-make gcc-14-doc manpages-dev flex bison gdb-powerpc64le-linux-gnu gcc-doc
  gettext-doc libasprintf-dev libgettextpo-dev groff lrzip glibc-doc:ppc64el
  libc-l10n:ppc64el locales:ppc64el libnss-nis:ppc64el libnss-nisplus:ppc64el
  manpages-dev:ppc64el gnutls-bin krb5-doc krb5-user krb5-doc:ppc64el
  krb5-user:ppc64el libstdc++-14-doc:ppc64el libtool-doc gfortran
  | fortran95-compiler gcj-jdk m4-doc apparmor less www-browser
  libmail-box-perl
Recommended packages:
  curl | wget | lynx libidn2-0:ppc64el ca-certificates libarchive-cpio-perl
  krb5-locales krb5-locales:ppc64el libldap-common libgpm2 publicsuffix
  libsasl2-modules libtommath-doc:ppc64el libltdl-dev libmail-sendmail-perl
  psmisc linux-sysctl-defaults
The following NEW packages will be installed:
  autoconf automake autopoint autotools-dev binutils-powerpc64le-linux-gnu
  bsdextrautils cmake cmake-data cpp-14-powerpc64le-linux-gnu
  cpp-powerpc64le-linux-gnu crossbuild-essential-ppc64el debhelper
  dh-autoreconf dh-strip-nondeterminism dwz fakeroot file
  g++-14-powerpc64le-linux-gnu g++-powerpc64le-linux-gnu gcc-14-base:ppc64el
  gcc-14-cross-base gcc-14-powerpc64le-linux-gnu
  gcc-14-powerpc64le-linux-gnu-base gcc-powerpc64le-linux-gnu gettext
  gettext-base groff-base intltool-debian libarchive-zip-perl libarchive13t64
  libasan8:ppc64el libasan8-ppc64el-cross libatomic1:ppc64el
  libatomic1-ppc64el-cross libbrotli1 libc6:ppc64el libc6-dev:ppc64el
  libc6-dev-ppc64el-cross libc6-ppc64el-cross libcom-err2 libcom-err2:ppc64el
  libcrypt-dev:ppc64el libcrypt1:ppc64el libcurl4t64 libdebhelper-perl
  libelf1t64 libexpat1 libfakeroot libffi8 libfile-stripnondeterminism-perl
  libgcc-14-dev:ppc64el libgcc-14-dev-ppc64el-cross libgcc-s1:ppc64el
  libgcc-s1-ppc64el-cross libgnutls30t64 libgomp1:ppc64el
  libgomp1-ppc64el-cross libgssapi-krb5-2 libgssapi-krb5-2:ppc64el libicu76
  libidn2-0 libitm1:ppc64el libitm1-ppc64el-cross libjsoncpp26 libk5crypto3
  libk5crypto3:ppc64el libkeyutils1 libkeyutils1:ppc64el libkrb5-3
  libkrb5-3:ppc64el libkrb5support0 libkrb5support0:ppc64el libldap2
  liblsan0:ppc64el liblsan0-ppc64el-cross libmagic-mgc libmagic1t64
  libncursesw6 libnghttp2-14 libnghttp3-9 libp11-kit0 libpipeline1 libpkgconf3
  libproc2-0 libpsl5t64 libquadmath0:ppc64el libquadmath0-ppc64el-cross
  librhash1 librtmp1 libsasl2-2 libsasl2-modules-db libssh2-1t64
  libssl3t64:ppc64el libstdc++-14-dev:ppc64el libstdc++-14-dev-ppc64el-cross
  libstdc++6:ppc64el libstdc++6-ppc64el-cross libtasn1-6 libtirpc-common
  libtirpc-dev:ppc64el libtirpc3t64:ppc64el libtommath-dev:ppc64el
  libtommath1:ppc64el libtool libtsan2:ppc64el libtsan2-ppc64el-cross
  libubsan1:ppc64el libubsan1-ppc64el-cross libuchardet0 libunistring5
  libuv1t64 libxml2 libzstd1:ppc64el linux-libc-dev-ppc64el-cross m4 man-db
  pkgconf:ppc64el pkgconf-bin po-debconf procps
  sbuild-build-depends-main-dummy:ppc64el sensible-utils zlib1g:ppc64el
0 upgraded, 123 newly installed, 0 to remove and 0 not upgraded.
Need to get 123 MB of archives.
After this operation, 503 MB of additional disk space will be used.
Get:1 copy:/<<RESOLVERDIR>>/apt_archive ./ sbuild-build-depends-main-dummy 0.invalid.0 [956 B]
Get:2 http://localhost:3142/debian unstable/main amd64 libncursesw6 amd64 6.5+20250216-2 [135 kB]
Get:3 http://localhost:3142/debian unstable/main amd64 libproc2-0 amd64 2:4.0.4-7 [64.9 kB]
Get:4 http://localhost:3142/debian unstable/main amd64 procps amd64 2:4.0.4-7 [878 kB]
Get:5 http://localhost:3142/debian unstable/main amd64 sensible-utils all 0.0.24 [24.8 kB]
Get:6 http://localhost:3142/debian unstable/main amd64 libmagic-mgc amd64 1:5.46-2 [337 kB]
Get:7 http://localhost:3142/debian unstable/main amd64 libmagic1t64 amd64 1:5.46-2 [109 kB]
Get:8 http://localhost:3142/debian unstable/main amd64 file amd64 1:5.46-2 [43.5 kB]
Get:9 http://localhost:3142/debian unstable/main amd64 gettext-base amd64 0.23.1-1 [243 kB]
Get:10 http://localhost:3142/debian unstable/main amd64 libuchardet0 amd64 0.0.8-1+b2 [68.9 kB]
Get:11 http://localhost:3142/debian unstable/main amd64 groff-base amd64 1.23.0-7 [1185 kB]
Get:12 http://localhost:3142/debian unstable/main amd64 bsdextrautils amd64 2.40.4-5 [92.4 kB]
Get:13 http://localhost:3142/debian unstable/main amd64 libpipeline1 amd64 1.5.8-1 [42.0 kB]
Get:14 http://localhost:3142/debian unstable/main amd64 man-db amd64 2.13.0-1 [1420 kB]
Get:15 http://localhost:3142/debian unstable/main amd64 m4 amd64 1.4.19-7 [294 kB]
Get:16 http://localhost:3142/debian unstable/main amd64 autoconf all 2.72-3 [493 kB]
Get:17 http://localhost:3142/debian unstable/main amd64 autotools-dev all 20220109.1 [51.6 kB]
Get:18 http://localhost:3142/debian unstable/main amd64 automake all 1:1.17-3 [862 kB]
Get:19 http://localhost:3142/debian unstable/main amd64 autopoint all 0.23.1-1 [770 kB]
Get:20 http://localhost:3142/debian unstable/main amd64 binutils-powerpc64le-linux-gnu amd64 2.44-3 [1514 kB]
Get:21 http://localhost:3142/debian unstable/main amd64 cmake-data all 3.31.6-1 [2268 kB]
Get:22 http://localhost:3142/debian unstable/main amd64 libicu76 amd64 76.1-3 [9721 kB]
Get:23 http://localhost:3142/debian unstable/main amd64 libxml2 amd64 2.12.7+dfsg+really2.9.14-0.3+b1 [699 kB]
Get:24 http://localhost:3142/debian unstable/main amd64 libarchive13t64 amd64 3.7.4-1.1 [349 kB]
Get:25 http://localhost:3142/debian unstable/main amd64 libbrotli1 amd64 1.1.0-2+b7 [307 kB]
Get:26 http://localhost:3142/debian unstable/main amd64 libkrb5support0 amd64 1.21.3-5 [33.0 kB]
Get:27 http://localhost:3142/debian unstable/main amd64 libcom-err2 amd64 1.47.2-1+b1 [24.3 kB]
Get:28 http://localhost:3142/debian unstable/main amd64 libk5crypto3 amd64 1.21.3-5 [81.5 kB]
Get:29 http://localhost:3142/debian unstable/main amd64 libkeyutils1 amd64 1.6.3-4 [9092 B]
Get:30 http://localhost:3142/debian unstable/main amd64 libkrb5-3 amd64 1.21.3-5 [326 kB]
Get:31 http://localhost:3142/debian unstable/main amd64 libgssapi-krb5-2 amd64 1.21.3-5 [138 kB]
Get:32 http://localhost:3142/debian unstable/main amd64 libunistring5 amd64 1.3-1 [476 kB]
Get:33 http://localhost:3142/debian unstable/main amd64 libidn2-0 amd64 2.3.8-2 [109 kB]
Get:34 http://localhost:3142/debian unstable/main amd64 libsasl2-modules-db amd64 2.1.28+dfsg1-9 [19.8 kB]
Get:35 http://localhost:3142/debian unstable/main amd64 libsasl2-2 amd64 2.1.28+dfsg1-9 [57.5 kB]
Get:36 http://localhost:3142/debian unstable/main amd64 libldap2 amd64 2.6.9+dfsg-2 [194 kB]
Get:37 http://localhost:3142/debian unstable/main amd64 libnghttp2-14 amd64 1.64.0-1 [75.5 kB]
Get:38 http://localhost:3142/debian unstable/main amd64 libnghttp3-9 amd64 1.8.0-1 [67.7 kB]
Get:39 http://localhost:3142/debian unstable/main amd64 libpsl5t64 amd64 0.21.2-1.1+b1 [57.2 kB]
Get:40 http://localhost:3142/debian unstable/main amd64 libffi8 amd64 3.4.7-1 [23.9 kB]
Get:41 http://localhost:3142/debian unstable/main amd64 libp11-kit0 amd64 0.25.5-3 [425 kB]
Get:42 http://localhost:3142/debian unstable/main amd64 libtasn1-6 amd64 4.20.0-2 [49.9 kB]
Get:43 http://localhost:3142/debian unstable/main amd64 libgnutls30t64 amd64 3.8.9-2 [1464 kB]
Get:44 http://localhost:3142/debian unstable/main amd64 librtmp1 amd64 2.4+20151223.gitfa8646d.1-2+b5 [58.8 kB]
Get:45 http://localhost:3142/debian unstable/main amd64 libssh2-1t64 amd64 1.11.1-1 [245 kB]
Get:46 http://localhost:3142/debian unstable/main amd64 libcurl4t64 amd64 8.13.0~rc2-1 [380 kB]
Get:47 http://localhost:3142/debian unstable/main amd64 libexpat1 amd64 2.7.0-1 [107 kB]
Get:48 http://localhost:3142/debian unstable/main amd64 libjsoncpp26 amd64 1.9.6-3 [81.7 kB]
Get:49 http://localhost:3142/debian unstable/main amd64 librhash1 amd64 1.4.5-1 [132 kB]
Get:50 http://localhost:3142/debian unstable/main amd64 libuv1t64 amd64 1.50.0-2 [154 kB]
Get:51 http://localhost:3142/debian unstable/main amd64 cmake amd64 3.31.6-1 [12.0 MB]
Get:52 http://localhost:3142/debian unstable/main amd64 gcc-14-powerpc64le-linux-gnu-base amd64 14.2.0-19cross1 [49.7 kB]
Get:53 http://localhost:3142/debian unstable/main amd64 cpp-14-powerpc64le-linux-gnu amd64 14.2.0-19cross1 [10.2 MB]
Get:54 http://localhost:3142/debian unstable/main amd64 cpp-powerpc64le-linux-gnu amd64 4:14.2.0-1 [4860 B]
Get:55 http://localhost:3142/debian unstable/main amd64 gcc-14-cross-base all 14.2.0-19cross1 [44.9 kB]
Get:56 http://localhost:3142/debian unstable/main amd64 libc6-ppc64el-cross all 2.41-6cross2 [1428 kB]
Get:57 http://localhost:3142/debian unstable/main amd64 libgcc-s1-ppc64el-cross all 14.2.0-19cross1 [35.5 kB]
Get:58 http://localhost:3142/debian unstable/main amd64 libgomp1-ppc64el-cross all 14.2.0-19cross1 [135 kB]
Get:59 http://localhost:3142/debian unstable/main amd64 libitm1-ppc64el-cross all 14.2.0-19cross1 [28.0 kB]
Get:60 http://localhost:3142/debian unstable/main amd64 libatomic1-ppc64el-cross all 14.2.0-19cross1 [9644 B]
Get:61 http://localhost:3142/debian unstable/main amd64 libasan8-ppc64el-cross all 14.2.0-19cross1 [2643 kB]
Get:62 http://localhost:3142/debian unstable/main amd64 liblsan0-ppc64el-cross all 14.2.0-19cross1 [1201 kB]
Get:63 http://localhost:3142/debian unstable/main amd64 libtsan2-ppc64el-cross all 14.2.0-19cross1 [2409 kB]
Get:64 http://localhost:3142/debian unstable/main amd64 libstdc++6-ppc64el-cross all 14.2.0-19cross1 [747 kB]
Get:65 http://localhost:3142/debian unstable/main amd64 libubsan1-ppc64el-cross all 14.2.0-19cross1 [1078 kB]
Get:66 http://localhost:3142/debian unstable/main amd64 libquadmath0-ppc64el-cross all 14.2.0-19cross1 [151 kB]
Get:67 http://localhost:3142/debian unstable/main amd64 libgcc-14-dev-ppc64el-cross all 14.2.0-19cross1 [1408 kB]
Get:68 http://localhost:3142/debian unstable/main amd64 gcc-14-powerpc64le-linux-gnu amd64 14.2.0-19cross1 [19.6 MB]
Get:69 http://localhost:3142/debian unstable/main amd64 gcc-powerpc64le-linux-gnu amd64 4:14.2.0-1 [1460 B]
Get:70 http://localhost:3142/debian unstable/main amd64 linux-libc-dev-ppc64el-cross all 6.12.17-1cross2 [2356 kB]
Get:71 http://localhost:3142/debian unstable/main amd64 libc6-dev-ppc64el-cross all 2.41-6cross2 [1896 kB]
Get:72 http://localhost:3142/debian unstable/main amd64 libstdc++-14-dev-ppc64el-cross all 14.2.0-19cross1 [2485 kB]
Get:73 http://localhost:3142/debian unstable/main amd64 g++-14-powerpc64le-linux-gnu amd64 14.2.0-19cross1 [11.2 MB]
Get:74 http://localhost:3142/debian unstable/main amd64 g++-powerpc64le-linux-gnu amd64 4:14.2.0-1 [1212 B]
Get:75 http://localhost:3142/debian unstable/main amd64 crossbuild-essential-ppc64el all 12.12 [3560 B]
Get:76 http://localhost:3142/debian unstable/main amd64 libdebhelper-perl all 13.24.1 [90.9 kB]
Get:77 http://localhost:3142/debian unstable/main amd64 libtool all 2.5.4-4 [539 kB]
Get:78 http://localhost:3142/debian unstable/main amd64 dh-autoreconf all 20 [17.1 kB]
Get:79 http://localhost:3142/debian unstable/main amd64 libarchive-zip-perl all 1.68-1 [104 kB]
Get:80 http://localhost:3142/debian unstable/main amd64 libfile-stripnondeterminism-perl all 1.14.1-2 [19.7 kB]
Get:81 http://localhost:3142/debian unstable/main amd64 dh-strip-nondeterminism all 1.14.1-2 [8620 B]
Get:82 http://localhost:3142/debian unstable/main amd64 libelf1t64 amd64 0.192-4 [189 kB]
Get:83 http://localhost:3142/debian unstable/main amd64 dwz amd64 0.15-1+b1 [110 kB]
Get:84 http://localhost:3142/debian unstable/main amd64 gettext amd64 0.23.1-1 [1680 kB]
Get:85 http://localhost:3142/debian unstable/main amd64 intltool-debian all 0.35.0+20060710.6 [22.9 kB]
Get:86 http://localhost:3142/debian unstable/main amd64 po-debconf all 1.0.21+nmu1 [248 kB]
Get:87 http://localhost:3142/debian unstable/main amd64 debhelper all 13.24.1 [920 kB]
Get:88 http://localhost:3142/debian unstable/main amd64 libfakeroot amd64 1.37.1-1 [29.5 kB]
Get:89 http://localhost:3142/debian unstable/main amd64 fakeroot amd64 1.37.1-1 [75.7 kB]
Get:90 http://localhost:3142/debian unstable/main ppc64el gcc-14-base ppc64el 14.2.0-19 [49.5 kB]
Get:91 http://localhost:3142/debian unstable/main ppc64el libgcc-s1 ppc64el 14.2.0-19 [35.5 kB]
Get:92 http://localhost:3142/debian unstable/main ppc64el libc6 ppc64el 2.41-6 [2761 kB]
Get:93 http://localhost:3142/debian unstable/main ppc64el libasan8 ppc64el 14.2.0-19 [2650 kB]
Get:94 http://localhost:3142/debian unstable/main ppc64el libatomic1 ppc64el 14.2.0-19 [9952 B]
Get:95 http://localhost:3142/debian unstable/main ppc64el libcrypt1 ppc64el 1:4.4.38-1 [98.0 kB]
Get:96 http://localhost:3142/debian unstable/main ppc64el libcrypt-dev ppc64el 1:4.4.38-1 [132 kB]
Get:97 http://localhost:3142/debian unstable/main ppc64el libc6-dev ppc64el 2.41-6 [1901 kB]
Get:98 http://localhost:3142/debian unstable/main ppc64el libcom-err2 ppc64el 1.47.2-1+b1 [24.7 kB]
Get:99 http://localhost:3142/debian unstable/main ppc64el libgomp1 ppc64el 14.2.0-19 [143 kB]
Get:100 http://localhost:3142/debian unstable/main ppc64el libitm1 ppc64el 14.2.0-19 [28.5 kB]
Get:101 http://localhost:3142/debian unstable/main ppc64el liblsan0 ppc64el 14.2.0-19 [1202 kB]
Get:102 http://localhost:3142/debian unstable/main ppc64el libtsan2 ppc64el 14.2.0-19 [2416 kB]
Get:103 http://localhost:3142/debian unstable/main ppc64el libstdc++6 ppc64el 14.2.0-19 [797 kB]
Get:104 http://localhost:3142/debian unstable/main ppc64el libubsan1 ppc64el 14.2.0-19 [1079 kB]
Get:105 http://localhost:3142/debian unstable/main ppc64el libquadmath0 ppc64el 14.2.0-19 [151 kB]
Get:106 http://localhost:3142/debian unstable/main ppc64el libgcc-14-dev ppc64el 14.2.0-19 [1409 kB]
Get:107 http://localhost:3142/debian unstable/main ppc64el libkrb5support0 ppc64el 1.21.3-5 [35.6 kB]
Get:108 http://localhost:3142/debian unstable/main ppc64el libk5crypto3 ppc64el 1.21.3-5 [90.8 kB]
Get:109 http://localhost:3142/debian unstable/main ppc64el libkeyutils1 ppc64el 1.6.3-4 [10.3 kB]
Get:110 http://localhost:3142/debian unstable/main ppc64el libzstd1 ppc64el 1.5.7+dfsg-1 [318 kB]
Get:111 http://localhost:3142/debian unstable/main ppc64el zlib1g ppc64el 1:1.3.dfsg+really1.3.1-1+b1 [87.4 kB]
Get:112 http://localhost:3142/debian unstable/main ppc64el libssl3t64 ppc64el 3.4.1-1 [2362 kB]
Get:113 http://localhost:3142/debian unstable/main ppc64el libkrb5-3 ppc64el 1.21.3-5 [356 kB]
Get:114 http://localhost:3142/debian unstable/main ppc64el libgssapi-krb5-2 ppc64el 1.21.3-5 [152 kB]
Get:115 http://localhost:3142/debian unstable/main amd64 libpkgconf3 amd64 1.8.1-4 [36.4 kB]
Get:116 http://localhost:3142/debian unstable/main ppc64el libstdc++-14-dev ppc64el 14.2.0-19 [2507 kB]
Get:117 http://localhost:3142/debian unstable/main amd64 libtirpc-common all 1.3.6+ds-1 [11.0 kB]
Get:118 http://localhost:3142/debian unstable/main ppc64el libtirpc3t64 ppc64el 1.3.6+ds-1 [93.8 kB]
Get:119 http://localhost:3142/debian unstable/main ppc64el libtirpc-dev ppc64el 1.3.6+ds-1 [206 kB]
Get:120 http://localhost:3142/debian unstable/main ppc64el libtommath1 ppc64el 1.3.0-1 [72.6 kB]
Get:121 http://localhost:3142/debian unstable/main ppc64el libtommath-dev ppc64el 1.3.0-1 [87.0 kB]
Get:122 http://localhost:3142/debian unstable/main amd64 pkgconf-bin amd64 1.8.1-4 [30.2 kB]
Get:123 http://localhost:3142/debian unstable/main ppc64el pkgconf ppc64el 1.8.1-4 [26.2 kB]
Preconfiguring packages ...
Fetched 123 MB in 1s (97.1 MB/s)
Selecting previously unselected package libncursesw6:amd64.
(Reading database ... 12838 files and directories currently installed.)
Preparing to unpack .../000-libncursesw6_6.5+20250216-2_amd64.deb ...
Unpacking libncursesw6:amd64 (6.5+20250216-2) ...
Selecting previously unselected package libproc2-0:amd64.
Preparing to unpack .../001-libproc2-0_2%3a4.0.4-7_amd64.deb ...
Unpacking libproc2-0:amd64 (2:4.0.4-7) ...
Selecting previously unselected package procps.
Preparing to unpack .../002-procps_2%3a4.0.4-7_amd64.deb ...
Unpacking procps (2:4.0.4-7) ...
Selecting previously unselected package sensible-utils.
Preparing to unpack .../003-sensible-utils_0.0.24_all.deb ...
Unpacking sensible-utils (0.0.24) ...
Selecting previously unselected package libmagic-mgc.
Preparing to unpack .../004-libmagic-mgc_1%3a5.46-2_amd64.deb ...
Unpacking libmagic-mgc (1:5.46-2) ...
Selecting previously unselected package libmagic1t64:amd64.
Preparing to unpack .../005-libmagic1t64_1%3a5.46-2_amd64.deb ...
Unpacking libmagic1t64:amd64 (1:5.46-2) ...
Selecting previously unselected package file.
Preparing to unpack .../006-file_1%3a5.46-2_amd64.deb ...
Unpacking file (1:5.46-2) ...
Selecting previously unselected package gettext-base.
Preparing to unpack .../007-gettext-base_0.23.1-1_amd64.deb ...
Unpacking gettext-base (0.23.1-1) ...
Selecting previously unselected package libuchardet0:amd64.
Preparing to unpack .../008-libuchardet0_0.0.8-1+b2_amd64.deb ...
Unpacking libuchardet0:amd64 (0.0.8-1+b2) ...
Selecting previously unselected package groff-base.
Preparing to unpack .../009-groff-base_1.23.0-7_amd64.deb ...
Unpacking groff-base (1.23.0-7) ...
Selecting previously unselected package bsdextrautils.
Preparing to unpack .../010-bsdextrautils_2.40.4-5_amd64.deb ...
Unpacking bsdextrautils (2.40.4-5) ...
Selecting previously unselected package libpipeline1:amd64.
Preparing to unpack .../011-libpipeline1_1.5.8-1_amd64.deb ...
Unpacking libpipeline1:amd64 (1.5.8-1) ...
Selecting previously unselected package man-db.
Preparing to unpack .../012-man-db_2.13.0-1_amd64.deb ...
Unpacking man-db (2.13.0-1) ...
Selecting previously unselected package m4.
Preparing to unpack .../013-m4_1.4.19-7_amd64.deb ...
Unpacking m4 (1.4.19-7) ...
Selecting previously unselected package autoconf.
Preparing to unpack .../014-autoconf_2.72-3_all.deb ...
Unpacking autoconf (2.72-3) ...
Selecting previously unselected package autotools-dev.
Preparing to unpack .../015-autotools-dev_20220109.1_all.deb ...
Unpacking autotools-dev (20220109.1) ...
Selecting previously unselected package automake.
Preparing to unpack .../016-automake_1%3a1.17-3_all.deb ...
Unpacking automake (1:1.17-3) ...
Selecting previously unselected package autopoint.
Preparing to unpack .../017-autopoint_0.23.1-1_all.deb ...
Unpacking autopoint (0.23.1-1) ...
Selecting previously unselected package binutils-powerpc64le-linux-gnu.
Preparing to unpack .../018-binutils-powerpc64le-linux-gnu_2.44-3_amd64.deb ...
Unpacking binutils-powerpc64le-linux-gnu (2.44-3) ...
Selecting previously unselected package cmake-data.
Preparing to unpack .../019-cmake-data_3.31.6-1_all.deb ...
Unpacking cmake-data (3.31.6-1) ...
Selecting previously unselected package libicu76:amd64.
Preparing to unpack .../020-libicu76_76.1-3_amd64.deb ...
Unpacking libicu76:amd64 (76.1-3) ...
Selecting previously unselected package libxml2:amd64.
Preparing to unpack .../021-libxml2_2.12.7+dfsg+really2.9.14-0.3+b1_amd64.deb ...
Unpacking libxml2:amd64 (2.12.7+dfsg+really2.9.14-0.3+b1) ...
Selecting previously unselected package libarchive13t64:amd64.
Preparing to unpack .../022-libarchive13t64_3.7.4-1.1_amd64.deb ...
Unpacking libarchive13t64:amd64 (3.7.4-1.1) ...
Selecting previously unselected package libbrotli1:amd64.
Preparing to unpack .../023-libbrotli1_1.1.0-2+b7_amd64.deb ...
Unpacking libbrotli1:amd64 (1.1.0-2+b7) ...
Selecting previously unselected package libkrb5support0:amd64.
Preparing to unpack .../024-libkrb5support0_1.21.3-5_amd64.deb ...
Unpacking libkrb5support0:amd64 (1.21.3-5) ...
Selecting previously unselected package libcom-err2:amd64.
Preparing to unpack .../025-libcom-err2_1.47.2-1+b1_amd64.deb ...
Unpacking libcom-err2:amd64 (1.47.2-1+b1) ...
Selecting previously unselected package libk5crypto3:amd64.
Preparing to unpack .../026-libk5crypto3_1.21.3-5_amd64.deb ...
Unpacking libk5crypto3:amd64 (1.21.3-5) ...
Selecting previously unselected package libkeyutils1:amd64.
Preparing to unpack .../027-libkeyutils1_1.6.3-4_amd64.deb ...
Unpacking libkeyutils1:amd64 (1.6.3-4) ...
Selecting previously unselected package libkrb5-3:amd64.
Preparing to unpack .../028-libkrb5-3_1.21.3-5_amd64.deb ...
Unpacking libkrb5-3:amd64 (1.21.3-5) ...
Selecting previously unselected package libgssapi-krb5-2:amd64.
Preparing to unpack .../029-libgssapi-krb5-2_1.21.3-5_amd64.deb ...
Unpacking libgssapi-krb5-2:amd64 (1.21.3-5) ...
Selecting previously unselected package libunistring5:amd64.
Preparing to unpack .../030-libunistring5_1.3-1_amd64.deb ...
Unpacking libunistring5:amd64 (1.3-1) ...
Selecting previously unselected package libidn2-0:amd64.
Preparing to unpack .../031-libidn2-0_2.3.8-2_amd64.deb ...
Unpacking libidn2-0:amd64 (2.3.8-2) ...
Selecting previously unselected package libsasl2-modules-db:amd64.
Preparing to unpack .../032-libsasl2-modules-db_2.1.28+dfsg1-9_amd64.deb ...
Unpacking libsasl2-modules-db:amd64 (2.1.28+dfsg1-9) ...
Selecting previously unselected package libsasl2-2:amd64.
Preparing to unpack .../033-libsasl2-2_2.1.28+dfsg1-9_amd64.deb ...
Unpacking libsasl2-2:amd64 (2.1.28+dfsg1-9) ...
Selecting previously unselected package libldap2:amd64.
Preparing to unpack .../034-libldap2_2.6.9+dfsg-2_amd64.deb ...
Unpacking libldap2:amd64 (2.6.9+dfsg-2) ...
Selecting previously unselected package libnghttp2-14:amd64.
Preparing to unpack .../035-libnghttp2-14_1.64.0-1_amd64.deb ...
Unpacking libnghttp2-14:amd64 (1.64.0-1) ...
Selecting previously unselected package libnghttp3-9:amd64.
Preparing to unpack .../036-libnghttp3-9_1.8.0-1_amd64.deb ...
Unpacking libnghttp3-9:amd64 (1.8.0-1) ...
Selecting previously unselected package libpsl5t64:amd64.
Preparing to unpack .../037-libpsl5t64_0.21.2-1.1+b1_amd64.deb ...
Unpacking libpsl5t64:amd64 (0.21.2-1.1+b1) ...
Selecting previously unselected package libffi8:amd64.
Preparing to unpack .../038-libffi8_3.4.7-1_amd64.deb ...
Unpacking libffi8:amd64 (3.4.7-1) ...
Selecting previously unselected package libp11-kit0:amd64.
Preparing to unpack .../039-libp11-kit0_0.25.5-3_amd64.deb ...
Unpacking libp11-kit0:amd64 (0.25.5-3) ...
Selecting previously unselected package libtasn1-6:amd64.
Preparing to unpack .../040-libtasn1-6_4.20.0-2_amd64.deb ...
Unpacking libtasn1-6:amd64 (4.20.0-2) ...
Selecting previously unselected package libgnutls30t64:amd64.
Preparing to unpack .../041-libgnutls30t64_3.8.9-2_amd64.deb ...
Unpacking libgnutls30t64:amd64 (3.8.9-2) ...
Selecting previously unselected package librtmp1:amd64.
Preparing to unpack .../042-librtmp1_2.4+20151223.gitfa8646d.1-2+b5_amd64.deb ...
Unpacking librtmp1:amd64 (2.4+20151223.gitfa8646d.1-2+b5) ...
Selecting previously unselected package libssh2-1t64:amd64.
Preparing to unpack .../043-libssh2-1t64_1.11.1-1_amd64.deb ...
Unpacking libssh2-1t64:amd64 (1.11.1-1) ...
Selecting previously unselected package libcurl4t64:amd64.
Preparing to unpack .../044-libcurl4t64_8.13.0~rc2-1_amd64.deb ...
Unpacking libcurl4t64:amd64 (8.13.0~rc2-1) ...
Selecting previously unselected package libexpat1:amd64.
Preparing to unpack .../045-libexpat1_2.7.0-1_amd64.deb ...
Unpacking libexpat1:amd64 (2.7.0-1) ...
Selecting previously unselected package libjsoncpp26:amd64.
Preparing to unpack .../046-libjsoncpp26_1.9.6-3_amd64.deb ...
Unpacking libjsoncpp26:amd64 (1.9.6-3) ...
Selecting previously unselected package librhash1:amd64.
Preparing to unpack .../047-librhash1_1.4.5-1_amd64.deb ...
Unpacking librhash1:amd64 (1.4.5-1) ...
Selecting previously unselected package libuv1t64:amd64.
Preparing to unpack .../048-libuv1t64_1.50.0-2_amd64.deb ...
Unpacking libuv1t64:amd64 (1.50.0-2) ...
Selecting previously unselected package cmake.
Preparing to unpack .../049-cmake_3.31.6-1_amd64.deb ...
Unpacking cmake (3.31.6-1) ...
Selecting previously unselected package gcc-14-powerpc64le-linux-gnu-base:amd64.
Preparing to unpack .../050-gcc-14-powerpc64le-linux-gnu-base_14.2.0-19cross1_amd64.deb ...
Unpacking gcc-14-powerpc64le-linux-gnu-base:amd64 (14.2.0-19cross1) ...
Selecting previously unselected package cpp-14-powerpc64le-linux-gnu.
Preparing to unpack .../051-cpp-14-powerpc64le-linux-gnu_14.2.0-19cross1_amd64.deb ...
Unpacking cpp-14-powerpc64le-linux-gnu (14.2.0-19cross1) ...
Selecting previously unselected package cpp-powerpc64le-linux-gnu.
Preparing to unpack .../052-cpp-powerpc64le-linux-gnu_4%3a14.2.0-1_amd64.deb ...
Unpacking cpp-powerpc64le-linux-gnu (4:14.2.0-1) ...
Selecting previously unselected package gcc-14-cross-base.
Preparing to unpack .../053-gcc-14-cross-base_14.2.0-19cross1_all.deb ...
Unpacking gcc-14-cross-base (14.2.0-19cross1) ...
Selecting previously unselected package libc6-ppc64el-cross.
Preparing to unpack .../054-libc6-ppc64el-cross_2.41-6cross2_all.deb ...
Unpacking libc6-ppc64el-cross (2.41-6cross2) ...
Selecting previously unselected package libgcc-s1-ppc64el-cross.
Preparing to unpack .../055-libgcc-s1-ppc64el-cross_14.2.0-19cross1_all.deb ...
Unpacking libgcc-s1-ppc64el-cross (14.2.0-19cross1) ...
Selecting previously unselected package libgomp1-ppc64el-cross.
Preparing to unpack .../056-libgomp1-ppc64el-cross_14.2.0-19cross1_all.deb ...
Unpacking libgomp1-ppc64el-cross (14.2.0-19cross1) ...
Selecting previously unselected package libitm1-ppc64el-cross.
Preparing to unpack .../057-libitm1-ppc64el-cross_14.2.0-19cross1_all.deb ...
Unpacking libitm1-ppc64el-cross (14.2.0-19cross1) ...
Selecting previously unselected package libatomic1-ppc64el-cross.
Preparing to unpack .../058-libatomic1-ppc64el-cross_14.2.0-19cross1_all.deb ...
Unpacking libatomic1-ppc64el-cross (14.2.0-19cross1) ...
Selecting previously unselected package libasan8-ppc64el-cross.
Preparing to unpack .../059-libasan8-ppc64el-cross_14.2.0-19cross1_all.deb ...
Unpacking libasan8-ppc64el-cross (14.2.0-19cross1) ...
Selecting previously unselected package liblsan0-ppc64el-cross.
Preparing to unpack .../060-liblsan0-ppc64el-cross_14.2.0-19cross1_all.deb ...
Unpacking liblsan0-ppc64el-cross (14.2.0-19cross1) ...
Selecting previously unselected package libtsan2-ppc64el-cross.
Preparing to unpack .../061-libtsan2-ppc64el-cross_14.2.0-19cross1_all.deb ...
Unpacking libtsan2-ppc64el-cross (14.2.0-19cross1) ...
Selecting previously unselected package libstdc++6-ppc64el-cross.
Preparing to unpack .../062-libstdc++6-ppc64el-cross_14.2.0-19cross1_all.deb ...
Unpacking libstdc++6-ppc64el-cross (14.2.0-19cross1) ...
Selecting previously unselected package libubsan1-ppc64el-cross.
Preparing to unpack .../063-libubsan1-ppc64el-cross_14.2.0-19cross1_all.deb ...
Unpacking libubsan1-ppc64el-cross (14.2.0-19cross1) ...
Selecting previously unselected package libquadmath0-ppc64el-cross.
Preparing to unpack .../064-libquadmath0-ppc64el-cross_14.2.0-19cross1_all.deb ...
Unpacking libquadmath0-ppc64el-cross (14.2.0-19cross1) ...
Selecting previously unselected package libgcc-14-dev-ppc64el-cross.
Preparing to unpack .../065-libgcc-14-dev-ppc64el-cross_14.2.0-19cross1_all.deb ...
Unpacking libgcc-14-dev-ppc64el-cross (14.2.0-19cross1) ...
Selecting previously unselected package gcc-14-powerpc64le-linux-gnu.
Preparing to unpack .../066-gcc-14-powerpc64le-linux-gnu_14.2.0-19cross1_amd64.deb ...
Unpacking gcc-14-powerpc64le-linux-gnu (14.2.0-19cross1) ...
Selecting previously unselected package gcc-powerpc64le-linux-gnu.
Preparing to unpack .../067-gcc-powerpc64le-linux-gnu_4%3a14.2.0-1_amd64.deb ...
Unpacking gcc-powerpc64le-linux-gnu (4:14.2.0-1) ...
Selecting previously unselected package linux-libc-dev-ppc64el-cross.
Preparing to unpack .../068-linux-libc-dev-ppc64el-cross_6.12.17-1cross2_all.deb ...
Unpacking linux-libc-dev-ppc64el-cross (6.12.17-1cross2) ...
Selecting previously unselected package libc6-dev-ppc64el-cross.
Preparing to unpack .../069-libc6-dev-ppc64el-cross_2.41-6cross2_all.deb ...
Unpacking libc6-dev-ppc64el-cross (2.41-6cross2) ...
Selecting previously unselected package libstdc++-14-dev-ppc64el-cross.
Preparing to unpack .../070-libstdc++-14-dev-ppc64el-cross_14.2.0-19cross1_all.deb ...
Unpacking libstdc++-14-dev-ppc64el-cross (14.2.0-19cross1) ...
Selecting previously unselected package g++-14-powerpc64le-linux-gnu.
Preparing to unpack .../071-g++-14-powerpc64le-linux-gnu_14.2.0-19cross1_amd64.deb ...
Unpacking g++-14-powerpc64le-linux-gnu (14.2.0-19cross1) ...
Selecting previously unselected package g++-powerpc64le-linux-gnu.
Preparing to unpack .../072-g++-powerpc64le-linux-gnu_4%3a14.2.0-1_amd64.deb ...
Unpacking g++-powerpc64le-linux-gnu (4:14.2.0-1) ...
Selecting previously unselected package crossbuild-essential-ppc64el.
Preparing to unpack .../073-crossbuild-essential-ppc64el_12.12_all.deb ...
Unpacking crossbuild-essential-ppc64el (12.12) ...
Selecting previously unselected package libdebhelper-perl.
Preparing to unpack .../074-libdebhelper-perl_13.24.1_all.deb ...
Unpacking libdebhelper-perl (13.24.1) ...
Selecting previously unselected package libtool.
Preparing to unpack .../075-libtool_2.5.4-4_all.deb ...
Unpacking libtool (2.5.4-4) ...
Selecting previously unselected package dh-autoreconf.
Preparing to unpack .../076-dh-autoreconf_20_all.deb ...
Unpacking dh-autoreconf (20) ...
Selecting previously unselected package libarchive-zip-perl.
Preparing to unpack .../077-libarchive-zip-perl_1.68-1_all.deb ...
Unpacking libarchive-zip-perl (1.68-1) ...
Selecting previously unselected package libfile-stripnondeterminism-perl.
Preparing to unpack .../078-libfile-stripnondeterminism-perl_1.14.1-2_all.deb ...
Unpacking libfile-stripnondeterminism-perl (1.14.1-2) ...
Selecting previously unselected package dh-strip-nondeterminism.
Preparing to unpack .../079-dh-strip-nondeterminism_1.14.1-2_all.deb ...
Unpacking dh-strip-nondeterminism (1.14.1-2) ...
Selecting previously unselected package libelf1t64:amd64.
Preparing to unpack .../080-libelf1t64_0.192-4_amd64.deb ...
Unpacking libelf1t64:amd64 (0.192-4) ...
Selecting previously unselected package dwz.
Preparing to unpack .../081-dwz_0.15-1+b1_amd64.deb ...
Unpacking dwz (0.15-1+b1) ...
Selecting previously unselected package gettext.
Preparing to unpack .../082-gettext_0.23.1-1_amd64.deb ...
Unpacking gettext (0.23.1-1) ...
Selecting previously unselected package intltool-debian.
Preparing to unpack .../083-intltool-debian_0.35.0+20060710.6_all.deb ...
Unpacking intltool-debian (0.35.0+20060710.6) ...
Selecting previously unselected package po-debconf.
Preparing to unpack .../084-po-debconf_1.0.21+nmu1_all.deb ...
Unpacking po-debconf (1.0.21+nmu1) ...
Selecting previously unselected package debhelper.
Preparing to unpack .../085-debhelper_13.24.1_all.deb ...
Unpacking debhelper (13.24.1) ...
Selecting previously unselected package libfakeroot:amd64.
Preparing to unpack .../086-libfakeroot_1.37.1-1_amd64.deb ...
Unpacking libfakeroot:amd64 (1.37.1-1) ...
Selecting previously unselected package fakeroot.
Preparing to unpack .../087-fakeroot_1.37.1-1_amd64.deb ...
Unpacking fakeroot (1.37.1-1) ...
Selecting previously unselected package gcc-14-base:ppc64el.
Preparing to unpack .../088-gcc-14-base_14.2.0-19_ppc64el.deb ...
Unpacking gcc-14-base:ppc64el (14.2.0-19) ...
Selecting previously unselected package libgcc-s1:ppc64el.
Preparing to unpack .../089-libgcc-s1_14.2.0-19_ppc64el.deb ...
Unpacking libgcc-s1:ppc64el (14.2.0-19) ...
Selecting previously unselected package libc6:ppc64el.
Preparing to unpack .../090-libc6_2.41-6_ppc64el.deb ...
Unpacking libc6:ppc64el (2.41-6) ...
Selecting previously unselected package libasan8:ppc64el.
Preparing to unpack .../091-libasan8_14.2.0-19_ppc64el.deb ...
Unpacking libasan8:ppc64el (14.2.0-19) ...
Selecting previously unselected package libatomic1:ppc64el.
Preparing to unpack .../092-libatomic1_14.2.0-19_ppc64el.deb ...
Unpacking libatomic1:ppc64el (14.2.0-19) ...
Selecting previously unselected package libcrypt1:ppc64el.
Preparing to unpack .../093-libcrypt1_1%3a4.4.38-1_ppc64el.deb ...
Unpacking libcrypt1:ppc64el (1:4.4.38-1) ...
Selecting previously unselected package libcrypt-dev:ppc64el.
Preparing to unpack .../094-libcrypt-dev_1%3a4.4.38-1_ppc64el.deb ...
Unpacking libcrypt-dev:ppc64el (1:4.4.38-1) ...
Selecting previously unselected package libc6-dev:ppc64el.
Preparing to unpack .../095-libc6-dev_2.41-6_ppc64el.deb ...
Unpacking libc6-dev:ppc64el (2.41-6) ...
Selecting previously unselected package libcom-err2:ppc64el.
Preparing to unpack .../096-libcom-err2_1.47.2-1+b1_ppc64el.deb ...
Unpacking libcom-err2:ppc64el (1.47.2-1+b1) ...
Selecting previously unselected package libgomp1:ppc64el.
Preparing to unpack .../097-libgomp1_14.2.0-19_ppc64el.deb ...
Unpacking libgomp1:ppc64el (14.2.0-19) ...
Selecting previously unselected package libitm1:ppc64el.
Preparing to unpack .../098-libitm1_14.2.0-19_ppc64el.deb ...
Unpacking libitm1:ppc64el (14.2.0-19) ...
Selecting previously unselected package liblsan0:ppc64el.
Preparing to unpack .../099-liblsan0_14.2.0-19_ppc64el.deb ...
Unpacking liblsan0:ppc64el (14.2.0-19) ...
Selecting previously unselected package libtsan2:ppc64el.
Preparing to unpack .../100-libtsan2_14.2.0-19_ppc64el.deb ...
Unpacking libtsan2:ppc64el (14.2.0-19) ...
Selecting previously unselected package libstdc++6:ppc64el.
Preparing to unpack .../101-libstdc++6_14.2.0-19_ppc64el.deb ...
Unpacking libstdc++6:ppc64el (14.2.0-19) ...
Selecting previously unselected package libubsan1:ppc64el.
Preparing to unpack .../102-libubsan1_14.2.0-19_ppc64el.deb ...
Unpacking libubsan1:ppc64el (14.2.0-19) ...
Selecting previously unselected package libquadmath0:ppc64el.
Preparing to unpack .../103-libquadmath0_14.2.0-19_ppc64el.deb ...
Unpacking libquadmath0:ppc64el (14.2.0-19) ...
Selecting previously unselected package libgcc-14-dev:ppc64el.
Preparing to unpack .../104-libgcc-14-dev_14.2.0-19_ppc64el.deb ...
Unpacking libgcc-14-dev:ppc64el (14.2.0-19) ...
Selecting previously unselected package libkrb5support0:ppc64el.
Preparing to unpack .../105-libkrb5support0_1.21.3-5_ppc64el.deb ...
Unpacking libkrb5support0:ppc64el (1.21.3-5) ...
Selecting previously unselected package libk5crypto3:ppc64el.
Preparing to unpack .../106-libk5crypto3_1.21.3-5_ppc64el.deb ...
Unpacking libk5crypto3:ppc64el (1.21.3-5) ...
Selecting previously unselected package libkeyutils1:ppc64el.
Preparing to unpack .../107-libkeyutils1_1.6.3-4_ppc64el.deb ...
Unpacking libkeyutils1:ppc64el (1.6.3-4) ...
Selecting previously unselected package libzstd1:ppc64el.
Preparing to unpack .../108-libzstd1_1.5.7+dfsg-1_ppc64el.deb ...
Unpacking libzstd1:ppc64el (1.5.7+dfsg-1) ...
Selecting previously unselected package zlib1g:ppc64el.
Preparing to unpack .../109-zlib1g_1%3a1.3.dfsg+really1.3.1-1+b1_ppc64el.deb ...
Unpacking zlib1g:ppc64el (1:1.3.dfsg+really1.3.1-1+b1) ...
Selecting previously unselected package libssl3t64:ppc64el.
Preparing to unpack .../110-libssl3t64_3.4.1-1_ppc64el.deb ...
Unpacking libssl3t64:ppc64el (3.4.1-1) ...
Selecting previously unselected package libkrb5-3:ppc64el.
Preparing to unpack .../111-libkrb5-3_1.21.3-5_ppc64el.deb ...
Unpacking libkrb5-3:ppc64el (1.21.3-5) ...
Selecting previously unselected package libgssapi-krb5-2:ppc64el.
Preparing to unpack .../112-libgssapi-krb5-2_1.21.3-5_ppc64el.deb ...
Unpacking libgssapi-krb5-2:ppc64el (1.21.3-5) ...
Selecting previously unselected package libpkgconf3:amd64.
Preparing to unpack .../113-libpkgconf3_1.8.1-4_amd64.deb ...
Unpacking libpkgconf3:amd64 (1.8.1-4) ...
Selecting previously unselected package libstdc++-14-dev:ppc64el.
Preparing to unpack .../114-libstdc++-14-dev_14.2.0-19_ppc64el.deb ...
Unpacking libstdc++-14-dev:ppc64el (14.2.0-19) ...
Selecting previously unselected package libtirpc-common.
Preparing to unpack .../115-libtirpc-common_1.3.6+ds-1_all.deb ...
Unpacking libtirpc-common (1.3.6+ds-1) ...
Selecting previously unselected package libtirpc3t64:ppc64el.
Preparing to unpack .../116-libtirpc3t64_1.3.6+ds-1_ppc64el.deb ...
Adding 'diversion of /lib/powerpc64le-linux-gnu/libtirpc.so.3 to /lib/powerpc64le-linux-gnu/libtirpc.so.3.usr-is-merged by libtirpc3t64'
Adding 'diversion of /lib/powerpc64le-linux-gnu/libtirpc.so.3.0.0 to /lib/powerpc64le-linux-gnu/libtirpc.so.3.0.0.usr-is-merged by libtirpc3t64'
Unpacking libtirpc3t64:ppc64el (1.3.6+ds-1) ...
Selecting previously unselected package libtirpc-dev:ppc64el.
Preparing to unpack .../117-libtirpc-dev_1.3.6+ds-1_ppc64el.deb ...
Unpacking libtirpc-dev:ppc64el (1.3.6+ds-1) ...
Selecting previously unselected package libtommath1:ppc64el.
Preparing to unpack .../118-libtommath1_1.3.0-1_ppc64el.deb ...
Unpacking libtommath1:ppc64el (1.3.0-1) ...
Selecting previously unselected package libtommath-dev:ppc64el.
Preparing to unpack .../119-libtommath-dev_1.3.0-1_ppc64el.deb ...
Unpacking libtommath-dev:ppc64el (1.3.0-1) ...
Selecting previously unselected package pkgconf-bin.
Preparing to unpack .../120-pkgconf-bin_1.8.1-4_amd64.deb ...
Unpacking pkgconf-bin (1.8.1-4) ...
Selecting previously unselected package pkgconf:ppc64el.
Preparing to unpack .../121-pkgconf_1.8.1-4_ppc64el.deb ...
Unpacking pkgconf:ppc64el (1.8.1-4) ...
Selecting previously unselected package sbuild-build-depends-main-dummy:ppc64el.
Preparing to unpack .../122-sbuild-build-depends-main-dummy_0.invalid.0_ppc64el.deb ...
Unpacking sbuild-build-depends-main-dummy:ppc64el (0.invalid.0) ...
Setting up libexpat1:amd64 (2.7.0-1) ...
Setting up libpipeline1:amd64 (1.5.8-1) ...
Setting up libkeyutils1:amd64 (1.6.3-4) ...
Setting up bsdextrautils (2.40.4-5) ...
Setting up gcc-14-powerpc64le-linux-gnu-base:amd64 (14.2.0-19cross1) ...
Setting up libmagic-mgc (1:5.46-2) ...
Setting up gcc-14-base:ppc64el (14.2.0-19) ...
Setting up libarchive-zip-perl (1.68-1) ...
Setting up libtirpc-common (1.3.6+ds-1) ...
Setting up libc6-ppc64el-cross (2.41-6cross2) ...
Setting up libdebhelper-perl (13.24.1) ...
Setting up libbrotli1:amd64 (1.1.0-2+b7) ...
Setting up libuv1t64:amd64 (1.50.0-2) ...
Setting up libmagic1t64:amd64 (1:5.46-2) ...
Setting up libnghttp2-14:amd64 (1.64.0-1) ...
Setting up gettext-base (0.23.1-1) ...
Setting up m4 (1.4.19-7) ...
Setting up gcc-14-cross-base (14.2.0-19cross1) ...
Setting up libcom-err2:amd64 (1.47.2-1+b1) ...
Setting up file (1:5.46-2) ...
Setting up libgomp1-ppc64el-cross (14.2.0-19cross1) ...
Setting up libfakeroot:amd64 (1.37.1-1) ...
Setting up libelf1t64:amd64 (0.192-4) ...
Setting up libkrb5support0:amd64 (1.21.3-5) ...
Setting up libsasl2-modules-db:amd64 (2.1.28+dfsg1-9) ...
Setting up fakeroot (1.37.1-1) ...
update-alternatives: using /usr/bin/fakeroot-sysv to provide /usr/bin/fakeroot (fakeroot) in auto mode
Setting up autotools-dev (20220109.1) ...
Setting up libpkgconf3:amd64 (1.8.1-4) ...
Setting up libjsoncpp26:amd64 (1.9.6-3) ...
Setting up libproc2-0:amd64 (2:4.0.4-7) ...
Setting up libunistring5:amd64 (1.3-1) ...
Setting up autopoint (0.23.1-1) ...
Setting up pkgconf-bin (1.8.1-4) ...
Setting up cpp-14-powerpc64le-linux-gnu (14.2.0-19cross1) ...
Setting up libncursesw6:amd64 (6.5+20250216-2) ...
Setting up libk5crypto3:amd64 (1.21.3-5) ...
Setting up libsasl2-2:amd64 (2.1.28+dfsg1-9) ...
Setting up autoconf (2.72-3) ...
Setting up libnghttp3-9:amd64 (1.8.0-1) ...
Setting up libitm1-ppc64el-cross (14.2.0-19cross1) ...
Setting up libffi8:amd64 (3.4.7-1) ...
Setting up libatomic1-ppc64el-cross (14.2.0-19cross1) ...
Setting up dwz (0.15-1+b1) ...
Setting up sensible-utils (0.0.24) ...
Setting up libuchardet0:amd64 (0.0.8-1+b2) ...
Setting up linux-libc-dev-ppc64el-cross (6.12.17-1cross2) ...
Setting up procps (2:4.0.4-7) ...
Setting up libtasn1-6:amd64 (4.20.0-2) ...
Setting up cmake-data (3.31.6-1) ...
Setting up librhash1:amd64 (1.4.5-1) ...
Setting up libgcc-s1-ppc64el-cross (14.2.0-19cross1) ...
Setting up libkrb5-3:amd64 (1.21.3-5) ...
Setting up libicu76:amd64 (76.1-3) ...
Setting up libssh2-1t64:amd64 (1.11.1-1) ...
Setting up binutils-powerpc64le-linux-gnu (2.44-3) ...
Setting up libxml2:amd64 (2.12.7+dfsg+really2.9.14-0.3+b1) ...
Setting up libldap2:amd64 (2.6.9+dfsg-2) ...
Setting up cpp-powerpc64le-linux-gnu (4:14.2.0-1) ...
Setting up automake (1:1.17-3) ...
update-alternatives: using /usr/bin/automake-1.17 to provide /usr/bin/automake (automake) in auto mode
Setting up libfile-stripnondeterminism-perl (1.14.1-2) ...
Setting up gettext (0.23.1-1) ...
Setting up libc6-dev-ppc64el-cross (2.41-6cross2) ...
Setting up libtool (2.5.4-4) ...
Setting up libquadmath0-ppc64el-cross (14.2.0-19cross1) ...
Setting up libasan8-ppc64el-cross (14.2.0-19cross1) ...
Setting up libidn2-0:amd64 (2.3.8-2) ...
Setting up liblsan0-ppc64el-cross (14.2.0-19cross1) ...
Setting up pkgconf:ppc64el (1.8.1-4) ...
Setting up intltool-debian (0.35.0+20060710.6) ...
Setting up libtsan2-ppc64el-cross (14.2.0-19cross1) ...
Setting up dh-autoreconf (20) ...
Setting up libp11-kit0:amd64 (0.25.5-3) ...
Setting up libgssapi-krb5-2:amd64 (1.21.3-5) ...
Setting up libstdc++6-ppc64el-cross (14.2.0-19cross1) ...
Setting up dh-strip-nondeterminism (1.14.1-2) ...
Setting up groff-base (1.23.0-7) ...
Setting up libarchive13t64:amd64 (3.7.4-1.1) ...
Setting up libgnutls30t64:amd64 (3.8.9-2) ...
Setting up libubsan1-ppc64el-cross (14.2.0-19cross1) ...
Setting up po-debconf (1.0.21+nmu1) ...
Setting up libpsl5t64:amd64 (0.21.2-1.1+b1) ...
Setting up man-db (2.13.0-1) ...
Not building database; man-db/auto-update is not 'true'.
Setting up librtmp1:amd64 (2.4+20151223.gitfa8646d.1-2+b5) ...
Setting up libgcc-14-dev-ppc64el-cross (14.2.0-19cross1) ...
Setting up libstdc++-14-dev-ppc64el-cross (14.2.0-19cross1) ...
Setting up gcc-14-powerpc64le-linux-gnu (14.2.0-19cross1) ...
Setting up g++-14-powerpc64le-linux-gnu (14.2.0-19cross1) ...
Setting up libcurl4t64:amd64 (8.13.0~rc2-1) ...
Setting up debhelper (13.24.1) ...
Setting up gcc-powerpc64le-linux-gnu (4:14.2.0-1) ...
Setting up cmake (3.31.6-1) ...
Setting up g++-powerpc64le-linux-gnu (4:14.2.0-1) ...
Setting up crossbuild-essential-ppc64el (12.12) ...
Setting up libgcc-s1:ppc64el (14.2.0-19) ...
Setting up libc6:ppc64el (2.41-6) ...
Setting up libasan8:ppc64el (14.2.0-19) ...
Setting up libtsan2:ppc64el (14.2.0-19) ...
Setting up libstdc++6:ppc64el (14.2.0-19) ...
Setting up liblsan0:ppc64el (14.2.0-19) ...
Setting up libitm1:ppc64el (14.2.0-19) ...
Setting up libzstd1:ppc64el (1.5.7+dfsg-1) ...
Setting up libkeyutils1:ppc64el (1.6.3-4) ...
Setting up libtommath1:ppc64el (1.3.0-1) ...
Setting up zlib1g:ppc64el (1:1.3.dfsg+really1.3.1-1+b1) ...
Setting up libcrypt1:ppc64el (1:4.4.38-1) ...
Setting up libcom-err2:ppc64el (1.47.2-1+b1) ...
Setting up libgomp1:ppc64el (14.2.0-19) ...
Setting up libkrb5support0:ppc64el (1.21.3-5) ...
Setting up libtommath-dev:ppc64el (1.3.0-1) ...
Setting up libquadmath0:ppc64el (14.2.0-19) ...
Setting up libatomic1:ppc64el (14.2.0-19) ...
Setting up libk5crypto3:ppc64el (1.21.3-5) ...
Setting up libubsan1:ppc64el (14.2.0-19) ...
Setting up libcrypt-dev:ppc64el (1:4.4.38-1) ...
Setting up libc6-dev:ppc64el (2.41-6) ...
Setting up libgcc-14-dev:ppc64el (14.2.0-19) ...
Setting up libstdc++-14-dev:ppc64el (14.2.0-19) ...
Setting up libssl3t64:ppc64el (3.4.1-1) ...
Setting up libkrb5-3:ppc64el (1.21.3-5) ...
Setting up libgssapi-krb5-2:ppc64el (1.21.3-5) ...
Setting up libtirpc3t64:ppc64el (1.3.6+ds-1) ...
Setting up libtirpc-dev:ppc64el (1.3.6+ds-1) ...
Setting up sbuild-build-depends-main-dummy:ppc64el (0.invalid.0) ...
Processing triggers for libc-bin (2.41-6) ...

+------------------------------------------------------------------------------+
| Check architectures                                                          |
+------------------------------------------------------------------------------+

Arch check ok (ppc64el included in any)

+------------------------------------------------------------------------------+
| Build environment                                                            |
+------------------------------------------------------------------------------+

Kernel: Linux 6.1.0-31-amd64 #1 SMP PREEMPT_DYNAMIC Debian 6.1.128-1 (2025-02-07) amd64 (x86_64)
Toolchain package versions: binutils_2.44-3 dpkg-dev_1.22.18 g++-14_14.2.0-19 gcc-14_14.2.0-19 libc6-dev_2.41-6 libstdc++-14-dev_14.2.0-19 libstdc++-14-dev-ppc64el-cross_14.2.0-19cross1 libstdc++6_14.2.0-19 libstdc++6-ppc64el-cross_14.2.0-19cross1 linux-libc-dev_6.12.19-1
Package versions: apt_2.9.33 apt-utils_2.9.33 autoconf_2.72-3 automake_1:1.17-3 autopoint_0.23.1-1 autotools-dev_20220109.1 base-files_13.7 base-passwd_3.6.6 bash_5.2.37-1.1+b1 binutils_2.44-3 binutils-common_2.44-3 binutils-powerpc64le-linux-gnu_2.44-3 binutils-x86-64-linux-gnu_2.44-3 bsdextrautils_2.40.4-5 bsdutils_1:2.40.4-5 build-essential_12.12 bzip2_1.0.8-6 cmake_3.31.6-1 cmake-data_3.31.6-1 coreutils_9.5-1+b1 cpp_4:14.2.0-1 cpp-14_14.2.0-19 cpp-14-powerpc64le-linux-gnu_14.2.0-19cross1 cpp-14-x86-64-linux-gnu_14.2.0-19 cpp-powerpc64le-linux-gnu_4:14.2.0-1 cpp-x86-64-linux-gnu_4:14.2.0-1 crossbuild-essential-ppc64el_12.12 dash_0.5.12-12 debconf_1.5.91 debhelper_13.24.1 debian-archive-keyring_2023.4 debianutils_5.21 dh-autoreconf_20 dh-strip-nondeterminism_1.14.1-2 diffutils_1:3.10-3 dpkg_1.22.18 dpkg-dev_1.22.18 dwz_0.15-1+b1 fakeroot_1.37.1-1 file_1:5.46-2 findutils_4.10.0-3 g++_4:14.2.0-1 g++-14_14.2.0-19 g++-14-powerpc64le-linux-gnu_14.2.0-19cross1 g++-14-x86-64-linux-gnu_14.2.0-19 g++-powerpc64le-linux-gnu_4:14.2.0-1 g++-x86-64-linux-gnu_4:14.2.0-1 gcc_4:14.2.0-1 gcc-14_14.2.0-19 gcc-14-base_14.2.0-19 gcc-14-cross-base_14.2.0-19cross1 gcc-14-powerpc64le-linux-gnu_14.2.0-19cross1 gcc-14-powerpc64le-linux-gnu-base_14.2.0-19cross1 gcc-14-x86-64-linux-gnu_14.2.0-19 gcc-powerpc64le-linux-gnu_4:14.2.0-1 gcc-x86-64-linux-gnu_4:14.2.0-1 gettext_0.23.1-1 gettext-base_0.23.1-1 grep_3.11-4 groff-base_1.23.0-7 gzip_1.13-1 hostname_3.25 init-system-helpers_1.68 intltool-debian_0.35.0+20060710.6 libacl1_2.3.2-2+b1 libapt-pkg7.0_2.9.33 libarchive-zip-perl_1.68-1 libarchive13t64_3.7.4-1.1 libasan8_14.2.0-19 libasan8-ppc64el-cross_14.2.0-19cross1 libatomic1_14.2.0-19 libatomic1-ppc64el-cross_14.2.0-19cross1 libattr1_1:2.5.2-3 libaudit-common_1:4.0.2-2 libaudit1_1:4.0.2-2+b2 libbinutils_2.44-3 libblkid1_2.40.4-5 libbrotli1_1.1.0-2+b7 libbsd0_0.12.2-2 libbz2-1.0_1.0.8-6 libc-bin_2.41-6 libc-dev-bin_2.41-6 libc6_2.41-6 libc6-dev_2.41-6 libc6-dev-ppc64el-cross_2.41-6cross2 libc6-ppc64el-cross_2.41-6cross2 libcap-ng0_0.8.5-4+b1 libcap2_1:2.75-2 libcc1-0_14.2.0-19 libcom-err2_1.47.2-1+b1 libcrypt-dev_1:4.4.38-1 libcrypt1_1:4.4.38-1 libctf-nobfd0_2.44-3 libctf0_2.44-3 libcurl4t64_8.13.0~rc2-1 libdb5.3t64_5.3.28+dfsg2-9 libdebconfclient0_0.277 libdebhelper-perl_13.24.1 libdpkg-perl_1.22.18 libelf1t64_0.192-4 libexpat1_2.7.0-1 libfakeroot_1.37.1-1 libffi8_3.4.7-1 libfile-stripnondeterminism-perl_1.14.1-2 libgcc-14-dev_14.2.0-19 libgcc-14-dev-ppc64el-cross_14.2.0-19cross1 libgcc-s1_14.2.0-19 libgcc-s1-ppc64el-cross_14.2.0-19cross1 libgdbm-compat4t64_1.24-2 libgdbm6t64_1.24-2 libgmp10_2:6.3.0+dfsg-3 libgnutls30t64_3.8.9-2 libgomp1_14.2.0-19 libgomp1-ppc64el-cross_14.2.0-19cross1 libgprofng0_2.44-3 libgssapi-krb5-2_1.21.3-5 libhogweed6t64_3.10.1-1 libhwasan0_14.2.0-19 libicu76_76.1-3 libidn2-0_2.3.8-2 libisl23_0.27-1 libitm1_14.2.0-19 libitm1-ppc64el-cross_14.2.0-19cross1 libjansson4_2.14-2+b3 libjsoncpp26_1.9.6-3 libk5crypto3_1.21.3-5 libkeyutils1_1.6.3-4 libkrb5-3_1.21.3-5 libkrb5support0_1.21.3-5 libldap2_2.6.9+dfsg-2 liblsan0_14.2.0-19 liblsan0-ppc64el-cross_14.2.0-19cross1 liblz4-1_1.10.0-4 liblzma5_5.6.4-1 libmagic-mgc_1:5.46-2 libmagic1t64_1:5.46-2 libmd0_1.1.0-2+b1 libmount1_2.40.4-5 libmpc3_1.3.1-1+b3 libmpfr6_4.2.1-1+b2 libncursesw6_6.5+20250216-2 libnettle8t64_3.10.1-1 libnghttp2-14_1.64.0-1 libnghttp3-9_1.8.0-1 libp11-kit0_0.25.5-3 libpam-modules_1.7.0-3 libpam-modules-bin_1.7.0-3 libpam-runtime_1.7.0-3 libpam0g_1.7.0-3 libpcre2-8-0_10.45-1 libperl5.40_5.40.1-2 libpipeline1_1.5.8-1 libpkgconf3_1.8.1-4 libproc2-0_2:4.0.4-7 libpsl5t64_0.21.2-1.1+b1 libquadmath0_14.2.0-19 libquadmath0-ppc64el-cross_14.2.0-19cross1 librhash1_1.4.5-1 librtmp1_2.4+20151223.gitfa8646d.1-2+b5 libsasl2-2_2.1.28+dfsg1-9 libsasl2-modules-db_2.1.28+dfsg1-9 libseccomp2_2.5.5-2+b1 libselinux1_3.8.1-1 libsemanage-common_3.8.1-1 libsemanage2_3.8.1-1 libsepol2_3.8.1-1 libsframe1_2.44-3 libsmartcols1_2.40.4-5 libssh2-1t64_1.11.1-1 libssl3t64_3.4.1-1 libstdc++-14-dev_14.2.0-19 libstdc++-14-dev-ppc64el-cross_14.2.0-19cross1 libstdc++6_14.2.0-19 libstdc++6-ppc64el-cross_14.2.0-19cross1 libsystemd0_257.4-3 libtasn1-6_4.20.0-2 libtinfo6_6.5+20250216-2 libtirpc-common_1.3.6+ds-1 libtirpc-dev_1.3.6+ds-1 libtirpc3t64_1.3.6+ds-1 libtommath-dev_1.3.0-1 libtommath1_1.3.0-1 libtool_2.5.4-4 libtsan2_14.2.0-19 libtsan2-ppc64el-cross_14.2.0-19cross1 libubsan1_14.2.0-19 libubsan1-ppc64el-cross_14.2.0-19cross1 libuchardet0_0.0.8-1+b2 libudev1_257.4-3 libunistring5_1.3-1 libuuid1_2.40.4-5 libuv1t64_1.50.0-2 libxml2_2.12.7+dfsg+really2.9.14-0.3+b1 libxxhash0_0.8.3-2 libzstd1_1.5.7+dfsg-1 linux-libc-dev_6.12.19-1 linux-libc-dev-ppc64el-cross_6.12.17-1cross2 login_1:4.16.0-2+really2.40.4-5 login.defs_1:4.17.3-2 m4_1.4.19-7 make_4.4.1-1 man-db_2.13.0-1 mawk_1.3.4.20250131-1 mount_2.40.4-5 ncurses-base_6.5+20250216-2 ncurses-bin_6.5+20250216-2 openssl-provider-legacy_3.4.1-1 passwd_1:4.17.3-2 patch_2.7.6-7 perl_5.40.1-2 perl-base_5.40.1-2 perl-modules-5.40_5.40.1-2 pkgconf_1.8.1-4 pkgconf-bin_1.8.1-4 po-debconf_1.0.21+nmu1 procps_2:4.0.4-7 rpcsvc-proto_1.4.3-1 sbuild-build-depends-main-dummy_0.invalid.0 sed_4.9-2 sensible-utils_0.0.24 sqv_1.2.1-6+b1 sysvinit-utils_3.14-4 tar_1.35+dfsg-3.1 tzdata_2025a-2 util-linux_2.40.4-5 xz-utils_5.6.4-1 zlib1g_1:1.3.dfsg+really1.3.1-1+b1

+------------------------------------------------------------------------------+
| Build                                                                        |
+------------------------------------------------------------------------------+


Unpack source
-------------

-----BEGIN PGP SIGNED MESSAGE-----
Hash: SHA512

Format: 3.0 (quilt)
Source: di
Binary: di, libdi-dev, libdi6
Architecture: any
Version: 6.0.0-1
Maintainer: Michael Ablassmeier <abi@debian.org>
Homepage: https://diskinfo-di.sourceforge.io/
Standards-Version: 4.7.0
Vcs-Browser: https://salsa.debian.org/debian/di
Vcs-Git: https://salsa.debian.org/debian/di.git
Build-Depends: debhelper (>= 13), debhelper-compat (= 13), cmake, gettext, libtirpc-dev, libtommath-dev, pkgconf
Package-List:
 di deb utils optional arch=any
 libdi-dev deb libdevel optional arch=any
 libdi6 deb libs optional arch=any
Checksums-Sha1:
 0fdef20c907afa7c9957954430eb7eaadad0dd90 133060 di_6.0.0.orig.tar.gz
 bceb6828f38720cb8fcae81a24cc81cb924a929b 4044 di_6.0.0-1.debian.tar.xz
Checksums-Sha256:
 7b663e4db044b1fa4986bd018f827c18e96fe6d1f9a36732dcbb0450e7f518cb 133060 di_6.0.0.orig.tar.gz
 44445cebcc34bd82c09f2c6d7236a26e1e527503c10581dcb73e1f8e22a5f1f6 4044 di_6.0.0-1.debian.tar.xz
Files:
 d52fd2de09041a6796c6ed5236c699c0 133060 di_6.0.0.orig.tar.gz
 6566c2c9a897d3154a28e64f6443c820 4044 di_6.0.0-1.debian.tar.xz

-----BEGIN PGP SIGNATURE-----

iQIzBAEBCgAdFiEEnKh3dJ+rLk+paGLs3GhqJ7Q0gbAFAmfPY9wACgkQ3GhqJ7Q0
gbDpHg/9EU8XcUrLGVSE+0jOUi4pF6x8vUkNHjmnCu+v1idBEgsvnRqV5dHse7D4
e6rIhM46oZoeI9fhqf0XLilyg/mEW8UcT1GQSmXWEE9elBA9aTBdud1nkCc4uhes
+LNNaMTJZSS1Tcgby9d26k/RR8m7UqSAJpMLHTT3X1wb+svzPt+nQa/XyAU00k3G
yfxETSJXwZ9irR8lswe/9mcHMXcIUidIf1LBJvjQyyDEGF/UCPFndrgfLaamC2wx
SSQhPtqgWlqcqYo9Q47aye/gRxRN2QB6eoF7G7DlBZk2NXeoyKx7oBW/UD55M6q5
b6dJ68l5jSgk1w3x+n1SyNoOdRZnur+AkfR98twQ9TvSziEx64ajcW7Iz89pvMpe
7QSw0IvbwolPxHh/OqXlnBcplhO6JQD61YMpibvP+QEjE14PbzjOHf0p1ZHjFYFu
QYCzaHziloHY7oKWIaZQCXPpnR4AqVGSnZUaH5OMD3nAebxSsrOwLgngT8TFVlXZ
2tbyvvfwlUMgVlYvMcr6NlwT/KQBOjZ/nuK3JuMGGTDJngh+KyusMNI2AaqsXKdF
DN70F4xPIiff2kuhP+QRFhKrkvWmJWNeRj+JSvCk/TcD1JGzTVS+ODvVacp4kVDY
nL2LTwtKnSXMZRUseFKpZrz9XOa/W+GTS/oqUb76yoMuPMX2LzI=
=VvgZ
-----END PGP SIGNATURE-----

dpkg-source: warning: cannot verify inline signature for ./di_6.0.0-1.dsc: unsupported subcommand
dpkg-source: info: extracting di in /<<PKGBUILDDIR>>
dpkg-source: info: unpacking di_6.0.0.orig.tar.gz
dpkg-source: info: unpacking di_6.0.0-1.debian.tar.xz

Check disk space
----------------

Sufficient free space for build

User Environment
----------------

APT_CONFIG=/var/lib/sbuild/apt.conf
CONFIG_SITE=/etc/dpkg-cross/cross-config.ppc64el
DEB_BUILD_OPTIONS=nocheck
HOME=/sbuild-nonexistent
LANG=en_US.UTF-8
LC_ALL=C.UTF-8
LOGNAME=crossqa
OLDPWD=/home/crossqa
PATH=/usr/local/sbin:/usr/local/bin:/usr/sbin:/usr/bin:/sbin:/bin:/usr/games
SBUILD_CONFIG=/tmp/tmp.9nICKiDiDd/sbuild.conf
SCHROOT_ALIAS_NAME=unstable-amd64-sbuild
SCHROOT_CHROOT_NAME=sid-amd64-sbuild
SCHROOT_COMMAND=env
SCHROOT_GID=1000
SCHROOT_GROUP=crossqa
SCHROOT_SESSION_ID=sid-amd64-sbuild-ad27eb18-9c86-428d-81c2-af84db518feb
SCHROOT_UID=1000
SCHROOT_USER=crossqa
SHELL=/bin/sh
USER=crossqa
XDG_SESSION_CLASS=user

dpkg-buildpackage
-----------------

Command: dpkg-buildpackage --sanitize-env -appc64el -Pcross,nocheck -us -uc -B -rfakeroot --jobs-try=1
dpkg-buildpackage: info: source package di
dpkg-buildpackage: info: source version 6.0.0-1
dpkg-buildpackage: info: source distribution unstable
dpkg-buildpackage: info: source changed by Michael Ablassmeier <abi@debian.org>
dpkg-architecture: warning: specified GNU system type powerpc64le-linux-gnu does not match CC system type x86_64-linux-gnu, try setting a correct CC environment variable
 dpkg-source --before-build .
dpkg-buildpackage: info: host architecture ppc64el
 debian/rules clean
dh clean
   debian/rules override_dh_auto_clean
make[1]: Entering directory '/<<PKGBUILDDIR>>'
dh_auto_clean
	make -j1 distclean
make[2]: Entering directory '/<<PKGBUILDDIR>>'
make[2]: Leaving directory '/<<PKGBUILDDIR>>'
rm -f dioptions.dat
make[1]: Leaving directory '/<<PKGBUILDDIR>>'
   dh_clean
 debian/rules binary-arch
dh binary-arch
   dh_update_autotools_config -a
   dh_autoreconf -a
   debian/rules override_dh_auto_configure
make[1]: Entering directory '/<<PKGBUILDDIR>>'
/usr/bin/make COMP=cc PREFIX=/<<PKGBUILDDIR>>/debian/di/usr/ CMAKE_SKIP_RPATH=TRUE cmake-unix
make[2]: Entering directory '/<<PKGBUILDDIR>>'
cmake \
	-DCMAKE_C_COMPILER=cc \
	-DCMAKE_INSTALL_PREFIX="/<<PKGBUILDDIR>>/debian/di/usr/" \
	-DDI_BUILD:STATIC=Release \
	-DDI_BUILD_SYS:STATIC=make-cmake \
	-S . -B build -Werror=deprecated
-- The C compiler identification is GNU 14.2.0
-- Detecting C compiler ABI info
-- Detecting C compiler ABI info - done
-- Check for working C compiler: /usr/bin/cc - skipped
-- Detecting C compile features
-- Detecting C compile features - done
-- Performing Test cfchk_fPIC
-- Performing Test cfchk_fPIC - Success
-- Performing Test lfchk_fPIC
-- Performing Test lfchk_fPIC - Success
-- Performing Test cfchk_Wall
-- Performing Test cfchk_Wall - Success
-- Performing Test cfchk_Wextra
-- Performing Test cfchk_Wextra - Success
-- Performing Test cfchk_Wconversion
-- Performing Test cfchk_Wconversion - Success
-- Performing Test cfchk_Wno_unused_but_set_variable
-- Performing Test cfchk_Wno_unused_but_set_variable - Success
-- Performing Test cfchk_Wno_unused_parameter
-- Performing Test cfchk_Wno_unused_parameter - Success
-- Performing Test cfchk_Wno_unknown_pragmas
-- Performing Test cfchk_Wno_unknown_pragmas - Success
-- Performing Test cfchk_Wno_float_equal
-- Performing Test cfchk_Wno_float_equal - Success
-- Performing Test cfchk_Wformat
-- Performing Test cfchk_Wformat - Success
-- Performing Test cfchk_Wformat_security
-- Performing Test cfchk_Wformat_security - Success
-- Performing Test cfchk_Werror_format_security
-- Performing Test cfchk_Werror_format_security - Success
-- Performing Test cfchk_Werror_return_type
-- Performing Test cfchk_Werror_return_type - Success
-- Performing Test cfchk_Wdeprecated_declarations
-- Performing Test cfchk_Wdeprecated_declarations - Success
-- Performing Test cfchk_Wunreachable_code
-- Performing Test cfchk_Wunreachable_code - Success
-- Performing Test cfchk_Wdeclaration_after_statement
-- Performing Test cfchk_Wdeclaration_after_statement - Success
-- Performing Test cfchk_Wmissing_prototypes
-- Performing Test cfchk_Wmissing_prototypes - Success
-- Performing Test cfchk_Wmaybe_uninitialized
-- Performing Test cfchk_Wmaybe_uninitialized - Success
-- Performing Test cfchk_Wno_stringop_overflow
-- Performing Test cfchk_Wno_stringop_overflow - Success
-- Performing Test cfchk_Wno_stringop_truncation
-- Performing Test cfchk_Wno_stringop_truncation - Success
-- Performing Test cfchk_Wno_format_truncation
-- Performing Test cfchk_Wno_format_truncation - Success
-- Performing Test cfchk_Wno_extra_semi_stmt
-- Performing Test cfchk_Wno_extra_semi_stmt - Success
-- Performing Test cfchk_Wno_poison_system_directories
-- Performing Test cfchk_Wno_poison_system_directories - Success
-- Performing Test cfchk_Wno_shift_sign_overflow
-- Performing Test cfchk_Wno_shift_sign_overflow - Success
-- Performing Test cfchk_Wno_pragma_pack
-- Performing Test cfchk_Wno_pragma_pack - Success
-- Performing Test cfchk_Wno_ignored_attributes
-- Performing Test cfchk_Wno_ignored_attributes - Success
-- Performing Test cfchk_Wno_reserved_macro_identifier
-- Performing Test cfchk_Wno_reserved_macro_identifier - Success
-- Performing Test cfchk_Wno_reserved_id_macro
-- Performing Test cfchk_Wno_reserved_id_macro - Success
-- Performing Test cfchk_Wno_implicit_int_conversion
-- Performing Test cfchk_Wno_implicit_int_conversion - Success
-- Performing Test cfchk_Wno_switch_enum
-- Performing Test cfchk_Wno_switch_enum - Success
-- Performing Test cfchk_Wno_gnu_zero_variadic_macro_arguments
-- Performing Test cfchk_Wno_gnu_zero_variadic_macro_arguments - Success
-- Performing Test cfchk_Wno_documentation_deprecated_sync
-- Performing Test cfchk_Wno_documentation_deprecated_sync - Success
-- Performing Test cfchk_Wno_documentation_unknown_command
-- Performing Test cfchk_Wno_documentation_unknown_command - Success
-- Performing Test cfchk_Wno_documentation
-- Performing Test cfchk_Wno_documentation - Success
-- Performing Test cfchk_Wno_unsafe_buffer_usage
-- Performing Test cfchk_Wno_unsafe_buffer_usage - Success
-- Performing Test cfchk_Wno_used_but_marked_unused
-- Performing Test cfchk_Wno_used_but_marked_unused - Success
-- Getting LFS flags via getconf
-- Performing Test cfchk_fstack_protector_strong
-- Performing Test cfchk_fstack_protector_strong - Success
-- Performing Test cfchk_fstack_protector_all
-- Performing Test cfchk_fstack_protector_all - Success
-- Found PkgConfig: /usr/bin/pkg-config (found version "1.8.1")
-- Found Intl: built in to C library
-- Performing Test Iconv_IS_BUILT_IN
-- Performing Test Iconv_IS_BUILT_IN - Success
-- Found Iconv: built in to C library
-- Checking for module 'gmp'
--   Package 'gmp', required by 'virtual:world', not found
-- Checking for module 'libtommath'
--   Package 'libtommath', required by 'virtual:world', not found
-- Checking for module 'libtirpc'
--   Package 'libtirpc', required by 'virtual:world', not found
-- Looking for ctype.h
-- Looking for ctype.h - found
-- Looking for dirent.h
-- Looking for dirent.h - found
-- Looking for errno.h
-- Looking for errno.h - found
-- Looking for fcntl.h
-- Looking for fcntl.h - found
-- Looking for gmp.h
-- Looking for gmp.h - not found
-- Looking for fshelp.h
-- Looking for fshelp.h - not found
-- Looking for inttypes.h
-- Looking for inttypes.h - found
-- Looking for jfs/quota.h
-- Looking for jfs/quota.h - not found
-- Looking for kernel/fs_info.h
-- Looking for kernel/fs_info.h - not found
-- Looking for limits.h
-- Looking for limits.h - found
-- Looking for linux/dqblk_xfs.h
-- Looking for linux/dqblk_xfs.h - found
-- Looking for linux/quota.h
-- Looking for linux/quota.h - found
-- Looking for libintl.h
-- Looking for libintl.h - found
-- Looking for libprop/proplib.h
-- Looking for libprop/proplib.h - not found
-- Looking for locale.h
-- Looking for locale.h - found
-- Looking for malloc.h
-- Looking for malloc.h - found
-- Looking for math.h
-- Looking for math.h - found
-- Looking for memory.h
-- Looking for memory.h - found
-- Looking for mntent.h
-- Looking for mntent.h - found
-- Looking for mnttab.h
-- Looking for mnttab.h - not found
-- Looking for quota.h
-- Looking for quota.h - not found
-- Looking for include files rpc/rpc.h, rpc/auth.h
-- Looking for include files rpc/rpc.h, rpc/auth.h - not found
-- Looking for rpc/rpc.h
-- Looking for rpc/rpc.h - not found
-- Looking for rpcsvc/rquota.h
-- Looking for rpcsvc/rquota.h - not found
-- Looking for storage/Directory.h
-- Looking for storage/Directory.h - not found
-- Looking for storage/Entry.h
-- Looking for storage/Entry.h - not found
-- Looking for storage/Path.h
-- Looking for storage/Path.h - not found
-- Looking for stdbool.h
-- Looking for stdbool.h - found
-- Looking for stddef.h
-- Looking for stddef.h - found
-- Looking for stdio.h
-- Looking for stdio.h - found
-- Looking for stdint.h
-- Looking for stdint.h - found
-- Looking for stdlib.h
-- Looking for stdlib.h - found
-- Looking for string.h
-- Looking for string.h - found
-- Looking for strings.h
-- Looking for strings.h - found
-- Looking for time.h
-- Looking for time.h - found
-- Looking for tommath.h
-- Looking for tommath.h - found
-- Looking for libtommath/tommath.h
-- Looking for libtommath/tommath.h - not found
-- Looking for ufs/quota.h
-- Looking for ufs/quota.h - not found
-- Looking for include files sys/types.h, ufs/ufs/quota.h
-- Looking for include files sys/types.h, ufs/ufs/quota.h - not found
-- Looking for unistd.h
-- Looking for unistd.h - found
-- Looking for wchar.h
-- Looking for wchar.h - found
-- Looking for windows.h
-- Looking for windows.h - not found
-- Looking for winioctl.h
-- Looking for winioctl.h - not found
-- Looking for zone.h
-- Looking for zone.h - not found
-- Looking for sys/dcmd_blk.h
-- Looking for sys/dcmd_blk.h - not found
-- Looking for sys/file.h
-- Looking for sys/file.h - found
-- Looking for sys/fs_types.h
-- Looking for sys/fs_types.h - not found
-- Looking for include files sys/types.h, sys/fs/ufs_quota.h
-- Looking for include files sys/types.h, sys/fs/ufs_quota.h - not found
-- Looking for sys/fstyp.h
-- Looking for sys/fstyp.h - not found
-- Looking for include files sys/types.h, sys/fstypes.h
-- Looking for include files sys/types.h, sys/fstypes.h - not found
-- Looking for sys/ftype.h
-- Looking for sys/ftype.h - not found
-- Looking for sys/io.h
-- Looking for sys/io.h - found
-- Looking for sys/mntctl.h
-- Looking for sys/mntctl.h - not found
-- Looking for sys/param.h
-- Looking for sys/param.h - found
-- Looking for sys/types.h
-- Looking for sys/types.h - found
-- Looking for sys/mnttab.h
-- Looking for sys/mnttab.h - not found
-- Looking for sys/mntent.h
-- Looking for sys/mntent.h - not found
-- Looking for include files sys/types.h, sys/mount.h
-- Looking for include files sys/types.h, sys/mount.h - found
-- Looking for include files sys/types.h, sys/quota.h
-- Looking for include files sys/types.h, sys/quota.h - found
-- Looking for sys/stat.h
-- Looking for sys/stat.h - found
-- Looking for sys/statfs.h
-- Looking for sys/statfs.h - found
-- Looking for sys/statvfs.h
-- Looking for sys/statvfs.h - found
-- Looking for sys/time.h
-- Looking for sys/time.h - found
-- Looking for sys/vfs.h
-- Looking for sys/vfs.h - found
-- Looking for sys/vfs_quota.h
-- Looking for sys/vfs_quota.h - not found
-- Looking for include files stdio.h, sys/vfstab.h
-- Looking for include files stdio.h, sys/vfstab.h - not found
-- Looking for sys/vmount.h
-- Looking for sys/vmount.h - not found
-- Looking for bcopy
-- Looking for bcopy - found
-- Looking for bzero
-- Looking for bzero - found
-- Looking for endmntent
-- Looking for endmntent - found
-- Looking for fs_stat_dev
-- Looking for fs_stat_dev - not found
-- Looking for fshelp
-- Looking for fshelp - not found
-- Looking for getfsstat
-- Looking for getfsstat - not found
-- Looking for getmnt
-- Looking for getmnt - not found
-- Looking for getmntent
-- Looking for getmntent - found
-- Looking for getmntent
-- Looking for getmntent - not found
-- Looking for getmntinfo
-- Looking for getmntinfo - not found
-- Looking for getmntinfo
-- Looking for getmntinfo - not found
-- Looking for getvfsstat
-- Looking for getvfsstat - not found
-- Looking for getzoneid
-- Looking for getzoneid - not found
-- Looking for hasmntopt
-- Looking for hasmntopt - found
-- Looking for hasmntopt
-- Looking for hasmntopt - not found
-- Looking for lstat
-- Looking for lstat - found
-- Looking for mbrlen
-- Looking for mbrlen - found
-- Looking for memcpy
-- Looking for memcpy - found
-- Looking for memset
-- Looking for memset - found
-- Looking for mntctl
-- Looking for mntctl - not found
-- Looking for next_dev
-- Looking for next_dev - not found
-- Looking for prop_dictionary_create
-- Looking for prop_dictionary_create - not found
-- Looking for quota_open
-- Looking for quota_open - not found
-- Looking for quotactl
-- Looking for quotactl - not found
-- Looking for quotactl
-- Looking for quotactl - found
-- Looking for quotactl
-- Looking for quotactl - not found
-- Looking for realpath
-- Looking for realpath - found
-- Looking for setmntent
-- Looking for setmntent - found
-- Looking for snprintf
-- Looking for snprintf - found
-- Looking for setlocale
-- Looking for setlocale - found
-- Looking for statfs
-- Looking for statfs - found
-- Looking for statfs
-- Looking for statfs - not found
-- Looking for statvfs
-- Looking for statvfs - found
-- Looking for stpecpy
-- Looking for stpecpy - not found
-- Looking for strcoll
-- Looking for strcoll - found
-- Looking for strdup
-- Looking for strdup - found
-- Looking for strstr
-- Looking for strstr - found
-- Looking for strtok_r
-- Looking for strtok_r - found
-- Looking for sysfs
-- Looking for sysfs - not found
-- Looking for vquotactl
-- Looking for vquotactl - not found
-- Looking for xdr_int
-- Looking for xdr_int - not found
-- Looking for xdr_int
-- Looking for xdr_int - not found
-- Looking for xdr_int
-- Looking for xdr_int - not found
-- Looking for zone_getattr
-- Looking for zone_getattr - not found
-- Looking for zone_list
-- Looking for zone_list - not found
-- Looking for GetDiskFreeSpace
-- Looking for GetDiskFreeSpace - not found
-- Looking for GetDiskFreeSpaceEx
-- Looking for GetDiskFreeSpaceEx - not found
-- Looking for GetDriveType
-- Looking for GetDriveType - not found
-- Looking for GetLogicalDriveStrings
-- Looking for GetLogicalDriveStrings - not found
-- Looking for GetVolumeInformation
-- Looking for GetVolumeInformation - not found
-- Looking for bindtextdomain
-- Looking for bindtextdomain - found
-- Looking for gettext
-- Looking for gettext - found
-- Looking for textdomain
-- Looking for textdomain - found
-- Looking for sys/types.h
-- Looking for sys/types.h - found
-- Looking for stdint.h
-- Looking for stdint.h - found
-- Looking for stddef.h
-- Looking for stddef.h - found
-- Check size of statvfs_t
-- Check size of statvfs_t - failed
-- Performing Test _mem_struct_statvfs_f_basetype
-- Performing Test _mem_struct_statvfs_f_basetype - Failed
-- Check size of gid_t
-- Check size of gid_t - done
-- Check size of size_t
-- Check size of size_t - done
-- Check size of uid_t
-- Check size of uid_t - done
-- Check size of double
-- Check size of double - done
-- Check size of long double
-- Check size of long double - done
-- Check size of uint64_t
-- Check size of uint64_t - done
-- Check size of long
-- Check size of long - done
-- Check size of long long
-- Check size of long long - done
quota header: sys/types.h;sys/quota.h
-- Check size of struct dqblk
-- Check size of struct dqblk - done
-- Check size of struct quotaval
-- Check size of struct quotaval - failed
-- Check size of struct ufs_dqblk
-- Check size of struct ufs_dqblk - failed
-- Performing Test _mem_struct_dqblk_dqb_curspace
-- Performing Test _mem_struct_dqblk_dqb_curspace - Success
-- Performing Test _mem_struct_dqblk_dqb_curblocks
-- Performing Test _mem_struct_dqblk_dqb_curblocks - Failed
-- Performing Test _mem_struct_dqblk_dqb_fhardlimit
-- Performing Test _mem_struct_dqblk_dqb_fhardlimit - Failed
-- Performing Test _mem_struct_dqblk_dqb_fsoftlimit
-- Performing Test _mem_struct_dqblk_dqb_fsoftlimit - Failed
-- Performing Test _mem_struct_dqblk_dqb_curfiles
-- Performing Test _mem_struct_dqblk_dqb_curfiles - Failed
-- Checking prototype quotactl for _quotactl_pos_1a
-- Checking prototype quotactl for _quotactl_pos_1a - False
-- Checking prototype quotactl for _quotactl_pos_1b
-- Checking prototype quotactl for _quotactl_pos_1b - False
-- Checking prototype quotactl for _quotactl_pos_2a
-- Checking prototype quotactl for _quotactl_pos_2a - True
-- Checking prototype quotactl for _quotactl_pos_2b
-- Checking prototype quotactl for _quotactl_pos_2b - True
-- Looking for QCMD
-- Looking for QCMD - found
-- Check size of fs_disk_quota_t
-- Check size of fs_disk_quota_t - done
setmntent header: mntent.h
-- Checking prototype setmntent for _args_setmntent_1
-- Checking prototype setmntent for _args_setmntent_1 - False
-- Checking prototype setmntent for _args_setmntent_2
-- Checking prototype setmntent for _args_setmntent_2 - True
statfs header: sys/statfs.h
-- Checking prototype statfs for _args_statfs_2
-- Checking prototype statfs for _args_statfs_2 - True
-- Checking prototype statfs for _args_statfs_3
-- Checking prototype statfs for _args_statfs_3 - False
-- Checking prototype statfs for _args_statfs_4
-- Checking prototype statfs for _args_statfs_4 - False
-- Performing Test _mem_struct_statfs_f_bsize
-- Performing Test _mem_struct_statfs_f_bsize - Success
-- Performing Test _mem_struct_statfs_f_fsize
-- Performing Test _mem_struct_statfs_f_fsize - Failed
-- Performing Test _mem_struct_statfs_f_fstyp
-- Performing Test _mem_struct_statfs_f_fstyp - Failed
-- Performing Test _mem_struct_statfs_f_iosize
-- Performing Test _mem_struct_statfs_f_iosize - Failed
-- Performing Test _mem_struct_statfs_f_frsize
-- Performing Test _mem_struct_statfs_f_frsize - Success
-- Performing Test _mem_struct_statfs_f_fstypename
-- Performing Test _mem_struct_statfs_f_fstypename - Failed
-- Performing Test _mem_struct_statfs_mount_info
-- Performing Test _mem_struct_statfs_mount_info - Failed
-- Performing Test _mem_struct_statfs_f_type
-- Performing Test _mem_struct_statfs_f_type - Success
-- Looking for errno
-- Looking for errno - found
-- Check if vquotactl is enabled
-- Check for include conflict time.h sys/time.h
-- Looking for include files time.h, sys/time.h
-- Looking for include files time.h, sys/time.h - found
-- Check for include conflict sys/quota.h linux/quota.h
-- Looking for O_NOCTTY
-- Looking for O_NOCTTY - found
-- Looking for IOCTL_STORAGE_CHECK_VERIFY2
-- Looking for IOCTL_STORAGE_CHECK_VERIFY2 - not found
-- Looking for MCTL_QUERY
-- Looking for MCTL_QUERY - not found
-- Looking for S_ISLNK
-- Looking for S_ISLNK - found
math-library: DI_INTERNAL
-- Configuring done (15.8s)
-- Generating done (0.0s)
-- Build files have been written to: /<<PKGBUILDDIR>>/build
make[2]: Leaving directory '/<<PKGBUILDDIR>>'
make[1]: Leaving directory '/<<PKGBUILDDIR>>'
   debian/rules override_dh_auto_build
make[1]: Entering directory '/<<PKGBUILDDIR>>'
dh_auto_build -- cmake-build
	make -j1 "INSTALL=install --strip-program=true" PKG_CONFIG=powerpc64le-linux-gnu-pkg-config CXX=powerpc64le-linux-gnu-g\+\+ CC=powerpc64le-linux-gnu-gcc cmake-build
make[2]: Entering directory '/<<PKGBUILDDIR>>'
cmake --build build 
gmake[3]: Entering directory '/<<PKGBUILDDIR>>/build'
[  6%] Building C object CMakeFiles/objdistrutils.dir/distrutils.c.o
[  6%] Built target objdistrutils
[ 12%] Building C object CMakeFiles/libdi.dir/didiskutil.c.o
[ 18%] Building C object CMakeFiles/libdi.dir/digetentries.c.o
[ 25%] Building C object CMakeFiles/libdi.dir/digetinfo.c.o
[ 31%] Building C object CMakeFiles/libdi.dir/dilib.c.o
[ 37%] Building C object CMakeFiles/libdi.dir/diquota.c.o
[ 43%] Building C object CMakeFiles/libdi.dir/dizone.c.o
[ 50%] Building C object CMakeFiles/libdi.dir/getoptn.c.o
[ 56%] Building C object CMakeFiles/libdi.dir/dioptions.c.o
[ 62%] Linking C shared library libdi.so
[ 62%] Built target libdi
[ 68%] Building C object CMakeFiles/di.dir/di.c.o
[ 75%] Linking C executable di
[ 75%] Built target di
[ 81%] Building C object CMakeFiles/dimathtest.dir/dimathtest.c.o
[ 87%] Linking C executable dimathtest
[ 87%] Built target dimathtest
[ 93%] Building C object CMakeFiles/getoptn_test.dir/getoptn.c.o
[100%] Linking C executable getoptn_test
[100%] Built target getoptn_test
gmake[3]: Leaving directory '/<<PKGBUILDDIR>>/build'
make[2]: Leaving directory '/<<PKGBUILDDIR>>'
make[1]: Leaving directory '/<<PKGBUILDDIR>>'
   create-stamp debian/debhelper-build-stamp
   dh_prep -a
   dh_install -a
   dh_installdocs -a
   dh_installchangelogs -a
   dh_installman -a
   dh_perl -a
   dh_link -a
   dh_strip_nondeterminism -a
   dh_compress -a
   dh_fixperms -a
   dh_missing -a
   dh_dwz -a
   dh_strip -a
powerpc64le-linux-gnu-objcopy: Unable to recognise the format of the input file `debian/di/usr/bin/di'
dh_strip: error: powerpc64le-linux-gnu-objcopy --only-keep-debug --compress-debug-sections debian/di/usr/bin/di debian/.debhelper/di/dbgsym-root/usr/lib/debug/.build-id/9b/f1ca4ee9987982536ee64f612964c21ac555b9.debug returned exit code 1
dh_strip: error: Aborting due to earlier error
make: *** [debian/rules:13: binary-arch] Error 25
dpkg-buildpackage: error: debian/rules binary-arch subprocess returned exit status 2
--------------------------------------------------------------------------------
Build finished at 2025-03-19T19:46:46Z

+------------------------------------------------------------------------------+
| Finished Timed Build Commands                                                |
+------------------------------------------------------------------------------+


rm -Rf /<<PKGBUILDDIR>>/
---------------------------------


I: Finished running 'rm -Rf /<<PKGBUILDDIR>>/'.

Finished processing commands.
--------------------------------------------------------------------------------

Finished
--------


+------------------------------------------------------------------------------+
| Cleanup                                                                      |
+------------------------------------------------------------------------------+

Purging /<<BUILDDIR>>
Not cleaning session: cloned chroot in use
E: Build failure (dpkg-buildpackage died)

+------------------------------------------------------------------------------+
| Summary                                                                      |
+------------------------------------------------------------------------------+

Build Architecture: amd64
Build Profiles: cross nocheck
Build Type: any
Build-Space: n/a
Build-Time: 19
Distribution: unstable
Fail-Stage: build
Foreign Architectures: ppc64el
Host Architecture: ppc64el
Install-Time: 12
Job: di_6.0.0-1
Machine Architecture: amd64
Package: di
Package-Time: 42
Source-Version: 6.0.0-1
Space: n/a
Status: attempted
Version: 6.0.0-1
--------------------------------------------------------------------------------
Finished at 2025-03-19T19:46:46Z
Build needed 00:00:42, no disk space