sbuild (Debian sbuild) 0.85.0 (04 January 2023) on debian-ci-siliconvalley

+==============================================================================+
| jabberd2 2.7.0-7 (mips64el)                  Fri, 28 Feb 2025 21:52:29 +0000 |
+==============================================================================+

Package: jabberd2
Version: 2.7.0-7
Source Version: 2.7.0-7
Distribution: unstable
Machine Architecture: amd64
Host Architecture: mips64el
Build Architecture: amd64
Build Profiles: cross nocheck
Build Type: any

I: NOTICE: Log filtering will replace 'var/run/schroot/mount/sid-amd64-sbuild-e22c63d9-8f01-44b8-a0d1-b191135411e6' with '<<CHROOT>>'
I: NOTICE: Log filtering will replace 'build/jabberd2-BjwND5/resolver-HT9F08' with '<<RESOLVERDIR>>'

+------------------------------------------------------------------------------+
| Update chroot                                                                |
+------------------------------------------------------------------------------+

Get:1 http://localhost:3142/debian unstable InRelease [205 kB]
Get:2 http://localhost:3142/debian unstable/main Sources.diff/Index [63.6 kB]
Get:3 http://localhost:3142/debian unstable/non-free Sources.diff/Index [63.3 kB]
Get:4 http://localhost:3142/debian unstable/main amd64 Packages.diff/Index [63.6 kB]
Get:5 http://localhost:3142/debian unstable/main Sources T-2025-02-28-2015.34-F-2025-02-28-0211.13.pdiff [96.3 kB]
Get:6 http://localhost:3142/debian unstable/non-free Sources T-2025-02-28-2015.34-F-2025-02-28-1419.45.pdiff [1431 B]
Get:5 http://localhost:3142/debian unstable/main Sources T-2025-02-28-2015.34-F-2025-02-28-0211.13.pdiff [96.3 kB]
Get:7 http://localhost:3142/debian unstable/main amd64 Packages T-2025-02-28-2015.34-F-2025-02-28-0211.13.pdiff [129 kB]
Get:6 http://localhost:3142/debian unstable/non-free Sources T-2025-02-28-2015.34-F-2025-02-28-1419.45.pdiff [1431 B]
Get:8 http://localhost:3142/debian unstable/main mips64el Packages [9754 kB]
Get:7 http://localhost:3142/debian unstable/main amd64 Packages T-2025-02-28-2015.34-F-2025-02-28-0211.13.pdiff [129 kB]
Fetched 10.4 MB in 3s (3927 kB/s)
Reading package lists...
Reading package lists...
Building dependency tree...
Reading state information...
Calculating upgrade...
The following packages will be upgraded:
  apt apt-utils libapt-pkg7.0
3 upgraded, 0 newly installed, 0 to remove and 0 not upgraded.
Need to get 2878 kB of archives.
After this operation, 2048 B of additional disk space will be used.
Get:1 http://localhost:3142/debian unstable/main amd64 libapt-pkg7.0 amd64 2.9.31 [1105 kB]
Get:2 http://localhost:3142/debian unstable/main amd64 apt amd64 2.9.31 [1441 kB]
Get:3 http://localhost:3142/debian unstable/main amd64 apt-utils amd64 2.9.31 [333 kB]
Fetched 2878 kB in 0s (134 MB/s)
(Reading database ... 
(Reading database ... 5%
(Reading database ... 10%
(Reading database ... 15%
(Reading database ... 20%
(Reading database ... 25%
(Reading database ... 30%
(Reading database ... 35%
(Reading database ... 40%
(Reading database ... 45%
(Reading database ... 50%
(Reading database ... 55%
(Reading database ... 60%
(Reading database ... 65%
(Reading database ... 70%
(Reading database ... 75%
(Reading database ... 80%
(Reading database ... 85%
(Reading database ... 90%
(Reading database ... 95%
(Reading database ... 100%
(Reading database ... 12839 files and directories currently installed.)
Preparing to unpack .../libapt-pkg7.0_2.9.31_amd64.deb ...
Unpacking libapt-pkg7.0:amd64 (2.9.31) over (2.9.30) ...
Setting up libapt-pkg7.0:amd64 (2.9.31) ...
(Reading database ... 
(Reading database ... 5%
(Reading database ... 10%
(Reading database ... 15%
(Reading database ... 20%
(Reading database ... 25%
(Reading database ... 30%
(Reading database ... 35%
(Reading database ... 40%
(Reading database ... 45%
(Reading database ... 50%
(Reading database ... 55%
(Reading database ... 60%
(Reading database ... 65%
(Reading database ... 70%
(Reading database ... 75%
(Reading database ... 80%
(Reading database ... 85%
(Reading database ... 90%
(Reading database ... 95%
(Reading database ... 100%
(Reading database ... 12839 files and directories currently installed.)
Preparing to unpack .../archives/apt_2.9.31_amd64.deb ...
Unpacking apt (2.9.31) over (2.9.30) ...
Setting up apt (2.9.31) ...
(Reading database ... 
(Reading database ... 5%
(Reading database ... 10%
(Reading database ... 15%
(Reading database ... 20%
(Reading database ... 25%
(Reading database ... 30%
(Reading database ... 35%
(Reading database ... 40%
(Reading database ... 45%
(Reading database ... 50%
(Reading database ... 55%
(Reading database ... 60%
(Reading database ... 65%
(Reading database ... 70%
(Reading database ... 75%
(Reading database ... 80%
(Reading database ... 85%
(Reading database ... 90%
(Reading database ... 95%
(Reading database ... 100%
(Reading database ... 12839 files and directories currently installed.)
Preparing to unpack .../apt-utils_2.9.31_amd64.deb ...
Unpacking apt-utils (2.9.31) over (2.9.30) ...
Setting up apt-utils (2.9.31) ...
Processing triggers for libc-bin (2.40-7) ...

+------------------------------------------------------------------------------+
| Fetch source files                                                           |
+------------------------------------------------------------------------------+


Check APT
---------

Checking available source versions...

Download source files with APT
------------------------------

Reading package lists...
NOTICE: 'jabberd2' packaging is maintained in the 'Git' version control system at:
https://salsa.debian.org/xmpp-team/jabberd2.git
Please use:
git clone https://salsa.debian.org/xmpp-team/jabberd2.git
to retrieve the latest (possibly unreleased) updates to the package.
Need to get 651 kB of source archives.
Get:1 http://localhost:3142/debian unstable/main jabberd2 2.7.0-7 (dsc) [1542 B]
Get:2 http://localhost:3142/debian unstable/main jabberd2 2.7.0-7 (tar) [630 kB]
Get:3 http://localhost:3142/debian unstable/main jabberd2 2.7.0-7 (diff) [19.0 kB]
Fetched 651 kB in 1s (1055 kB/s)
Download complete and in download only mode
I: NOTICE: Log filtering will replace 'build/jabberd2-BjwND5/jabberd2-2.7.0' with '<<PKGBUILDDIR>>'
I: NOTICE: Log filtering will replace 'build/jabberd2-BjwND5' with '<<BUILDDIR>>'

+------------------------------------------------------------------------------+
| Install package build dependencies                                           |
+------------------------------------------------------------------------------+


Setup apt archive
-----------------

Merged Build-Depends: check, debhelper-compat (= 13), default-libmysqlclient-dev, dh-sequence-movetousr, libdb-dev, libexpat1-dev, libgsasl-dev (>= 1.4.0), libhttp-parser-dev, libidn-dev, libldap2-dev, libpam0g-dev, libpq-dev, libsqlite3-dev, libssl-dev, libudns-dev, libc-dev, libstdc++-dev, build-essential:amd64, fakeroot:amd64, crossbuild-essential-mips64el:amd64, libc-dev:mips64el, libstdc++-dev:mips64el
Filtered Build-Depends: check, debhelper-compat (= 13), default-libmysqlclient-dev, dh-sequence-movetousr, libdb-dev, libexpat1-dev, libgsasl-dev (>= 1.4.0), libhttp-parser-dev, libidn-dev, libldap2-dev, libpam0g-dev, libpq-dev, libsqlite3-dev, libssl-dev, libudns-dev, libc-dev, libstdc++-dev, build-essential:amd64, fakeroot:amd64, crossbuild-essential-mips64el:amd64, libc-dev:mips64el, libstdc++-dev:mips64el
dpkg-deb: warning: root directory /<<RESOLVERDIR>>/sbuild-build-depends-main-dummy has unusual owner or group 1000:119
dpkg-deb: hint: you might need to pass --root-owner-group, see <https://wiki.debian.org/Teams/Dpkg/RootlessBuilds> for further details
dpkg-deb: warning: ignoring 1 warning about the control file(s)
dpkg-deb: building package 'sbuild-build-depends-main-dummy' in '/<<RESOLVERDIR>>/apt_archive/sbuild-build-depends-main-dummy.deb'.
Ign:1 copy:/<<RESOLVERDIR>>/apt_archive ./ InRelease
Get:2 copy:/<<RESOLVERDIR>>/apt_archive ./ Release [609 B]
Ign:3 copy:/<<RESOLVERDIR>>/apt_archive ./ Release.gpg
Get:4 copy:/<<RESOLVERDIR>>/apt_archive ./ Sources [944 B]
Get:5 copy:/<<RESOLVERDIR>>/apt_archive ./ Packages [991 B]
Fetched 2544 B in 0s (0 B/s)
Reading package lists...
Reading package lists...

Install main build dependencies (apt-based resolver)
----------------------------------------------------

Installing build dependencies
Reading package lists...
Building dependency tree...
Reading state information...
Execute external solver...
The following additional packages will be installed:
  autoconf automake autopoint autotools-dev binutils-mips64el-linux-gnuabi64
  bsdextrautils check:mips64el cpp-14-mips64el-linux-gnuabi64
  cpp-mips64el-linux-gnuabi64 cross-config crossbuild-essential-mips64el
  debhelper default-libmysqlclient-dev:mips64el dh-autoreconf
  dh-strip-nondeterminism dpkg-cross dwz fakeroot file
  g++-14-mips64el-linux-gnuabi64 g++-mips64el-linux-gnuabi64
  gcc-14-base:mips64el gcc-14-cross-base-mipsen gcc-14-mips64el-linux-gnuabi64
  gcc-14-mips64el-linux-gnuabi64-base gcc-mips64el-linux-gnuabi64 gettext
  gettext-base groff-base intltool-debian libarchive-zip-perl
  libatomic1:mips64el libatomic1-mips64el-cross libaudit1:mips64el
  libc6:mips64el libc6-dev:mips64el libc6-dev-mips64el-cross
  libc6-mips64el-cross libcap-ng0:mips64el libcom-err2:mips64el
  libconfig-auto-perl libconfig-inifiles-perl libcrypt-dev:mips64el
  libcrypt1:mips64el libdb-dev:mips64el libdb5.3-dev:mips64el
  libdb5.3t64:mips64el libdebhelper-perl libdebian-dpkgcross-perl libelf1t64
  libexpat1:mips64el libexpat1-dev:mips64el libfakeroot libfile-homedir-perl
  libfile-stripnondeterminism-perl libfile-which-perl libgcc-14-dev:mips64el
  libgcc-14-dev-mips64el-cross libgcc-s1:mips64el libgcc-s1-mips64el-cross
  libgomp1:mips64el libgomp1-mips64el-cross libgsasl-dev:mips64el
  libgsasl18:mips64el libgssapi-krb5-2:mips64el libgssglue-dev:mips64el
  libgssglue1:mips64el libhttp-parser-dev:mips64el libhttp-parser2.9:mips64el
  libicu72 libidn-dev:mips64el libidn12:mips64el libio-string-perl
  libk5crypto3:mips64el libkeyutils1:mips64el libkrb5-3:mips64el
  libkrb5support0:mips64el libldap-dev:mips64el libldap2:mips64el
  liblocale-gettext-perl libmagic-mgc libmagic1t64 libmariadb-dev:mips64el
  libmariadb-dev-compat:mips64el libmariadb3:mips64el libncursesw6
  libntlm0:mips64el libntlm0-dev:mips64el libpam0g:mips64el
  libpam0g-dev:mips64el libpipeline1 libpkgconf3 libpq-dev:mips64el
  libpq5:mips64el libproc2-0 libsasl2-2:mips64el libsasl2-modules-db:mips64el
  libsqlite3-0:mips64el libsqlite3-dev:mips64el libssl-dev:mips64el
  libssl3t64:mips64el libstdc++-14-dev:mips64el
  libstdc++-14-dev-mips64el-cross libstdc++6:mips64el
  libstdc++6-mips64el-cross libsubunit-dev:mips64el libsubunit0:mips64el
  libtext-charwidth-perl libtext-wrapi18n-perl libtool libuchardet0
  libudns-dev:mips64el libudns0t64:mips64el libunistring5 libxml-libxml-perl
  libxml-namespacesupport-perl libxml-sax-base-perl libxml-sax-perl
  libxml-simple-perl libxml2 libyaml-perl libzstd1:mips64el
  linux-libc-dev-mips64el-cross m4 man-db mariadb-common mysql-common
  pkgconf:mips64el pkgconf-bin po-debconf procps sensible-utils ucf
  zlib1g:mips64el zlib1g-dev:mips64el
Suggested packages:
  autoconf-archive gnu-standards autoconf-doc binutils-doc gcc-14-locales
  cpp-14-doc cpp-doc dh-make binutils-multiarch gcc-14-doc manpages-dev flex
  bison gdb-mips64el-linux-gnuabi64 gcc-doc gettext-doc libasprintf-dev
  libgettextpo-dev groff glibc-doc:mips64el libc-l10n:mips64el
  locales:mips64el libnss-nis:mips64el libnss-nisplus:mips64el
  manpages-dev:mips64el db5.3-doc:mips64el krb5-doc:mips64el
  krb5-user:mips64el idn:mips64el libpam-doc:mips64el
  postgresql-doc-17:mips64el sqlite3-doc:mips64el libssl-doc:mips64el
  libstdc++-14-doc:mips64el libtool-doc gfortran | fortran95-compiler gcj-jdk
  libyaml-shell-perl m4-doc apparmor less www-browser libmail-box-perl
Recommended packages:
  curl | wget | lynx libidn2-0:mips64el libarchive-cpio-perl
  gsasl-common:mips64el krb5-locales:mips64el libldap-common:mips64el libgpm2
  libpam-doc:mips64el libsasl2-modules:mips64el libltdl-dev libwww-perl
  libxml-sax-expat-perl libyaml-libyaml-perl | libyaml-syck-perl
  libmail-sendmail-perl psmisc linux-sysctl-defaults
The following NEW packages will be installed:
  autoconf automake autopoint autotools-dev binutils-mips64el-linux-gnuabi64
  bsdextrautils check:mips64el cpp-14-mips64el-linux-gnuabi64
  cpp-mips64el-linux-gnuabi64 cross-config crossbuild-essential-mips64el
  debhelper default-libmysqlclient-dev:mips64el dh-autoreconf
  dh-strip-nondeterminism dpkg-cross dwz fakeroot file
  g++-14-mips64el-linux-gnuabi64 g++-mips64el-linux-gnuabi64
  gcc-14-base:mips64el gcc-14-cross-base-mipsen gcc-14-mips64el-linux-gnuabi64
  gcc-14-mips64el-linux-gnuabi64-base gcc-mips64el-linux-gnuabi64 gettext
  gettext-base groff-base intltool-debian libarchive-zip-perl
  libatomic1:mips64el libatomic1-mips64el-cross libaudit1:mips64el
  libc6:mips64el libc6-dev:mips64el libc6-dev-mips64el-cross
  libc6-mips64el-cross libcap-ng0:mips64el libcom-err2:mips64el
  libconfig-auto-perl libconfig-inifiles-perl libcrypt-dev:mips64el
  libcrypt1:mips64el libdb-dev:mips64el libdb5.3-dev:mips64el
  libdb5.3t64:mips64el libdebhelper-perl libdebian-dpkgcross-perl libelf1t64
  libexpat1:mips64el libexpat1-dev:mips64el libfakeroot libfile-homedir-perl
  libfile-stripnondeterminism-perl libfile-which-perl libgcc-14-dev:mips64el
  libgcc-14-dev-mips64el-cross libgcc-s1:mips64el libgcc-s1-mips64el-cross
  libgomp1:mips64el libgomp1-mips64el-cross libgsasl-dev:mips64el
  libgsasl18:mips64el libgssapi-krb5-2:mips64el libgssglue-dev:mips64el
  libgssglue1:mips64el libhttp-parser-dev:mips64el libhttp-parser2.9:mips64el
  libicu72 libidn-dev:mips64el libidn12:mips64el libio-string-perl
  libk5crypto3:mips64el libkeyutils1:mips64el libkrb5-3:mips64el
  libkrb5support0:mips64el libldap-dev:mips64el libldap2:mips64el
  liblocale-gettext-perl libmagic-mgc libmagic1t64 libmariadb-dev:mips64el
  libmariadb-dev-compat:mips64el libmariadb3:mips64el libncursesw6
  libntlm0:mips64el libntlm0-dev:mips64el libpam0g:mips64el
  libpam0g-dev:mips64el libpipeline1 libpkgconf3 libpq-dev:mips64el
  libpq5:mips64el libproc2-0 libsasl2-2:mips64el libsasl2-modules-db:mips64el
  libsqlite3-0:mips64el libsqlite3-dev:mips64el libssl-dev:mips64el
  libssl3t64:mips64el libstdc++-14-dev:mips64el
  libstdc++-14-dev-mips64el-cross libstdc++6:mips64el
  libstdc++6-mips64el-cross libsubunit-dev:mips64el libsubunit0:mips64el
  libtext-charwidth-perl libtext-wrapi18n-perl libtool libuchardet0
  libudns-dev:mips64el libudns0t64:mips64el libunistring5 libxml-libxml-perl
  libxml-namespacesupport-perl libxml-sax-base-perl libxml-sax-perl
  libxml-simple-perl libxml2 libyaml-perl libzstd1:mips64el
  linux-libc-dev-mips64el-cross m4 man-db mariadb-common mysql-common
  pkgconf:mips64el pkgconf-bin po-debconf procps
  sbuild-build-depends-main-dummy:mips64el sensible-utils ucf zlib1g:mips64el
  zlib1g-dev:mips64el
0 upgraded, 136 newly installed, 0 to remove and 0 not upgraded.
Need to get 94.0 MB of archives.
After this operation, 394 MB of additional disk space will be used.
Get:1 copy:/<<RESOLVERDIR>>/apt_archive ./ sbuild-build-depends-main-dummy 0.invalid.0 [1028 B]
Get:2 http://localhost:3142/debian unstable/main amd64 liblocale-gettext-perl amd64 1.07-7+b1 [15.3 kB]
Get:3 http://localhost:3142/debian unstable/main amd64 libncursesw6 amd64 6.5+20250216-1 [136 kB]
Get:4 http://localhost:3142/debian unstable/main amd64 libproc2-0 amd64 2:4.0.4-7 [64.9 kB]
Get:5 http://localhost:3142/debian unstable/main amd64 procps amd64 2:4.0.4-7 [878 kB]
Get:6 http://localhost:3142/debian unstable/main amd64 sensible-utils all 0.0.24 [24.8 kB]
Get:7 http://localhost:3142/debian unstable/main amd64 libmagic-mgc amd64 1:5.45-3+b1 [314 kB]
Get:8 http://localhost:3142/debian unstable/main amd64 libmagic1t64 amd64 1:5.45-3+b1 [108 kB]
Get:9 http://localhost:3142/debian unstable/main amd64 file amd64 1:5.45-3+b1 [43.3 kB]
Get:10 http://localhost:3142/debian unstable/main amd64 gettext-base amd64 0.23.1-1 [243 kB]
Get:11 http://localhost:3142/debian unstable/main amd64 libuchardet0 amd64 0.0.8-1+b2 [68.9 kB]
Get:12 http://localhost:3142/debian unstable/main amd64 groff-base amd64 1.23.0-7 [1185 kB]
Get:13 http://localhost:3142/debian unstable/main amd64 bsdextrautils amd64 2.40.4-5 [92.4 kB]
Get:14 http://localhost:3142/debian unstable/main amd64 libpipeline1 amd64 1.5.8-1 [42.0 kB]
Get:15 http://localhost:3142/debian unstable/main amd64 man-db amd64 2.13.0-1 [1420 kB]
Get:16 http://localhost:3142/debian unstable/main amd64 libtext-charwidth-perl amd64 0.04-11+b4 [9476 B]
Get:17 http://localhost:3142/debian unstable/main amd64 libtext-wrapi18n-perl all 0.06-10 [8808 B]
Get:18 http://localhost:3142/debian unstable/main amd64 ucf all 3.0050 [42.7 kB]
Get:19 http://localhost:3142/debian unstable/main amd64 m4 amd64 1.4.19-5 [294 kB]
Get:20 http://localhost:3142/debian unstable/main amd64 autoconf all 2.72-3 [493 kB]
Get:21 http://localhost:3142/debian unstable/main amd64 autotools-dev all 20220109.1 [51.6 kB]
Get:22 http://localhost:3142/debian unstable/main amd64 automake all 1:1.17-3 [862 kB]
Get:23 http://localhost:3142/debian unstable/main amd64 autopoint all 0.23.1-1 [770 kB]
Get:24 http://localhost:3142/debian unstable/main amd64 binutils-mips64el-linux-gnuabi64 amd64 2.43.50.20241230-1cross1+nmu1 [2903 kB]
Get:25 http://localhost:3142/debian unstable/main mips64el gcc-14-base mips64el 14.2.0-17 [49.1 kB]
Get:26 http://localhost:3142/debian unstable/main mips64el libgcc-s1 mips64el 14.2.0-17 [86.3 kB]
Get:27 http://localhost:3142/debian unstable/main mips64el libc6 mips64el 2.40-7 [2474 kB]
Get:28 http://localhost:3142/debian unstable/main mips64el libsubunit0 mips64el 1.4.2-3+b1 [6464 B]
Get:29 http://localhost:3142/debian unstable/main mips64el libsubunit-dev mips64el 1.4.2-3+b1 [7596 B]
Get:30 http://localhost:3142/debian unstable/main mips64el check mips64el 0.15.2-3 [116 kB]
Get:31 http://localhost:3142/debian unstable/main amd64 gcc-14-mips64el-linux-gnuabi64-base amd64 14.2.0-13cross1 [48.8 kB]
Get:32 http://localhost:3142/debian unstable/main amd64 cpp-14-mips64el-linux-gnuabi64 amd64 14.2.0-13cross1 [9700 kB]
Get:33 http://localhost:3142/debian unstable/main amd64 cpp-mips64el-linux-gnuabi64 amd64 4:14.2.0-1 [3408 B]
Get:34 http://localhost:3142/debian unstable/main amd64 cross-config all 2.6.20 [16.3 kB]
Get:35 http://localhost:3142/debian unstable/main amd64 gcc-14-cross-base-mipsen all 14.2.0-13cross1 [44.1 kB]
Get:36 http://localhost:3142/debian unstable/main amd64 libc6-mips64el-cross all 2.40-5cross1 [1145 kB]
Get:37 http://localhost:3142/debian unstable/main amd64 libgcc-s1-mips64el-cross all 14.2.0-13cross1 [86.3 kB]
Get:38 http://localhost:3142/debian unstable/main amd64 libgomp1-mips64el-cross all 14.2.0-13cross1 [118 kB]
Get:39 http://localhost:3142/debian unstable/main amd64 libatomic1-mips64el-cross all 14.2.0-13cross1 [7676 B]
Get:40 http://localhost:3142/debian unstable/main amd64 libgcc-14-dev-mips64el-cross all 14.2.0-13cross1 [330 kB]
Get:41 http://localhost:3142/debian unstable/main amd64 gcc-14-mips64el-linux-gnuabi64 amd64 14.2.0-13cross1 [18.5 MB]
Get:42 http://localhost:3142/debian unstable/main amd64 gcc-mips64el-linux-gnuabi64 amd64 4:14.2.0-1 [1460 B]
Get:43 http://localhost:3142/debian unstable/main amd64 libstdc++6-mips64el-cross all 14.2.0-13cross1 [620 kB]
Get:44 http://localhost:3142/debian unstable/main amd64 linux-libc-dev-mips64el-cross all 6.12.8-1cross1 [2311 kB]
Get:45 http://localhost:3142/debian unstable/main amd64 libc6-dev-mips64el-cross all 2.40-5cross1 [1644 kB]
Get:46 http://localhost:3142/debian unstable/main amd64 libstdc++-14-dev-mips64el-cross all 14.2.0-13cross1 [2452 kB]
Get:47 http://localhost:3142/debian unstable/main amd64 g++-14-mips64el-linux-gnuabi64 amd64 14.2.0-13cross1 [10.7 MB]
Get:48 http://localhost:3142/debian unstable/main amd64 g++-mips64el-linux-gnuabi64 amd64 4:14.2.0-1 [1212 B]
Get:49 http://localhost:3142/debian unstable/main amd64 libconfig-inifiles-perl all 3.000003-3 [44.8 kB]
Get:50 http://localhost:3142/debian unstable/main amd64 libio-string-perl all 1.08-4 [12.1 kB]
Get:51 http://localhost:3142/debian unstable/main amd64 libicu72 amd64 72.1-6 [9421 kB]
Get:52 http://localhost:3142/debian unstable/main amd64 libxml2 amd64 2.12.7+dfsg+really2.9.14-0.2+b2 [699 kB]
Get:53 http://localhost:3142/debian unstable/main amd64 libxml-namespacesupport-perl all 1.12-2 [15.1 kB]
Get:54 http://localhost:3142/debian unstable/main amd64 libxml-sax-base-perl all 1.09-3 [20.6 kB]
Get:55 http://localhost:3142/debian unstable/main amd64 libxml-sax-perl all 1.02+dfsg-4 [53.4 kB]
Get:56 http://localhost:3142/debian unstable/main amd64 libxml-libxml-perl amd64 2.0207+dfsg+really+2.0134-5+b2 [314 kB]
Get:57 http://localhost:3142/debian unstable/main amd64 libxml-simple-perl all 2.25-2 [69.8 kB]
Get:58 http://localhost:3142/debian unstable/main amd64 libyaml-perl all 1.31-1 [64.8 kB]
Get:59 http://localhost:3142/debian unstable/main amd64 libconfig-auto-perl all 0.44-2 [19.2 kB]
Get:60 http://localhost:3142/debian unstable/main amd64 libfile-which-perl all 1.27-2 [15.1 kB]
Get:61 http://localhost:3142/debian unstable/main amd64 libfile-homedir-perl all 1.006-2 [42.4 kB]
Get:62 http://localhost:3142/debian unstable/main amd64 libdebian-dpkgcross-perl all 2.6.20 [15.3 kB]
Get:63 http://localhost:3142/debian unstable/main amd64 dpkg-cross all 2.6.20 [25.8 kB]
Get:64 http://localhost:3142/debian unstable/main amd64 crossbuild-essential-mips64el all 12.9 [6740 B]
Get:65 http://localhost:3142/debian unstable/main amd64 libdebhelper-perl all 13.24.1 [90.9 kB]
Get:66 http://localhost:3142/debian unstable/main amd64 libtool all 2.5.4-3 [539 kB]
Get:67 http://localhost:3142/debian unstable/main amd64 dh-autoreconf all 20 [17.1 kB]
Get:68 http://localhost:3142/debian unstable/main amd64 libarchive-zip-perl all 1.68-1 [104 kB]
Get:69 http://localhost:3142/debian unstable/main amd64 libfile-stripnondeterminism-perl all 1.14.1-2 [19.7 kB]
Get:70 http://localhost:3142/debian unstable/main amd64 dh-strip-nondeterminism all 1.14.1-2 [8620 B]
Get:71 http://localhost:3142/debian unstable/main amd64 libelf1t64 amd64 0.192-4 [189 kB]
Get:72 http://localhost:3142/debian unstable/main amd64 dwz amd64 0.15-1+b1 [110 kB]
Get:73 http://localhost:3142/debian unstable/main amd64 libunistring5 amd64 1.3-1 [476 kB]
Get:74 http://localhost:3142/debian unstable/main amd64 gettext amd64 0.23.1-1 [1680 kB]
Get:75 http://localhost:3142/debian unstable/main amd64 intltool-debian all 0.35.0+20060710.6 [22.9 kB]
Get:76 http://localhost:3142/debian unstable/main amd64 po-debconf all 1.0.21+nmu1 [248 kB]
Get:77 http://localhost:3142/debian unstable/main amd64 debhelper all 13.24.1 [920 kB]
Get:78 http://localhost:3142/debian unstable/main amd64 mysql-common all 5.8+1.1.1 [6784 B]
Get:79 http://localhost:3142/debian unstable/main amd64 mariadb-common all 1:11.4.5-1 [28.4 kB]
Get:80 http://localhost:3142/debian unstable/main mips64el libzstd1 mips64el 1.5.6+dfsg-2 [292 kB]
Get:81 http://localhost:3142/debian unstable/main mips64el zlib1g mips64el 1:1.3.dfsg+really1.3.1-1+b1 [80.3 kB]
Get:82 http://localhost:3142/debian unstable/main mips64el libssl3t64 mips64el 3.4.1-1 [1732 kB]
Get:83 http://localhost:3142/debian unstable/main mips64el libmariadb3 mips64el 1:11.4.5-1 [180 kB]
Get:84 http://localhost:3142/debian unstable/main mips64el libssl-dev mips64el 3.4.1-1 [2645 kB]
Get:85 http://localhost:3142/debian unstable/main mips64el libcrypt1 mips64el 1:4.4.38-1 [96.3 kB]
Get:86 http://localhost:3142/debian unstable/main mips64el libcrypt-dev mips64el 1:4.4.38-1 [129 kB]
Get:87 http://localhost:3142/debian unstable/main mips64el libc6-dev mips64el 2.40-7 [1654 kB]
Get:88 http://localhost:3142/debian unstable/main mips64el zlib1g-dev mips64el 1:1.3.dfsg+really1.3.1-1+b1 [914 kB]
Get:89 http://localhost:3142/debian unstable/main mips64el libmariadb-dev mips64el 1:11.4.5-1 [279 kB]
Get:90 http://localhost:3142/debian unstable/main mips64el libmariadb-dev-compat mips64el 1:11.4.5-1 [27.2 kB]
Get:91 http://localhost:3142/debian unstable/main mips64el default-libmysqlclient-dev mips64el 1.1.1 [3252 B]
Get:92 http://localhost:3142/debian unstable/main amd64 libfakeroot amd64 1.37-1 [29.7 kB]
Get:93 http://localhost:3142/debian unstable/main amd64 fakeroot amd64 1.37-1 [75.6 kB]
Get:94 http://localhost:3142/debian unstable/main mips64el libatomic1 mips64el 14.2.0-17 [7984 B]
Get:95 http://localhost:3142/debian unstable/main mips64el libcap-ng0 mips64el 0.8.5-4+b1 [17.0 kB]
Get:96 http://localhost:3142/debian unstable/main mips64el libaudit1 mips64el 1:4.0.2-2+b2 [50.7 kB]
Get:97 http://localhost:3142/debian unstable/main mips64el libcom-err2 mips64el 1.47.2-1 [24.2 kB]
Get:98 http://localhost:3142/debian unstable/main mips64el libdb5.3t64 mips64el 5.3.28+dfsg2-9 [608 kB]
Get:99 http://localhost:3142/debian unstable/main mips64el libdb5.3-dev mips64el 5.3.28+dfsg2-9 [815 kB]
Get:100 http://localhost:3142/debian unstable/main mips64el libdb-dev mips64el 5.3.4 [2076 B]
Get:101 http://localhost:3142/debian unstable/main mips64el libexpat1 mips64el 2.6.4-1 [100 kB]
Get:102 http://localhost:3142/debian unstable/main mips64el libexpat1-dev mips64el 2.6.4-1 [158 kB]
Get:103 http://localhost:3142/debian unstable/main mips64el libgomp1 mips64el 14.2.0-17 [121 kB]
Get:104 http://localhost:3142/debian unstable/main mips64el libgcc-14-dev mips64el 14.2.0-17 [330 kB]
Get:105 http://localhost:3142/debian unstable/main mips64el libgssglue1 mips64el 0.9-1+b1 [19.4 kB]
Get:106 http://localhost:3142/debian unstable/main mips64el libidn12 mips64el 1.42-3 [79.5 kB]
Get:107 http://localhost:3142/debian unstable/main mips64el libntlm0 mips64el 1.8-3+b1 [23.2 kB]
Get:108 http://localhost:3142/debian unstable/main mips64el libgsasl18 mips64el 2.2.1-1+b2 [205 kB]
Get:109 http://localhost:3142/debian unstable/main mips64el libgssglue-dev mips64el 0.9-1+b1 [29.9 kB]
Get:110 http://localhost:3142/debian unstable/main amd64 libpkgconf3 amd64 1.8.1-4 [36.4 kB]
Get:111 http://localhost:3142/debian unstable/main amd64 pkgconf-bin amd64 1.8.1-4 [30.2 kB]
Get:112 http://localhost:3142/debian unstable/main mips64el pkgconf mips64el 1.8.1-4 [26.2 kB]
Get:113 http://localhost:3142/debian unstable/main mips64el libidn-dev mips64el 1.42-3 [188 kB]
Get:114 http://localhost:3142/debian unstable/main mips64el libntlm0-dev mips64el 1.8-3+b1 [18.1 kB]
Get:115 http://localhost:3142/debian unstable/main mips64el libgsasl-dev mips64el 2.2.1-1+b2 [255 kB]
Get:116 http://localhost:3142/debian unstable/main mips64el libkrb5support0 mips64el 1.21.3-4 [31.5 kB]
Get:117 http://localhost:3142/debian unstable/main mips64el libk5crypto3 mips64el 1.21.3-4 [86.3 kB]
Get:118 http://localhost:3142/debian unstable/main mips64el libkeyutils1 mips64el 1.6.3-4 [8664 B]
Get:119 http://localhost:3142/debian unstable/main mips64el libkrb5-3 mips64el 1.21.3-4 [295 kB]
Get:120 http://localhost:3142/debian unstable/main mips64el libgssapi-krb5-2 mips64el 1.21.3-4 [123 kB]
Get:121 http://localhost:3142/debian unstable/main mips64el libhttp-parser2.9 mips64el 2.9.4-6+b2 [21.2 kB]
Get:122 http://localhost:3142/debian unstable/main mips64el libhttp-parser-dev mips64el 2.9.4-6+b2 [22.2 kB]
Get:123 http://localhost:3142/debian unstable/main mips64el libsasl2-modules-db mips64el 2.1.28+dfsg1-8+b1 [19.4 kB]
Get:124 http://localhost:3142/debian unstable/main mips64el libsasl2-2 mips64el 2.1.28+dfsg1-8+b1 [53.3 kB]
Get:125 http://localhost:3142/debian unstable/main mips64el libldap2 mips64el 2.6.9+dfsg-1 [171 kB]
Get:126 http://localhost:3142/debian unstable/main mips64el libldap-dev mips64el 2.6.9+dfsg-1 [319 kB]
Get:127 http://localhost:3142/debian unstable/main mips64el libpam0g mips64el 1.7.0-3 [67.3 kB]
Get:128 http://localhost:3142/debian unstable/main mips64el libpam0g-dev mips64el 1.7.0-3 [70.9 kB]
Get:129 http://localhost:3142/debian unstable/main mips64el libpq5 mips64el 17.4-1 [217 kB]
Get:130 http://localhost:3142/debian unstable/main mips64el libpq-dev mips64el 17.4-1 [154 kB]
Get:131 http://localhost:3142/debian unstable/main mips64el libsqlite3-0 mips64el 3.46.1-1 [843 kB]
Get:132 http://localhost:3142/debian unstable/main mips64el libsqlite3-dev mips64el 3.46.1-1 [1135 kB]
Get:133 http://localhost:3142/debian unstable/main mips64el libstdc++6 mips64el 14.2.0-17 [668 kB]
Get:134 http://localhost:3142/debian unstable/main mips64el libstdc++-14-dev mips64el 14.2.0-17 [2453 kB]
Get:135 http://localhost:3142/debian unstable/main mips64el libudns0t64 mips64el 0.6-1 [22.8 kB]
Get:136 http://localhost:3142/debian unstable/main mips64el libudns-dev mips64el 0.6-1 [56.3 kB]
Preconfiguring packages ...
Fetched 94.0 MB in 0s (191 MB/s)
Selecting previously unselected package liblocale-gettext-perl.
(Reading database ... 12839 files and directories currently installed.)
Preparing to unpack .../000-liblocale-gettext-perl_1.07-7+b1_amd64.deb ...
Unpacking liblocale-gettext-perl (1.07-7+b1) ...
Selecting previously unselected package libncursesw6:amd64.
Preparing to unpack .../001-libncursesw6_6.5+20250216-1_amd64.deb ...
Unpacking libncursesw6:amd64 (6.5+20250216-1) ...
Selecting previously unselected package libproc2-0:amd64.
Preparing to unpack .../002-libproc2-0_2%3a4.0.4-7_amd64.deb ...
Unpacking libproc2-0:amd64 (2:4.0.4-7) ...
Selecting previously unselected package procps.
Preparing to unpack .../003-procps_2%3a4.0.4-7_amd64.deb ...
Unpacking procps (2:4.0.4-7) ...
Selecting previously unselected package sensible-utils.
Preparing to unpack .../004-sensible-utils_0.0.24_all.deb ...
Unpacking sensible-utils (0.0.24) ...
Selecting previously unselected package libmagic-mgc.
Preparing to unpack .../005-libmagic-mgc_1%3a5.45-3+b1_amd64.deb ...
Unpacking libmagic-mgc (1:5.45-3+b1) ...
Selecting previously unselected package libmagic1t64:amd64.
Preparing to unpack .../006-libmagic1t64_1%3a5.45-3+b1_amd64.deb ...
Unpacking libmagic1t64:amd64 (1:5.45-3+b1) ...
Selecting previously unselected package file.
Preparing to unpack .../007-file_1%3a5.45-3+b1_amd64.deb ...
Unpacking file (1:5.45-3+b1) ...
Selecting previously unselected package gettext-base.
Preparing to unpack .../008-gettext-base_0.23.1-1_amd64.deb ...
Unpacking gettext-base (0.23.1-1) ...
Selecting previously unselected package libuchardet0:amd64.
Preparing to unpack .../009-libuchardet0_0.0.8-1+b2_amd64.deb ...
Unpacking libuchardet0:amd64 (0.0.8-1+b2) ...
Selecting previously unselected package groff-base.
Preparing to unpack .../010-groff-base_1.23.0-7_amd64.deb ...
Unpacking groff-base (1.23.0-7) ...
Selecting previously unselected package bsdextrautils.
Preparing to unpack .../011-bsdextrautils_2.40.4-5_amd64.deb ...
Unpacking bsdextrautils (2.40.4-5) ...
Selecting previously unselected package libpipeline1:amd64.
Preparing to unpack .../012-libpipeline1_1.5.8-1_amd64.deb ...
Unpacking libpipeline1:amd64 (1.5.8-1) ...
Selecting previously unselected package man-db.
Preparing to unpack .../013-man-db_2.13.0-1_amd64.deb ...
Unpacking man-db (2.13.0-1) ...
Selecting previously unselected package libtext-charwidth-perl:amd64.
Preparing to unpack .../014-libtext-charwidth-perl_0.04-11+b4_amd64.deb ...
Unpacking libtext-charwidth-perl:amd64 (0.04-11+b4) ...
Selecting previously unselected package libtext-wrapi18n-perl.
Preparing to unpack .../015-libtext-wrapi18n-perl_0.06-10_all.deb ...
Unpacking libtext-wrapi18n-perl (0.06-10) ...
Selecting previously unselected package ucf.
Preparing to unpack .../016-ucf_3.0050_all.deb ...
Moving old data out of the way
Unpacking ucf (3.0050) ...
Selecting previously unselected package m4.
Preparing to unpack .../017-m4_1.4.19-5_amd64.deb ...
Unpacking m4 (1.4.19-5) ...
Selecting previously unselected package autoconf.
Preparing to unpack .../018-autoconf_2.72-3_all.deb ...
Unpacking autoconf (2.72-3) ...
Selecting previously unselected package autotools-dev.
Preparing to unpack .../019-autotools-dev_20220109.1_all.deb ...
Unpacking autotools-dev (20220109.1) ...
Selecting previously unselected package automake.
Preparing to unpack .../020-automake_1%3a1.17-3_all.deb ...
Unpacking automake (1:1.17-3) ...
Selecting previously unselected package autopoint.
Preparing to unpack .../021-autopoint_0.23.1-1_all.deb ...
Unpacking autopoint (0.23.1-1) ...
Selecting previously unselected package binutils-mips64el-linux-gnuabi64.
Preparing to unpack .../022-binutils-mips64el-linux-gnuabi64_2.43.50.20241230-1cross1+nmu1_amd64.deb ...
Unpacking binutils-mips64el-linux-gnuabi64 (2.43.50.20241230-1cross1+nmu1) ...
Selecting previously unselected package gcc-14-base:mips64el.
Preparing to unpack .../023-gcc-14-base_14.2.0-17_mips64el.deb ...
Unpacking gcc-14-base:mips64el (14.2.0-17) ...
Selecting previously unselected package libgcc-s1:mips64el.
Preparing to unpack .../024-libgcc-s1_14.2.0-17_mips64el.deb ...
Unpacking libgcc-s1:mips64el (14.2.0-17) ...
Selecting previously unselected package libc6:mips64el.
Preparing to unpack .../025-libc6_2.40-7_mips64el.deb ...
Unpacking libc6:mips64el (2.40-7) ...
Selecting previously unselected package libsubunit0:mips64el.
Preparing to unpack .../026-libsubunit0_1.4.2-3+b1_mips64el.deb ...
Unpacking libsubunit0:mips64el (1.4.2-3+b1) ...
Selecting previously unselected package libsubunit-dev:mips64el.
Preparing to unpack .../027-libsubunit-dev_1.4.2-3+b1_mips64el.deb ...
Unpacking libsubunit-dev:mips64el (1.4.2-3+b1) ...
Selecting previously unselected package check:mips64el.
Preparing to unpack .../028-check_0.15.2-3_mips64el.deb ...
Unpacking check:mips64el (0.15.2-3) ...
Selecting previously unselected package gcc-14-mips64el-linux-gnuabi64-base:amd64.
Preparing to unpack .../029-gcc-14-mips64el-linux-gnuabi64-base_14.2.0-13cross1_amd64.deb ...
Unpacking gcc-14-mips64el-linux-gnuabi64-base:amd64 (14.2.0-13cross1) ...
Selecting previously unselected package cpp-14-mips64el-linux-gnuabi64.
Preparing to unpack .../030-cpp-14-mips64el-linux-gnuabi64_14.2.0-13cross1_amd64.deb ...
Unpacking cpp-14-mips64el-linux-gnuabi64 (14.2.0-13cross1) ...
Selecting previously unselected package cpp-mips64el-linux-gnuabi64.
Preparing to unpack .../031-cpp-mips64el-linux-gnuabi64_4%3a14.2.0-1_amd64.deb ...
Unpacking cpp-mips64el-linux-gnuabi64 (4:14.2.0-1) ...
Selecting previously unselected package cross-config.
Preparing to unpack .../032-cross-config_2.6.20_all.deb ...
Unpacking cross-config (2.6.20) ...
Selecting previously unselected package gcc-14-cross-base-mipsen.
Preparing to unpack .../033-gcc-14-cross-base-mipsen_14.2.0-13cross1_all.deb ...
Unpacking gcc-14-cross-base-mipsen (14.2.0-13cross1) ...
Selecting previously unselected package libc6-mips64el-cross.
Preparing to unpack .../034-libc6-mips64el-cross_2.40-5cross1_all.deb ...
Unpacking libc6-mips64el-cross (2.40-5cross1) ...
Selecting previously unselected package libgcc-s1-mips64el-cross.
Preparing to unpack .../035-libgcc-s1-mips64el-cross_14.2.0-13cross1_all.deb ...
Unpacking libgcc-s1-mips64el-cross (14.2.0-13cross1) ...
Selecting previously unselected package libgomp1-mips64el-cross.
Preparing to unpack .../036-libgomp1-mips64el-cross_14.2.0-13cross1_all.deb ...
Unpacking libgomp1-mips64el-cross (14.2.0-13cross1) ...
Selecting previously unselected package libatomic1-mips64el-cross.
Preparing to unpack .../037-libatomic1-mips64el-cross_14.2.0-13cross1_all.deb ...
Unpacking libatomic1-mips64el-cross (14.2.0-13cross1) ...
Selecting previously unselected package libgcc-14-dev-mips64el-cross.
Preparing to unpack .../038-libgcc-14-dev-mips64el-cross_14.2.0-13cross1_all.deb ...
Unpacking libgcc-14-dev-mips64el-cross (14.2.0-13cross1) ...
Selecting previously unselected package gcc-14-mips64el-linux-gnuabi64.
Preparing to unpack .../039-gcc-14-mips64el-linux-gnuabi64_14.2.0-13cross1_amd64.deb ...
Unpacking gcc-14-mips64el-linux-gnuabi64 (14.2.0-13cross1) ...
Selecting previously unselected package gcc-mips64el-linux-gnuabi64.
Preparing to unpack .../040-gcc-mips64el-linux-gnuabi64_4%3a14.2.0-1_amd64.deb ...
Unpacking gcc-mips64el-linux-gnuabi64 (4:14.2.0-1) ...
Selecting previously unselected package libstdc++6-mips64el-cross.
Preparing to unpack .../041-libstdc++6-mips64el-cross_14.2.0-13cross1_all.deb ...
Unpacking libstdc++6-mips64el-cross (14.2.0-13cross1) ...
Selecting previously unselected package linux-libc-dev-mips64el-cross.
Preparing to unpack .../042-linux-libc-dev-mips64el-cross_6.12.8-1cross1_all.deb ...
Unpacking linux-libc-dev-mips64el-cross (6.12.8-1cross1) ...
Selecting previously unselected package libc6-dev-mips64el-cross.
Preparing to unpack .../043-libc6-dev-mips64el-cross_2.40-5cross1_all.deb ...
Unpacking libc6-dev-mips64el-cross (2.40-5cross1) ...
Selecting previously unselected package libstdc++-14-dev-mips64el-cross.
Preparing to unpack .../044-libstdc++-14-dev-mips64el-cross_14.2.0-13cross1_all.deb ...
Unpacking libstdc++-14-dev-mips64el-cross (14.2.0-13cross1) ...
Selecting previously unselected package g++-14-mips64el-linux-gnuabi64.
Preparing to unpack .../045-g++-14-mips64el-linux-gnuabi64_14.2.0-13cross1_amd64.deb ...
Unpacking g++-14-mips64el-linux-gnuabi64 (14.2.0-13cross1) ...
Selecting previously unselected package g++-mips64el-linux-gnuabi64.
Preparing to unpack .../046-g++-mips64el-linux-gnuabi64_4%3a14.2.0-1_amd64.deb ...
Unpacking g++-mips64el-linux-gnuabi64 (4:14.2.0-1) ...
Selecting previously unselected package libconfig-inifiles-perl.
Preparing to unpack .../047-libconfig-inifiles-perl_3.000003-3_all.deb ...
Unpacking libconfig-inifiles-perl (3.000003-3) ...
Selecting previously unselected package libio-string-perl.
Preparing to unpack .../048-libio-string-perl_1.08-4_all.deb ...
Unpacking libio-string-perl (1.08-4) ...
Selecting previously unselected package libicu72:amd64.
Preparing to unpack .../049-libicu72_72.1-6_amd64.deb ...
Unpacking libicu72:amd64 (72.1-6) ...
Selecting previously unselected package libxml2:amd64.
Preparing to unpack .../050-libxml2_2.12.7+dfsg+really2.9.14-0.2+b2_amd64.deb ...
Unpacking libxml2:amd64 (2.12.7+dfsg+really2.9.14-0.2+b2) ...
Selecting previously unselected package libxml-namespacesupport-perl.
Preparing to unpack .../051-libxml-namespacesupport-perl_1.12-2_all.deb ...
Unpacking libxml-namespacesupport-perl (1.12-2) ...
Selecting previously unselected package libxml-sax-base-perl.
Preparing to unpack .../052-libxml-sax-base-perl_1.09-3_all.deb ...
Unpacking libxml-sax-base-perl (1.09-3) ...
Selecting previously unselected package libxml-sax-perl.
Preparing to unpack .../053-libxml-sax-perl_1.02+dfsg-4_all.deb ...
Unpacking libxml-sax-perl (1.02+dfsg-4) ...
Selecting previously unselected package libxml-libxml-perl.
Preparing to unpack .../054-libxml-libxml-perl_2.0207+dfsg+really+2.0134-5+b2_amd64.deb ...
Unpacking libxml-libxml-perl (2.0207+dfsg+really+2.0134-5+b2) ...
Selecting previously unselected package libxml-simple-perl.
Preparing to unpack .../055-libxml-simple-perl_2.25-2_all.deb ...
Unpacking libxml-simple-perl (2.25-2) ...
Selecting previously unselected package libyaml-perl.
Preparing to unpack .../056-libyaml-perl_1.31-1_all.deb ...
Unpacking libyaml-perl (1.31-1) ...
Selecting previously unselected package libconfig-auto-perl.
Preparing to unpack .../057-libconfig-auto-perl_0.44-2_all.deb ...
Unpacking libconfig-auto-perl (0.44-2) ...
Selecting previously unselected package libfile-which-perl.
Preparing to unpack .../058-libfile-which-perl_1.27-2_all.deb ...
Unpacking libfile-which-perl (1.27-2) ...
Selecting previously unselected package libfile-homedir-perl.
Preparing to unpack .../059-libfile-homedir-perl_1.006-2_all.deb ...
Unpacking libfile-homedir-perl (1.006-2) ...
Selecting previously unselected package libdebian-dpkgcross-perl.
Preparing to unpack .../060-libdebian-dpkgcross-perl_2.6.20_all.deb ...
Unpacking libdebian-dpkgcross-perl (2.6.20) ...
Selecting previously unselected package dpkg-cross.
Preparing to unpack .../061-dpkg-cross_2.6.20_all.deb ...
Unpacking dpkg-cross (2.6.20) ...
Selecting previously unselected package crossbuild-essential-mips64el.
Preparing to unpack .../062-crossbuild-essential-mips64el_12.9_all.deb ...
Unpacking crossbuild-essential-mips64el (12.9) ...
Selecting previously unselected package libdebhelper-perl.
Preparing to unpack .../063-libdebhelper-perl_13.24.1_all.deb ...
Unpacking libdebhelper-perl (13.24.1) ...
Selecting previously unselected package libtool.
Preparing to unpack .../064-libtool_2.5.4-3_all.deb ...
Unpacking libtool (2.5.4-3) ...
Selecting previously unselected package dh-autoreconf.
Preparing to unpack .../065-dh-autoreconf_20_all.deb ...
Unpacking dh-autoreconf (20) ...
Selecting previously unselected package libarchive-zip-perl.
Preparing to unpack .../066-libarchive-zip-perl_1.68-1_all.deb ...
Unpacking libarchive-zip-perl (1.68-1) ...
Selecting previously unselected package libfile-stripnondeterminism-perl.
Preparing to unpack .../067-libfile-stripnondeterminism-perl_1.14.1-2_all.deb ...
Unpacking libfile-stripnondeterminism-perl (1.14.1-2) ...
Selecting previously unselected package dh-strip-nondeterminism.
Preparing to unpack .../068-dh-strip-nondeterminism_1.14.1-2_all.deb ...
Unpacking dh-strip-nondeterminism (1.14.1-2) ...
Selecting previously unselected package libelf1t64:amd64.
Preparing to unpack .../069-libelf1t64_0.192-4_amd64.deb ...
Unpacking libelf1t64:amd64 (0.192-4) ...
Selecting previously unselected package dwz.
Preparing to unpack .../070-dwz_0.15-1+b1_amd64.deb ...
Unpacking dwz (0.15-1+b1) ...
Selecting previously unselected package libunistring5:amd64.
Preparing to unpack .../071-libunistring5_1.3-1_amd64.deb ...
Unpacking libunistring5:amd64 (1.3-1) ...
Selecting previously unselected package gettext.
Preparing to unpack .../072-gettext_0.23.1-1_amd64.deb ...
Unpacking gettext (0.23.1-1) ...
Selecting previously unselected package intltool-debian.
Preparing to unpack .../073-intltool-debian_0.35.0+20060710.6_all.deb ...
Unpacking intltool-debian (0.35.0+20060710.6) ...
Selecting previously unselected package po-debconf.
Preparing to unpack .../074-po-debconf_1.0.21+nmu1_all.deb ...
Unpacking po-debconf (1.0.21+nmu1) ...
Selecting previously unselected package debhelper.
Preparing to unpack .../075-debhelper_13.24.1_all.deb ...
Unpacking debhelper (13.24.1) ...
Selecting previously unselected package mysql-common.
Preparing to unpack .../076-mysql-common_5.8+1.1.1_all.deb ...
Unpacking mysql-common (5.8+1.1.1) ...
Selecting previously unselected package mariadb-common.
Preparing to unpack .../077-mariadb-common_1%3a11.4.5-1_all.deb ...
Unpacking mariadb-common (1:11.4.5-1) ...
Selecting previously unselected package libzstd1:mips64el.
Preparing to unpack .../078-libzstd1_1.5.6+dfsg-2_mips64el.deb ...
Unpacking libzstd1:mips64el (1.5.6+dfsg-2) ...
Selecting previously unselected package zlib1g:mips64el.
Preparing to unpack .../079-zlib1g_1%3a1.3.dfsg+really1.3.1-1+b1_mips64el.deb ...
Unpacking zlib1g:mips64el (1:1.3.dfsg+really1.3.1-1+b1) ...
Selecting previously unselected package libssl3t64:mips64el.
Preparing to unpack .../080-libssl3t64_3.4.1-1_mips64el.deb ...
Unpacking libssl3t64:mips64el (3.4.1-1) ...
Selecting previously unselected package libmariadb3:mips64el.
Preparing to unpack .../081-libmariadb3_1%3a11.4.5-1_mips64el.deb ...
Unpacking libmariadb3:mips64el (1:11.4.5-1) ...
Selecting previously unselected package libssl-dev:mips64el.
Preparing to unpack .../082-libssl-dev_3.4.1-1_mips64el.deb ...
Unpacking libssl-dev:mips64el (3.4.1-1) ...
Selecting previously unselected package libcrypt1:mips64el.
Preparing to unpack .../083-libcrypt1_1%3a4.4.38-1_mips64el.deb ...
Unpacking libcrypt1:mips64el (1:4.4.38-1) ...
Selecting previously unselected package libcrypt-dev:mips64el.
Preparing to unpack .../084-libcrypt-dev_1%3a4.4.38-1_mips64el.deb ...
Unpacking libcrypt-dev:mips64el (1:4.4.38-1) ...
Selecting previously unselected package libc6-dev:mips64el.
Preparing to unpack .../085-libc6-dev_2.40-7_mips64el.deb ...
Unpacking libc6-dev:mips64el (2.40-7) ...
Selecting previously unselected package zlib1g-dev:mips64el.
Preparing to unpack .../086-zlib1g-dev_1%3a1.3.dfsg+really1.3.1-1+b1_mips64el.deb ...
Unpacking zlib1g-dev:mips64el (1:1.3.dfsg+really1.3.1-1+b1) ...
Selecting previously unselected package libmariadb-dev:mips64el.
Preparing to unpack .../087-libmariadb-dev_1%3a11.4.5-1_mips64el.deb ...
Unpacking libmariadb-dev:mips64el (1:11.4.5-1) ...
Selecting previously unselected package libmariadb-dev-compat:mips64el.
Preparing to unpack .../088-libmariadb-dev-compat_1%3a11.4.5-1_mips64el.deb ...
Unpacking libmariadb-dev-compat:mips64el (1:11.4.5-1) ...
Selecting previously unselected package default-libmysqlclient-dev:mips64el.
Preparing to unpack .../089-default-libmysqlclient-dev_1.1.1_mips64el.deb ...
Unpacking default-libmysqlclient-dev:mips64el (1.1.1) ...
Selecting previously unselected package libfakeroot:amd64.
Preparing to unpack .../090-libfakeroot_1.37-1_amd64.deb ...
Unpacking libfakeroot:amd64 (1.37-1) ...
Selecting previously unselected package fakeroot.
Preparing to unpack .../091-fakeroot_1.37-1_amd64.deb ...
Unpacking fakeroot (1.37-1) ...
Selecting previously unselected package libatomic1:mips64el.
Preparing to unpack .../092-libatomic1_14.2.0-17_mips64el.deb ...
Unpacking libatomic1:mips64el (14.2.0-17) ...
Selecting previously unselected package libcap-ng0:mips64el.
Preparing to unpack .../093-libcap-ng0_0.8.5-4+b1_mips64el.deb ...
Unpacking libcap-ng0:mips64el (0.8.5-4+b1) ...
Selecting previously unselected package libaudit1:mips64el.
Preparing to unpack .../094-libaudit1_1%3a4.0.2-2+b2_mips64el.deb ...
Unpacking libaudit1:mips64el (1:4.0.2-2+b2) ...
Selecting previously unselected package libcom-err2:mips64el.
Preparing to unpack .../095-libcom-err2_1.47.2-1_mips64el.deb ...
Unpacking libcom-err2:mips64el (1.47.2-1) ...
Selecting previously unselected package libdb5.3t64:mips64el.
Preparing to unpack .../096-libdb5.3t64_5.3.28+dfsg2-9_mips64el.deb ...
Unpacking libdb5.3t64:mips64el (5.3.28+dfsg2-9) ...
Selecting previously unselected package libdb5.3-dev:mips64el.
Preparing to unpack .../097-libdb5.3-dev_5.3.28+dfsg2-9_mips64el.deb ...
Unpacking libdb5.3-dev:mips64el (5.3.28+dfsg2-9) ...
Selecting previously unselected package libdb-dev:mips64el.
Preparing to unpack .../098-libdb-dev_5.3.4_mips64el.deb ...
Unpacking libdb-dev:mips64el (5.3.4) ...
Selecting previously unselected package libexpat1:mips64el.
Preparing to unpack .../099-libexpat1_2.6.4-1_mips64el.deb ...
Unpacking libexpat1:mips64el (2.6.4-1) ...
Selecting previously unselected package libexpat1-dev:mips64el.
Preparing to unpack .../100-libexpat1-dev_2.6.4-1_mips64el.deb ...
Unpacking libexpat1-dev:mips64el (2.6.4-1) ...
Selecting previously unselected package libgomp1:mips64el.
Preparing to unpack .../101-libgomp1_14.2.0-17_mips64el.deb ...
Unpacking libgomp1:mips64el (14.2.0-17) ...
Selecting previously unselected package libgcc-14-dev:mips64el.
Preparing to unpack .../102-libgcc-14-dev_14.2.0-17_mips64el.deb ...
Unpacking libgcc-14-dev:mips64el (14.2.0-17) ...
Selecting previously unselected package libgssglue1:mips64el.
Preparing to unpack .../103-libgssglue1_0.9-1+b1_mips64el.deb ...
Unpacking libgssglue1:mips64el (0.9-1+b1) ...
Selecting previously unselected package libidn12:mips64el.
Preparing to unpack .../104-libidn12_1.42-3_mips64el.deb ...
Unpacking libidn12:mips64el (1.42-3) ...
Selecting previously unselected package libntlm0:mips64el.
Preparing to unpack .../105-libntlm0_1.8-3+b1_mips64el.deb ...
Unpacking libntlm0:mips64el (1.8-3+b1) ...
Selecting previously unselected package libgsasl18:mips64el.
Preparing to unpack .../106-libgsasl18_2.2.1-1+b2_mips64el.deb ...
Unpacking libgsasl18:mips64el (2.2.1-1+b2) ...
Selecting previously unselected package libgssglue-dev:mips64el.
Preparing to unpack .../107-libgssglue-dev_0.9-1+b1_mips64el.deb ...
Unpacking libgssglue-dev:mips64el (0.9-1+b1) ...
Selecting previously unselected package libpkgconf3:amd64.
Preparing to unpack .../108-libpkgconf3_1.8.1-4_amd64.deb ...
Unpacking libpkgconf3:amd64 (1.8.1-4) ...
Selecting previously unselected package pkgconf-bin.
Preparing to unpack .../109-pkgconf-bin_1.8.1-4_amd64.deb ...
Unpacking pkgconf-bin (1.8.1-4) ...
Selecting previously unselected package pkgconf:mips64el.
Preparing to unpack .../110-pkgconf_1.8.1-4_mips64el.deb ...
Unpacking pkgconf:mips64el (1.8.1-4) ...
Selecting previously unselected package libidn-dev:mips64el.
Preparing to unpack .../111-libidn-dev_1.42-3_mips64el.deb ...
Unpacking libidn-dev:mips64el (1.42-3) ...
Selecting previously unselected package libntlm0-dev:mips64el.
Preparing to unpack .../112-libntlm0-dev_1.8-3+b1_mips64el.deb ...
Unpacking libntlm0-dev:mips64el (1.8-3+b1) ...
Selecting previously unselected package libgsasl-dev:mips64el.
Preparing to unpack .../113-libgsasl-dev_2.2.1-1+b2_mips64el.deb ...
Unpacking libgsasl-dev:mips64el (2.2.1-1+b2) ...
Selecting previously unselected package libkrb5support0:mips64el.
Preparing to unpack .../114-libkrb5support0_1.21.3-4_mips64el.deb ...
Unpacking libkrb5support0:mips64el (1.21.3-4) ...
Selecting previously unselected package libk5crypto3:mips64el.
Preparing to unpack .../115-libk5crypto3_1.21.3-4_mips64el.deb ...
Unpacking libk5crypto3:mips64el (1.21.3-4) ...
Selecting previously unselected package libkeyutils1:mips64el.
Preparing to unpack .../116-libkeyutils1_1.6.3-4_mips64el.deb ...
Unpacking libkeyutils1:mips64el (1.6.3-4) ...
Selecting previously unselected package libkrb5-3:mips64el.
Preparing to unpack .../117-libkrb5-3_1.21.3-4_mips64el.deb ...
Unpacking libkrb5-3:mips64el (1.21.3-4) ...
Selecting previously unselected package libgssapi-krb5-2:mips64el.
Preparing to unpack .../118-libgssapi-krb5-2_1.21.3-4_mips64el.deb ...
Unpacking libgssapi-krb5-2:mips64el (1.21.3-4) ...
Selecting previously unselected package libhttp-parser2.9:mips64el.
Preparing to unpack .../119-libhttp-parser2.9_2.9.4-6+b2_mips64el.deb ...
Unpacking libhttp-parser2.9:mips64el (2.9.4-6+b2) ...
Selecting previously unselected package libhttp-parser-dev:mips64el.
Preparing to unpack .../120-libhttp-parser-dev_2.9.4-6+b2_mips64el.deb ...
Unpacking libhttp-parser-dev:mips64el (2.9.4-6+b2) ...
Selecting previously unselected package libsasl2-modules-db:mips64el.
Preparing to unpack .../121-libsasl2-modules-db_2.1.28+dfsg1-8+b1_mips64el.deb ...
Unpacking libsasl2-modules-db:mips64el (2.1.28+dfsg1-8+b1) ...
Selecting previously unselected package libsasl2-2:mips64el.
Preparing to unpack .../122-libsasl2-2_2.1.28+dfsg1-8+b1_mips64el.deb ...
Unpacking libsasl2-2:mips64el (2.1.28+dfsg1-8+b1) ...
Selecting previously unselected package libldap2:mips64el.
Preparing to unpack .../123-libldap2_2.6.9+dfsg-1_mips64el.deb ...
Unpacking libldap2:mips64el (2.6.9+dfsg-1) ...
Selecting previously unselected package libldap-dev:mips64el.
Preparing to unpack .../124-libldap-dev_2.6.9+dfsg-1_mips64el.deb ...
Unpacking libldap-dev:mips64el (2.6.9+dfsg-1) ...
Selecting previously unselected package libpam0g:mips64el.
Preparing to unpack .../125-libpam0g_1.7.0-3_mips64el.deb ...
Unpacking libpam0g:mips64el (1.7.0-3) ...
Selecting previously unselected package libpam0g-dev:mips64el.
Preparing to unpack .../126-libpam0g-dev_1.7.0-3_mips64el.deb ...
Unpacking libpam0g-dev:mips64el (1.7.0-3) ...
Selecting previously unselected package libpq5:mips64el.
Preparing to unpack .../127-libpq5_17.4-1_mips64el.deb ...
Unpacking libpq5:mips64el (17.4-1) ...
Selecting previously unselected package libpq-dev:mips64el.
Preparing to unpack .../128-libpq-dev_17.4-1_mips64el.deb ...
Unpacking libpq-dev:mips64el (17.4-1) ...
Selecting previously unselected package libsqlite3-0:mips64el.
Preparing to unpack .../129-libsqlite3-0_3.46.1-1_mips64el.deb ...
Unpacking libsqlite3-0:mips64el (3.46.1-1) ...
Selecting previously unselected package libsqlite3-dev:mips64el.
Preparing to unpack .../130-libsqlite3-dev_3.46.1-1_mips64el.deb ...
Unpacking libsqlite3-dev:mips64el (3.46.1-1) ...
Selecting previously unselected package libstdc++6:mips64el.
Preparing to unpack .../131-libstdc++6_14.2.0-17_mips64el.deb ...
Unpacking libstdc++6:mips64el (14.2.0-17) ...
Selecting previously unselected package libstdc++-14-dev:mips64el.
Preparing to unpack .../132-libstdc++-14-dev_14.2.0-17_mips64el.deb ...
Unpacking libstdc++-14-dev:mips64el (14.2.0-17) ...
Selecting previously unselected package libudns0t64:mips64el.
Preparing to unpack .../133-libudns0t64_0.6-1_mips64el.deb ...
Unpacking libudns0t64:mips64el (0.6-1) ...
Selecting previously unselected package libudns-dev:mips64el.
Preparing to unpack .../134-libudns-dev_0.6-1_mips64el.deb ...
Unpacking libudns-dev:mips64el (0.6-1) ...
Selecting previously unselected package sbuild-build-depends-main-dummy:mips64el.
Preparing to unpack .../135-sbuild-build-depends-main-dummy_0.invalid.0_mips64el.deb ...
Unpacking sbuild-build-depends-main-dummy:mips64el (0.invalid.0) ...
Setting up libconfig-inifiles-perl (3.000003-3) ...
Setting up libpipeline1:amd64 (1.5.8-1) ...
Setting up libtext-charwidth-perl:amd64 (0.04-11+b4) ...
Setting up mysql-common (5.8+1.1.1) ...
update-alternatives: using /etc/mysql/my.cnf.fallback to provide /etc/mysql/my.cnf (my.cnf) in auto mode
Setting up libfile-which-perl (1.27-2) ...
Setting up libicu72:amd64 (72.1-6) ...
Setting up bsdextrautils (2.40.4-5) ...
Setting up libmagic-mgc (1:5.45-3+b1) ...
Setting up gcc-14-base:mips64el (14.2.0-17) ...
Setting up libarchive-zip-perl (1.68-1) ...
Setting up libdebhelper-perl (13.24.1) ...
Setting up libmagic1t64:amd64 (1:5.45-3+b1) ...
Setting up libc6-mips64el-cross (2.40-5cross1) ...
Setting up libxml-namespacesupport-perl (1.12-2) ...
Setting up gettext-base (0.23.1-1) ...
Setting up m4 (1.4.19-5) ...
Setting up file (1:5.45-3+b1) ...
Setting up libyaml-perl (1.31-1) ...
Setting up binutils-mips64el-linux-gnuabi64 (2.43.50.20241230-1cross1+nmu1) ...
Setting up libtext-wrapi18n-perl (0.06-10) ...
Setting up libfakeroot:amd64 (1.37-1) ...
Setting up libelf1t64:amd64 (0.192-4) ...
Setting up fakeroot (1.37-1) ...
update-alternatives: using /usr/bin/fakeroot-sysv to provide /usr/bin/fakeroot (fakeroot) in auto mode
Setting up mariadb-common (1:11.4.5-1) ...
update-alternatives: using /etc/mysql/mariadb.cnf to provide /etc/mysql/my.cnf (my.cnf) in auto mode
Setting up libxml-sax-base-perl (1.09-3) ...
Setting up libio-string-perl (1.08-4) ...
Setting up autotools-dev (20220109.1) ...
Setting up cross-config (2.6.20) ...
Setting up gcc-14-cross-base-mipsen (14.2.0-13cross1) ...
Setting up libpkgconf3:amd64 (1.8.1-4) ...
Setting up libproc2-0:amd64 (2:4.0.4-7) ...
Setting up libunistring5:amd64 (1.3-1) ...
Setting up autopoint (0.23.1-1) ...
Setting up pkgconf-bin (1.8.1-4) ...
Setting up libncursesw6:amd64 (6.5+20250216-1) ...
Setting up autoconf (2.72-3) ...
Setting up dwz (0.15-1+b1) ...
Setting up sensible-utils (0.0.24) ...
Setting up libuchardet0:amd64 (0.0.8-1+b2) ...
Setting up procps (2:4.0.4-7) ...
Setting up linux-libc-dev-mips64el-cross (6.12.8-1cross1) ...
Setting up gcc-14-mips64el-linux-gnuabi64-base:amd64 (14.2.0-13cross1) ...
Setting up libfile-homedir-perl (1.006-2) ...
Setting up libgomp1-mips64el-cross (14.2.0-13cross1) ...
Setting up libgcc-s1-mips64el-cross (14.2.0-13cross1) ...
Setting up libxml2:amd64 (2.12.7+dfsg+really2.9.14-0.2+b2) ...
Setting up liblocale-gettext-perl (1.07-7+b1) ...
Setting up automake (1:1.17-3) ...
update-alternatives: using /usr/bin/automake-1.17 to provide /usr/bin/automake (automake) in auto mode
Setting up libfile-stripnondeterminism-perl (1.14.1-2) ...
Setting up gettext (0.23.1-1) ...
Setting up libatomic1-mips64el-cross (14.2.0-13cross1) ...
Setting up libtool (2.5.4-3) ...
Setting up cpp-14-mips64el-linux-gnuabi64 (14.2.0-13cross1) ...
Setting up pkgconf:mips64el (1.8.1-4) ...
Setting up intltool-debian (0.35.0+20060710.6) ...
Setting up dh-autoreconf (20) ...
Setting up libgcc-14-dev-mips64el-cross (14.2.0-13cross1) ...
Setting up libc6-dev-mips64el-cross (2.40-5cross1) ...
Setting up ucf (3.0050) ...
Setting up libstdc++6-mips64el-cross (14.2.0-13cross1) ...
Setting up dh-strip-nondeterminism (1.14.1-2) ...
Setting up groff-base (1.23.0-7) ...
Setting up cpp-mips64el-linux-gnuabi64 (4:14.2.0-1) ...
Setting up libstdc++-14-dev-mips64el-cross (14.2.0-13cross1) ...
Setting up gcc-14-mips64el-linux-gnuabi64 (14.2.0-13cross1) ...
Setting up g++-14-mips64el-linux-gnuabi64 (14.2.0-13cross1) ...
Setting up po-debconf (1.0.21+nmu1) ...
Setting up man-db (2.13.0-1) ...
Not building database; man-db/auto-update is not 'true'.
Setting up libxml-sax-perl (1.02+dfsg-4) ...
update-perl-sax-parsers: Registering Perl SAX parser XML::SAX::PurePerl with priority 10...
update-perl-sax-parsers: Updating overall Perl SAX parser modules info file...
Creating config file /etc/perl/XML/SAX/ParserDetails.ini with new version
Setting up gcc-mips64el-linux-gnuabi64 (4:14.2.0-1) ...
Setting up libxml-libxml-perl (2.0207+dfsg+really+2.0134-5+b2) ...
update-perl-sax-parsers: Registering Perl SAX parser XML::LibXML::SAX::Parser with priority 50...
update-perl-sax-parsers: Registering Perl SAX parser XML::LibXML::SAX with priority 50...
update-perl-sax-parsers: Updating overall Perl SAX parser modules info file...
Setting up g++-mips64el-linux-gnuabi64 (4:14.2.0-1) ...
Setting up debhelper (13.24.1) ...
Setting up libxml-simple-perl (2.25-2) ...
Setting up libconfig-auto-perl (0.44-2) ...
Setting up libdebian-dpkgcross-perl (2.6.20) ...
Setting up dpkg-cross (2.6.20) ...
Setting up crossbuild-essential-mips64el (12.9) ...
Setting up libgcc-s1:mips64el (14.2.0-17) ...
Setting up libc6:mips64el (2.40-7) ...
Setting up libdb5.3t64:mips64el (5.3.28+dfsg2-9) ...
Setting up libdb5.3-dev:mips64el (5.3.28+dfsg2-9) ...
Setting up libstdc++6:mips64el (14.2.0-17) ...
Setting up libhttp-parser2.9:mips64el (2.9.4-6+b2) ...
Setting up libexpat1:mips64el (2.6.4-1) ...
Setting up libhttp-parser-dev:mips64el (2.9.4-6+b2) ...
Setting up libzstd1:mips64el (1.5.6+dfsg-2) ...
Setting up libkeyutils1:mips64el (1.6.3-4) ...
Setting up libsqlite3-0:mips64el (3.46.1-1) ...
Setting up zlib1g:mips64el (1:1.3.dfsg+really1.3.1-1+b1) ...
Setting up libcrypt1:mips64el (1:4.4.38-1) ...
Setting up libcom-err2:mips64el (1.47.2-1) ...
Setting up libgomp1:mips64el (14.2.0-17) ...
Setting up libsubunit0:mips64el (1.4.2-3+b1) ...
Setting up libudns0t64:mips64el (0.6-1) ...
Setting up libkrb5support0:mips64el (1.21.3-4) ...
Setting up libsasl2-modules-db:mips64el (2.1.28+dfsg1-8+b1) ...
Setting up libcap-ng0:mips64el (0.8.5-4+b1) ...
Setting up libntlm0:mips64el (1.8-3+b1) ...
Setting up libntlm0-dev:mips64el (1.8-3+b1) ...
Setting up libdb-dev:mips64el (5.3.4) ...
Setting up libaudit1:mips64el (1:4.0.2-2+b2) ...
Setting up libatomic1:mips64el (14.2.0-17) ...
Setting up libidn12:mips64el (1.42-3) ...
Setting up libgssglue1:mips64el (0.9-1+b1) ...
Setting up libk5crypto3:mips64el (1.21.3-4) ...
Setting up libgsasl18:mips64el (2.2.1-1+b2) ...
Setting up libcrypt-dev:mips64el (1:4.4.38-1) ...
Setting up libc6-dev:mips64el (2.40-7) ...
Setting up libgcc-14-dev:mips64el (14.2.0-17) ...
Setting up libstdc++-14-dev:mips64el (14.2.0-17) ...
Setting up libudns-dev:mips64el (0.6-1) ...
Setting up libidn-dev:mips64el (1.42-3) ...
Setting up libssl3t64:mips64el (3.4.1-1) ...
Setting up libsubunit-dev:mips64el (1.4.2-3+b1) ...
Setting up libgssglue-dev:mips64el (0.9-1+b1) ...
Setting up libpam0g:mips64el (1.7.0-3) ...
Setting up libexpat1-dev:mips64el (2.6.4-1) ...
Setting up libsqlite3-dev:mips64el (3.46.1-1) ...
Setting up libgsasl-dev:mips64el (2.2.1-1+b2) ...
Setting up libssl-dev:mips64el (3.4.1-1) ...
Setting up check:mips64el (0.15.2-3) ...
Setting up libmariadb3:mips64el (1:11.4.5-1) ...
Setting up libsasl2-2:mips64el (2.1.28+dfsg1-8+b1) ...
Setting up zlib1g-dev:mips64el (1:1.3.dfsg+really1.3.1-1+b1) ...
Setting up libkrb5-3:mips64el (1.21.3-4) ...
Setting up libldap2:mips64el (2.6.9+dfsg-1) ...
Setting up libpam0g-dev:mips64el (1.7.0-3) ...
Setting up libldap-dev:mips64el (2.6.9+dfsg-1) ...
Setting up libgssapi-krb5-2:mips64el (1.21.3-4) ...
Setting up libmariadb-dev:mips64el (1:11.4.5-1) ...
Setting up libmariadb-dev-compat:mips64el (1:11.4.5-1) ...
Setting up libpq5:mips64el (17.4-1) ...
Setting up libpq-dev:mips64el (17.4-1) ...
Setting up default-libmysqlclient-dev:mips64el (1.1.1) ...
Setting up sbuild-build-depends-main-dummy:mips64el (0.invalid.0) ...
Processing triggers for libc-bin (2.40-7) ...

+------------------------------------------------------------------------------+
| Check architectures                                                          |
+------------------------------------------------------------------------------+

Arch check ok (mips64el included in any)

+------------------------------------------------------------------------------+
| Build environment                                                            |
+------------------------------------------------------------------------------+

Kernel: Linux 6.1.0-31-amd64 #1 SMP PREEMPT_DYNAMIC Debian 6.1.128-1 (2025-02-07) amd64 (x86_64)
Toolchain package versions: binutils_2.44-2 dpkg-dev_1.22.15 g++-14_14.2.0-17 gcc-14_14.2.0-17 libc6-dev_2.40-7 libstdc++-14-dev_14.2.0-17 libstdc++-14-dev-mips64el-cross_14.2.0-13cross1 libstdc++6_14.2.0-17 libstdc++6-mips64el-cross_14.2.0-13cross1 linux-libc-dev_6.12.16-1
Package versions: apt_2.9.31 apt-utils_2.9.31 autoconf_2.72-3 automake_1:1.17-3 autopoint_0.23.1-1 autotools-dev_20220109.1 base-files_13.6 base-passwd_3.6.6 bash_5.2.37-1.1 binutils_2.44-2 binutils-common_2.44-2 binutils-mips64el-linux-gnuabi64_2.43.50.20241230-1cross1+nmu1 binutils-x86-64-linux-gnu_2.44-2 bsdextrautils_2.40.4-5 bsdutils_1:2.40.4-5 build-essential_12.12 bzip2_1.0.8-6 check_0.15.2-3 coreutils_9.5-1+b1 cpp_4:14.2.0-1 cpp-14_14.2.0-17 cpp-14-mips64el-linux-gnuabi64_14.2.0-13cross1 cpp-14-x86-64-linux-gnu_14.2.0-17 cpp-mips64el-linux-gnuabi64_4:14.2.0-1 cpp-x86-64-linux-gnu_4:14.2.0-1 cross-config_2.6.20 crossbuild-essential-mips64el_12.9 dash_0.5.12-12 debconf_1.5.89 debhelper_13.24.1 debian-archive-keyring_2023.4 debianutils_5.21 default-libmysqlclient-dev_1.1.1 dh-autoreconf_20 dh-strip-nondeterminism_1.14.1-2 diffutils_1:3.10-2 dpkg_1.22.15 dpkg-cross_2.6.20 dpkg-dev_1.22.15 dwz_0.15-1+b1 fakeroot_1.37-1 file_1:5.45-3+b1 findutils_4.10.0-3 g++_4:14.2.0-1 g++-14_14.2.0-17 g++-14-mips64el-linux-gnuabi64_14.2.0-13cross1 g++-14-x86-64-linux-gnu_14.2.0-17 g++-mips64el-linux-gnuabi64_4:14.2.0-1 g++-x86-64-linux-gnu_4:14.2.0-1 gcc_4:14.2.0-1 gcc-14_14.2.0-17 gcc-14-base_14.2.0-17 gcc-14-cross-base-mipsen_14.2.0-13cross1 gcc-14-mips64el-linux-gnuabi64_14.2.0-13cross1 gcc-14-mips64el-linux-gnuabi64-base_14.2.0-13cross1 gcc-14-x86-64-linux-gnu_14.2.0-17 gcc-mips64el-linux-gnuabi64_4:14.2.0-1 gcc-x86-64-linux-gnu_4:14.2.0-1 gettext_0.23.1-1 gettext-base_0.23.1-1 grep_3.11-4 groff-base_1.23.0-7 gzip_1.13-1 hostname_3.25 init-system-helpers_1.68 intltool-debian_0.35.0+20060710.6 libacl1_2.3.2-2+b1 libapt-pkg7.0_2.9.31 libarchive-zip-perl_1.68-1 libasan8_14.2.0-17 libatomic1_14.2.0-17 libatomic1-mips64el-cross_14.2.0-13cross1 libattr1_1:2.5.2-3 libaudit-common_1:4.0.2-2 libaudit1_1:4.0.2-2+b2 libbinutils_2.44-2 libblkid1_2.40.4-5 libbsd0_0.12.2-2 libbz2-1.0_1.0.8-6 libc-bin_2.40-7 libc-dev-bin_2.40-7 libc6_2.40-7 libc6-dev_2.40-7 libc6-dev-mips64el-cross_2.40-5cross1 libc6-mips64el-cross_2.40-5cross1 libcap-ng0_0.8.5-4+b1 libcap2_1:2.73-4 libcc1-0_14.2.0-17 libcom-err2_1.47.2-1 libconfig-auto-perl_0.44-2 libconfig-inifiles-perl_3.000003-3 libcrypt-dev_1:4.4.38-1 libcrypt1_1:4.4.38-1 libctf-nobfd0_2.44-2 libctf0_2.44-2 libdb-dev_5.3.4 libdb5.3-dev_5.3.28+dfsg2-9 libdb5.3t64_5.3.28+dfsg2-9 libdebconfclient0_0.277 libdebhelper-perl_13.24.1 libdebian-dpkgcross-perl_2.6.20 libdpkg-perl_1.22.15 libelf1t64_0.192-4 libexpat1_2.6.4-1 libexpat1-dev_2.6.4-1 libfakeroot_1.37-1 libfile-homedir-perl_1.006-2 libfile-stripnondeterminism-perl_1.14.1-2 libfile-which-perl_1.27-2 libgcc-14-dev_14.2.0-17 libgcc-14-dev-mips64el-cross_14.2.0-13cross1 libgcc-s1_14.2.0-17 libgcc-s1-mips64el-cross_14.2.0-13cross1 libgdbm-compat4t64_1.24-2 libgdbm6t64_1.24-2 libgmp10_2:6.3.0+dfsg-3 libgomp1_14.2.0-17 libgomp1-mips64el-cross_14.2.0-13cross1 libgprofng0_2.44-2 libgsasl-dev_2.2.1-1+b2 libgsasl18_2.2.1-1+b2 libgssapi-krb5-2_1.21.3-4 libgssglue-dev_0.9-1+b1 libgssglue1_0.9-1+b1 libhogweed6t64_3.10.1-1 libhttp-parser-dev_2.9.4-6+b2 libhttp-parser2.9_2.9.4-6+b2 libhwasan0_14.2.0-17 libicu72_72.1-6 libidn-dev_1.42-3 libidn12_1.42-3 libio-string-perl_1.08-4 libisl23_0.27-1 libitm1_14.2.0-17 libjansson4_2.14-2+b3 libk5crypto3_1.21.3-4 libkeyutils1_1.6.3-4 libkrb5-3_1.21.3-4 libkrb5support0_1.21.3-4 libldap-dev_2.6.9+dfsg-1 libldap2_2.6.9+dfsg-1 liblocale-gettext-perl_1.07-7+b1 liblsan0_14.2.0-17 liblz4-1_1.10.0-3 liblzma5_5.6.3-1+b1 libmagic-mgc_1:5.45-3+b1 libmagic1t64_1:5.45-3+b1 libmariadb-dev_1:11.4.5-1 libmariadb-dev-compat_1:11.4.5-1 libmariadb3_1:11.4.5-1 libmd0_1.1.0-2+b1 libmount1_2.40.4-5 libmpc3_1.3.1-1+b3 libmpfr6_4.2.1-1+b2 libncursesw6_6.5+20250216-1 libnettle8t64_3.10.1-1 libntlm0_1.8-3+b1 libntlm0-dev_1.8-3+b1 libpam-modules_1.7.0-3 libpam-modules-bin_1.7.0-3 libpam-runtime_1.7.0-3 libpam0g_1.7.0-3 libpam0g-dev_1.7.0-3 libpcre2-8-0_10.45-1 libperl5.40_5.40.1-2 libpipeline1_1.5.8-1 libpkgconf3_1.8.1-4 libpq-dev_17.4-1 libpq5_17.4-1 libproc2-0_2:4.0.4-7 libquadmath0_14.2.0-17 libsasl2-2_2.1.28+dfsg1-8+b1 libsasl2-modules-db_2.1.28+dfsg1-8+b1 libseccomp2_2.5.5-2+b1 libselinux1_3.8-4 libsemanage-common_3.8-1 libsemanage2_3.8-1+b1 libsepol2_3.8-1 libsframe1_2.44-2 libsmartcols1_2.40.4-5 libsqlite3-0_3.46.1-1 libsqlite3-dev_3.46.1-1 libssl-dev_3.4.1-1 libssl3t64_3.4.1-1 libstdc++-14-dev_14.2.0-17 libstdc++-14-dev-mips64el-cross_14.2.0-13cross1 libstdc++6_14.2.0-17 libstdc++6-mips64el-cross_14.2.0-13cross1 libsubunit-dev_1.4.2-3+b1 libsubunit0_1.4.2-3+b1 libsystemd0_257.3-1 libtext-charwidth-perl_0.04-11+b4 libtext-wrapi18n-perl_0.06-10 libtinfo6_6.5+20250216-1 libtool_2.5.4-3 libtsan2_14.2.0-17 libubsan1_14.2.0-17 libuchardet0_0.0.8-1+b2 libudev1_257.3-1 libudns-dev_0.6-1 libudns0t64_0.6-1 libunistring5_1.3-1 libuuid1_2.40.4-5 libxml-libxml-perl_2.0207+dfsg+really+2.0134-5+b2 libxml-namespacesupport-perl_1.12-2 libxml-sax-base-perl_1.09-3 libxml-sax-perl_1.02+dfsg-4 libxml-simple-perl_2.25-2 libxml2_2.12.7+dfsg+really2.9.14-0.2+b2 libxxhash0_0.8.3-2 libyaml-perl_1.31-1 libzstd1_1.5.6+dfsg-2 linux-libc-dev_6.12.16-1 linux-libc-dev-mips64el-cross_6.12.8-1cross1 login_1:4.16.0-2+really2.40.4-5 login.defs_1:4.17.3-1 m4_1.4.19-5 make_4.4.1-1 man-db_2.13.0-1 mariadb-common_1:11.4.5-1 mawk_1.3.4.20250131-1 mount_2.40.4-5 mysql-common_5.8+1.1.1 ncurses-base_6.5+20250216-1 ncurses-bin_6.5+20250216-1 openssl-provider-legacy_3.4.1-1 passwd_1:4.17.3-1 patch_2.7.6-7 perl_5.40.1-2 perl-base_5.40.1-2 perl-modules-5.40_5.40.1-2 pkgconf_1.8.1-4 pkgconf-bin_1.8.1-4 po-debconf_1.0.21+nmu1 procps_2:4.0.4-7 rpcsvc-proto_1.4.3-1 sbuild-build-depends-main-dummy_0.invalid.0 sed_4.9-2 sensible-utils_0.0.24 sqv_1.2.1-6+b1 sysvinit-utils_3.14-3 tar_1.35+dfsg-3.1 tzdata_2025a-2 ucf_3.0050 util-linux_2.40.4-5 xz-utils_5.6.3-1+b1 zlib1g_1:1.3.dfsg+really1.3.1-1+b1 zlib1g-dev_1:1.3.dfsg+really1.3.1-1+b1

+------------------------------------------------------------------------------+
| Build                                                                        |
+------------------------------------------------------------------------------+


Unpack source
-------------

-----BEGIN PGP SIGNED MESSAGE-----
Hash: SHA256

Format: 3.0 (quilt)
Source: jabberd2
Binary: jabberd2
Architecture: any
Version: 2.7.0-7
Maintainer: Debian XMPP Maintainers <pkg-xmpp-devel@lists.alioth.debian.org>
Uploaders:  Simon Josefsson <simon@josefsson.org>,
Homepage: https://jabberd2.org/
Standards-Version: 4.7.0
Vcs-Browser: https://salsa.debian.org/xmpp-team/jabberd2
Vcs-Git: https://salsa.debian.org/xmpp-team/jabberd2.git
Build-Depends: check, debhelper-compat (= 13), default-libmysqlclient-dev, dh-sequence-movetousr, libdb-dev, libexpat1-dev, libgsasl-dev (>= 1.4.0), libhttp-parser-dev, libidn-dev, libldap2-dev, libpam0g-dev, libpq-dev, libsqlite3-dev, libssl-dev, libudns-dev
Package-List:
 jabberd2 deb net optional arch=any
Checksums-Sha1:
 9200b9f22188caf603630d98d6f1c17c87a957b9 629992 jabberd2_2.7.0.orig.tar.gz
 ebf3176cdb1655a17f47f2ba0902ca11572e1d06 18996 jabberd2_2.7.0-7.debian.tar.xz
Checksums-Sha256:
 8ed7ae5952819d9e5bf1efb45735bfff3786b60144d9f60f8fe2788f552f1989 629992 jabberd2_2.7.0.orig.tar.gz
 2844ca76b338b9db6f857cac2ec14a4d4a231a576c4d1ab892a73ad1a1bda3ce 18996 jabberd2_2.7.0-7.debian.tar.xz
Files:
 c2a01ab0c34b2d8f6a7e32f5cf6a2182 629992 jabberd2_2.7.0.orig.tar.gz
 353cfde5fa15a31b0b63bfc0c97b590d 18996 jabberd2_2.7.0-7.debian.tar.xz

-----BEGIN PGP SIGNATURE-----

iIoEARYIADIWIQSjzJyHC50xCrrUzy9RcisI/kdFogUCZnGglxQcc2ltb25Aam9z
ZWZzc29uLm9yZwAKCRBRcisI/kdFoh5JAPwLq7ZVG+dNoLRmCr4zVG9l0GMX/DeR
eGYzXX4/VH2EfgEAuQfy7pDGF7CLDyNW+f1P3iSjpsC9EJ0Az2sgKLEalAg=
=sKMh
-----END PGP SIGNATURE-----

dpkg-source: warning: cannot verify inline signature for ./jabberd2_2.7.0-7.dsc: unsupported subcommand
dpkg-source: info: extracting jabberd2 in /<<PKGBUILDDIR>>
dpkg-source: info: unpacking jabberd2_2.7.0.orig.tar.gz
dpkg-source: info: unpacking jabberd2_2.7.0-7.debian.tar.xz
dpkg-source: info: using patch list from debian/patches/series
dpkg-source: info: applying man_hypen.diff
dpkg-source: info: applying usr_etc.diff
dpkg-source: info: applying etc_dbpath.diff
dpkg-source: info: applying etc_logpath.diff
dpkg-source: info: applying etc_pidpath.diff
dpkg-source: info: applying pkgname.diff
dpkg-source: info: applying systemd-alias.diff
dpkg-source: info: applying m4-ax_check_compile_flag.diff
dpkg-source: info: applying no-implicit-declarations.patch
dpkg-source: info: applying no-implicit-declarations2.patch

Check disk space
----------------

Sufficient free space for build

User Environment
----------------

APT_CONFIG=/var/lib/sbuild/apt.conf
CONFIG_SITE=/etc/dpkg-cross/cross-config.mips64el
DEB_BUILD_OPTIONS=nocheck
HOME=/sbuild-nonexistent
LANG=en_US.UTF-8
LC_ALL=C.UTF-8
LOGNAME=crossqa
OLDPWD=/home/crossqa
PATH=/usr/local/sbin:/usr/local/bin:/usr/sbin:/usr/bin:/sbin:/bin:/usr/games
SBUILD_CONFIG=/tmp/tmp.YHbI4zxUjQ/sbuild.conf
SCHROOT_ALIAS_NAME=unstable-amd64-sbuild
SCHROOT_CHROOT_NAME=sid-amd64-sbuild
SCHROOT_COMMAND=env
SCHROOT_GID=1000
SCHROOT_GROUP=crossqa
SCHROOT_SESSION_ID=sid-amd64-sbuild-e22c63d9-8f01-44b8-a0d1-b191135411e6
SCHROOT_UID=1000
SCHROOT_USER=crossqa
SHELL=/bin/sh
USER=crossqa
XDG_SESSION_CLASS=user

dpkg-buildpackage
-----------------

Command: dpkg-buildpackage --sanitize-env -amips64el -Pcross,nocheck -us -uc -B -rfakeroot --jobs-try=1
dpkg-buildpackage: info: source package jabberd2
dpkg-buildpackage: info: source version 2.7.0-7
dpkg-buildpackage: info: source distribution unstable
dpkg-buildpackage: info: source changed by Simon Josefsson <simon@josefsson.org>
dpkg-architecture: warning: specified GNU system type mips64el-linux-gnuabi64 does not match CC system type x86_64-linux-gnu, try setting a correct CC environment variable
 dpkg-source --before-build .
dpkg-buildpackage: info: host architecture mips64el
dpkg-source: info: using options from jabberd2-2.7.0/debian/source/options: --extend-diff-ignore=ac-stdint.h
 debian/rules clean
dh clean
   dh_auto_clean
   dh_clean
 debian/rules binary-arch
dh binary-arch
   dh_update_autotools_config -a
   dh_autoreconf -a
libtoolize: putting auxiliary files in '.'.
libtoolize: copying file './ltmain.sh'
libtoolize: putting macros in AC_CONFIG_MACRO_DIRS, 'm4'.
libtoolize: copying file 'm4/libtool.m4'
libtoolize: copying file 'm4/ltoptions.m4'
libtoolize: copying file 'm4/ltsugar.m4'
libtoolize: copying file 'm4/ltversion.m4'
libtoolize: copying file 'm4/lt~obsolete.m4'
libtoolize: Consider adding '-I m4' to ACLOCAL_AMFLAGS in Makefile.am.
configure.ac:7: warning: The macro 'AC_CONFIG_HEADER' is obsolete.
configure.ac:7: You should run autoupdate.
./lib/autoconf/status.m4:719: AC_CONFIG_HEADER is expanded from...
configure.ac:7: the top level
configure.ac:14: warning: The macro 'AC_PROG_CC_STDC' is obsolete.
configure.ac:14: You should run autoupdate.
./lib/autoconf/c.m4:1669: AC_PROG_CC_STDC is expanded from...
configure.ac:14: the top level
configure.ac:22: warning: The macro 'AC_LIBTOOL_DLOPEN' is obsolete.
configure.ac:22: You should run autoupdate.
m4/ltoptions.m4:113: AC_LIBTOOL_DLOPEN is expanded from...
configure.ac:22: the top level
configure.ac:22: warning: AC_LIBTOOL_DLOPEN: Remove this warning and the call to _LT_SET_OPTION when you
configure.ac:22: put the 'dlopen' option into LT_INIT's first parameter.
./lib/autoconf/general.m4:2434: AC_DIAGNOSE is expanded from...
m4/ltoptions.m4:113: AC_LIBTOOL_DLOPEN is expanded from...
configure.ac:22: the top level
configure.ac:23: warning: The macro 'AC_PROG_LIBTOOL' is obsolete.
configure.ac:23: You should run autoupdate.
m4/libtool.m4:100: AC_PROG_LIBTOOL is expanded from...
configure.ac:23: the top level
configure.ac:30: warning: The macro 'AC_HELP_STRING' is obsolete.
configure.ac:30: You should run autoupdate.
./lib/autoconf/general.m4:204: AC_HELP_STRING is expanded from...
configure.ac:30: the top level
configure.ac:38: warning: The macro 'AC_HELP_STRING' is obsolete.
configure.ac:38: You should run autoupdate.
./lib/autoconf/general.m4:204: AC_HELP_STRING is expanded from...
configure.ac:38: the top level
configure.ac:50: warning: The macro 'AC_HELP_STRING' is obsolete.
configure.ac:50: You should run autoupdate.
./lib/autoconf/general.m4:204: AC_HELP_STRING is expanded from...
configure.ac:50: the top level
configure.ac:53: warning: The macro 'AC_HELP_STRING' is obsolete.
configure.ac:53: You should run autoupdate.
./lib/autoconf/general.m4:204: AC_HELP_STRING is expanded from...
configure.ac:53: the top level
configure.ac:60: warning: The macro 'AC_HELP_STRING' is obsolete.
configure.ac:60: You should run autoupdate.
./lib/autoconf/general.m4:204: AC_HELP_STRING is expanded from...
configure.ac:60: the top level
configure.ac:66: warning: The macro 'AC_HELP_STRING' is obsolete.
configure.ac:66: You should run autoupdate.
./lib/autoconf/general.m4:204: AC_HELP_STRING is expanded from...
configure.ac:66: the top level
configure.ac:72: warning: The macro 'AC_HELP_STRING' is obsolete.
configure.ac:72: You should run autoupdate.
./lib/autoconf/general.m4:204: AC_HELP_STRING is expanded from...
configure.ac:72: the top level
configure.ac:86: warning: The macro 'AC_HEADER_STDC' is obsolete.
configure.ac:86: You should run autoupdate.
./lib/autoconf/headers.m4:663: AC_HEADER_STDC is expanded from...
configure.ac:86: the top level
configure.ac:88: warning: The macro 'AC_HEADER_TIME' is obsolete.
configure.ac:88: You should run autoupdate.
./lib/autoconf/headers.m4:702: AC_HEADER_TIME is expanded from...
configure.ac:88: the top level
configure.ac:131: warning: The macro 'AC_HEADER_TIME' is obsolete.
configure.ac:131: You should run autoupdate.
./lib/autoconf/headers.m4:702: AC_HEADER_TIME is expanded from...
configure.ac:131: the top level
configure.ac:139: warning: The macro 'AC_TRY_COMPILE' is obsolete.
configure.ac:139: You should run autoupdate.
./lib/autoconf/general.m4:2845: AC_TRY_COMPILE is expanded from...
lib/m4sugar/m4sh.m4:690: _AS_IF_ELSE is expanded from...
lib/m4sugar/m4sh.m4:697: AS_IF is expanded from...
./lib/autoconf/general.m4:2249: AC_CACHE_VAL is expanded from...
acinclude.m4:5: AC_COMPILE_CHECK_SIZEOF is expanded from...
acinclude.m4:35: AC_CREATE_STDINT_H is expanded from...
configure.ac:139: the top level
configure.ac:148: warning: The macro 'AC_TYPE_SIGNAL' is obsolete.
configure.ac:148: You should run autoupdate.
./lib/autoconf/types.m4:805: AC_TYPE_SIGNAL is expanded from...
configure.ac:148: the top level
configure.ac:349: warning: The macro 'AC_TRY_COMPILE' is obsolete.
configure.ac:349: You should run autoupdate.
./lib/autoconf/general.m4:2845: AC_TRY_COMPILE is expanded from...
lib/m4sugar/m4sh.m4:690: _AS_IF_ELSE is expanded from...
lib/m4sugar/m4sh.m4:697: AS_IF is expanded from...
./lib/autoconf/general.m4:2249: AC_CACHE_VAL is expanded from...
lib/m4sugar/m4sh.m4:690: _AS_IF_ELSE is expanded from...
lib/m4sugar/m4sh.m4:697: AS_IF is expanded from...
./lib/autoconf/types.m4:149: _AC_CHECK_TYPE_NEW is expanded from...
./lib/autoconf/types.m4:233: AC_CHECK_TYPE is expanded from...
acinclude.m4:498: TYPE_SOCKLEN_T is expanded from...
configure.ac:349: the top level
configure.ac:401: warning: The macro 'AC_HELP_STRING' is obsolete.
configure.ac:401: You should run autoupdate.
./lib/autoconf/general.m4:204: AC_HELP_STRING is expanded from...
configure.ac:401: the top level
configure.ac:414: warning: The macro 'AC_HELP_STRING' is obsolete.
configure.ac:414: You should run autoupdate.
./lib/autoconf/general.m4:204: AC_HELP_STRING is expanded from...
configure.ac:414: the top level
configure.ac:415: warning: The macro 'AC_HELP_STRING' is obsolete.
configure.ac:415: You should run autoupdate.
./lib/autoconf/general.m4:204: AC_HELP_STRING is expanded from...
configure.ac:415: the top level
configure.ac:483: warning: The macro 'AC_HELP_STRING' is obsolete.
configure.ac:483: You should run autoupdate.
./lib/autoconf/general.m4:204: AC_HELP_STRING is expanded from...
configure.ac:483: the top level
configure.ac:521: warning: The macro 'AC_HELP_STRING' is obsolete.
configure.ac:521: You should run autoupdate.
./lib/autoconf/general.m4:204: AC_HELP_STRING is expanded from...
configure.ac:521: the top level
configure.ac:574: warning: The macro 'AC_HELP_STRING' is obsolete.
configure.ac:574: You should run autoupdate.
./lib/autoconf/general.m4:204: AC_HELP_STRING is expanded from...
configure.ac:574: the top level
configure.ac:620: warning: The macro 'AC_HELP_STRING' is obsolete.
configure.ac:620: You should run autoupdate.
./lib/autoconf/general.m4:204: AC_HELP_STRING is expanded from...
configure.ac:620: the top level
configure.ac:623: warning: The macro 'AC_HELP_STRING' is obsolete.
configure.ac:623: You should run autoupdate.
./lib/autoconf/general.m4:204: AC_HELP_STRING is expanded from...
configure.ac:623: the top level
configure.ac:667: warning: The macro 'AC_HELP_STRING' is obsolete.
configure.ac:667: You should run autoupdate.
./lib/autoconf/general.m4:204: AC_HELP_STRING is expanded from...
configure.ac:667: the top level
configure.ac:703: warning: The macro 'AC_HELP_STRING' is obsolete.
configure.ac:703: You should run autoupdate.
./lib/autoconf/general.m4:204: AC_HELP_STRING is expanded from...
configure.ac:703: the top level
configure.ac:719: warning: The macro 'AC_HELP_STRING' is obsolete.
configure.ac:719: You should run autoupdate.
./lib/autoconf/general.m4:204: AC_HELP_STRING is expanded from...
configure.ac:719: the top level
configure.ac:738: warning: The macro 'AC_HELP_STRING' is obsolete.
configure.ac:738: You should run autoupdate.
./lib/autoconf/general.m4:204: AC_HELP_STRING is expanded from...
configure.ac:738: the top level
configure.ac:747: warning: The macro 'AC_HELP_STRING' is obsolete.
configure.ac:747: You should run autoupdate.
./lib/autoconf/general.m4:204: AC_HELP_STRING is expanded from...
configure.ac:747: the top level
configure.ac:755: warning: The macro 'AC_HELP_STRING' is obsolete.
configure.ac:755: You should run autoupdate.
./lib/autoconf/general.m4:204: AC_HELP_STRING is expanded from...
configure.ac:755: the top level
configure.ac:817: warning: The macro 'AC_HELP_STRING' is obsolete.
configure.ac:817: You should run autoupdate.
./lib/autoconf/general.m4:204: AC_HELP_STRING is expanded from...
configure.ac:817: the top level
configure.ac:882: warning: The macro 'AC_HELP_STRING' is obsolete.
configure.ac:882: You should run autoupdate.
./lib/autoconf/general.m4:204: AC_HELP_STRING is expanded from...
configure.ac:882: the top level
configure.ac:888: warning: The macro 'AC_HELP_STRING' is obsolete.
configure.ac:888: You should run autoupdate.
./lib/autoconf/general.m4:204: AC_HELP_STRING is expanded from...
configure.ac:888: the top level
configure.ac:894: warning: The macro 'AC_HELP_STRING' is obsolete.
configure.ac:894: You should run autoupdate.
./lib/autoconf/general.m4:204: AC_HELP_STRING is expanded from...
configure.ac:894: the top level
configure.ac:901: warning: The macro 'AC_HELP_STRING' is obsolete.
configure.ac:901: You should run autoupdate.
./lib/autoconf/general.m4:204: AC_HELP_STRING is expanded from...
configure.ac:901: the top level
configure.ac:908: warning: The macro 'AC_HELP_STRING' is obsolete.
configure.ac:908: You should run autoupdate.
./lib/autoconf/general.m4:204: AC_HELP_STRING is expanded from...
configure.ac:908: the top level
configure.ac:13: installing './compile'
configure.ac:23: installing './config.guess'
configure.ac:23: installing './config.sub'
configure.ac:9: installing './install-sh'
configure.ac:9: installing './missing'
Makefile.am: installing './INSTALL'
c2s/Makefile.am: installing './depcomp'
parallel-tests: installing './test-driver'
   debian/rules override_dh_auto_configure
make[1]: Entering directory '/<<PKGBUILDDIR>>'
dh_auto_configure -- \
	--prefix=/usr \
	--bindir=\${prefix}/sbin \
	--sysconfdir=/etc/jabberd2 \
	--program-prefix=jabberd2- \
	--enable-ssl \
	--enable-mysql \
	--enable-pgsql \
	--enable-sqlite \
	--enable-db \
	--enable-ldap \
	--enable-pam \
	--enable-pipe \
	--enable-anon \
	--enable-fs \
	--enable-websocket \
	--without-subst
	./configure --build=x86_64-linux-gnu --prefix=/usr --includedir=\${prefix}/include --mandir=\${prefix}/share/man --infodir=\${prefix}/share/info --sysconfdir=/etc --localstatedir=/var --disable-option-checking --disable-silent-rules --libdir=\${prefix}/lib/mips64el-linux-gnuabi64 --runstatedir=/run --disable-maintainer-mode --disable-dependency-tracking --host=mips64el-linux-gnuabi64 --prefix=/usr --bindir=\${prefix}/sbin --sysconfdir=/etc/jabberd2 --program-prefix=jabberd2- --enable-ssl --enable-mysql --enable-pgsql --enable-sqlite --enable-db --enable-ldap --enable-pam --enable-pipe --enable-anon --enable-fs --enable-websocket --without-subst
configure: loading site script /etc/dpkg-cross/cross-config.mips64el
checking for a BSD-compatible install... /usr/bin/install -c
checking whether sleep supports fractional seconds... yes
checking filesystem timestamp resolution... 0.01
checking whether build environment is sane... yes
checking for mips64el-linux-gnuabi64-strip... mips64el-linux-gnuabi64-strip
checking for a race-free mkdir -p... /usr/bin/mkdir -p
checking for gawk... no
checking for mawk... mawk
checking whether make sets $(MAKE)... yes
checking whether make supports nested variables... yes
checking xargs -n works... yes
checking for mips64el-linux-gnuabi64-gcc... mips64el-linux-gnuabi64-gcc
checking whether the C compiler works... yes
checking for C compiler default output file name... a.out
checking for suffix of executables... 
checking whether we are cross compiling... yes
checking for suffix of object files... o
checking whether the compiler supports GNU C... yes
checking whether mips64el-linux-gnuabi64-gcc accepts -g... yes
checking for mips64el-linux-gnuabi64-gcc option to enable C11 features... none needed
checking whether mips64el-linux-gnuabi64-gcc understands -c and -o together... yes
checking whether make supports the include directive... yes (GNU style)
checking dependency style of mips64el-linux-gnuabi64-gcc... none
checking how to run the C preprocessor... mips64el-linux-gnuabi64-gcc -E
checking whether ln -s works... yes
checking whether make sets $(MAKE)... (cached) yes
checking build system type... x86_64-pc-linux-gnu
checking host system type... mips64el-unknown-linux-gnuabi64
checking how to print strings... printf
checking for a sed that does not truncate output... /usr/bin/sed
checking for grep that handles long lines and -e... /usr/bin/grep
checking for egrep... /usr/bin/grep -E
checking for fgrep... /usr/bin/grep -F
checking for ld used by mips64el-linux-gnuabi64-gcc... /usr/mips64el-linux-gnuabi64/bin/ld
checking if the linker (/usr/mips64el-linux-gnuabi64/bin/ld) is GNU ld... yes
checking for BSD- or MS-compatible name lister (nm)... /usr/bin/mips64el-linux-gnuabi64-nm -B
checking the name lister (/usr/bin/mips64el-linux-gnuabi64-nm -B) interface... BSD nm
checking the maximum length of command line arguments... 1572864
checking how to convert x86_64-pc-linux-gnu file names to mips64el-unknown-linux-gnuabi64 format... func_convert_file_noop
checking how to convert x86_64-pc-linux-gnu file names to toolchain format... func_convert_file_noop
checking for /usr/mips64el-linux-gnuabi64/bin/ld option to reload object files... -r
checking for file... file
checking for mips64el-linux-gnuabi64-objdump... mips64el-linux-gnuabi64-objdump
checking how to recognize dependent libraries... pass_all
checking for mips64el-linux-gnuabi64-dlltool... no
checking for dlltool... no
checking how to associate runtime and link libraries... printf %s\n
checking for mips64el-linux-gnuabi64-ranlib... mips64el-linux-gnuabi64-ranlib
checking for mips64el-linux-gnuabi64-ar... mips64el-linux-gnuabi64-ar
checking for archiver @FILE support... @
checking for mips64el-linux-gnuabi64-strip... (cached) mips64el-linux-gnuabi64-strip
checking command to parse /usr/bin/mips64el-linux-gnuabi64-nm -B output from mips64el-linux-gnuabi64-gcc object... ok
checking for sysroot... no
checking for a working dd... /usr/bin/dd
checking how to truncate binary pipes... /usr/bin/dd bs=4096 count=1
checking for mips64el-linux-gnuabi64-mt... no
checking for mt... no
checking if : is a manifest tool... no
checking for stdio.h... yes
checking for stdlib.h... yes
checking for string.h... yes
checking for inttypes.h... yes
checking for stdint.h... yes
checking for strings.h... yes
checking for sys/stat.h... yes
checking for sys/types.h... yes
checking for unistd.h... yes
checking for sys/time.h... yes
checking for vfork.h... no
checking for sys/select.h... yes
checking for sys/socket.h... yes
checking for dlfcn.h... yes
checking for objdir... .libs
checking if mips64el-linux-gnuabi64-gcc supports -fno-rtti -fno-exceptions... no
checking for mips64el-linux-gnuabi64-gcc option to produce PIC... -fPIC -DPIC
checking if mips64el-linux-gnuabi64-gcc PIC flag -fPIC -DPIC works... yes
checking if mips64el-linux-gnuabi64-gcc static flag -static works... yes
checking if mips64el-linux-gnuabi64-gcc supports -c -o file.o... yes
checking if mips64el-linux-gnuabi64-gcc supports -c -o file.o... (cached) yes
checking whether the mips64el-linux-gnuabi64-gcc linker (/usr/mips64el-linux-gnuabi64/bin/ld -m elf64ltsmip) supports shared libraries... yes
checking whether -lc should be explicitly linked in... no
checking dynamic linker characteristics... GNU/Linux ld.so
checking how to hardcode library paths into programs... immediate
checking for shl_load... no
checking for shl_load in -ldld... no
checking for dlopen... yes
checking whether a program can dlopen itself... cross
checking whether stripping libraries is possible... yes
checking if libtool supports shared libraries... yes
checking whether to build shared libraries... yes
checking whether to build static libraries... no
checking whether C compiler accepts -fdiagnostics-color... yes
checking for dirent.h that defines DIR... yes
checking for library containing opendir... none required
checking for sys/types.h... (cached) yes
checking for netinet/in.h... yes
checking for arpa/nameser.h... yes
checking for netdb.h... yes
checking for resolv.h... yes
checking for egrep... (cached) /usr/bin/grep -E
checking for sys/wait.h that is POSIX.1 compatible... yes
checking for arpa/inet.h... yes
checking for arpa/nameser.h... (cached) yes
checking for fcntl.h... yes
checking for netinet/in.h... (cached) yes
checking for signal.h... yes
checking for stdarg.h... yes
checking for stdint.h... (cached) yes
checking for stdlib.h... (cached) yes
checking for string.h... (cached) yes
checking for sys/filio.h... no
checking for sys/ioctl.h... yes
checking for sys/socket.h... (cached) yes
checking for sys/time.h... (cached) yes
checking for sys/timeb.h... yes
checking for sys/types.h... (cached) yes
checking for sys/stat.h... (cached) yes
checking for sys/utsname.h... yes
checking for syslog.h... yes
checking for unistd.h... (cached) yes
checking for windows.h... no
checking for winsock2.h... no
checking for resolv.h... (cached) yes
checking for windns.h... no
checking for an ANSI C-conforming const... yes
checking for mode_t... yes
checking for off_t... yes
checking for pid_t... yes
checking for size_t... yes
checking whether struct tm is in sys/time.h or time.h... time.h
checking for mips64el-linux-gnuabi64-gcc options needed to detect all undeclared functions... none needed
checking for struct tm.tm_zone... yes
checking for uint16_t... yes
checking for uint32_t... yes
checking for uint8_t... yes
checking for stdint-types....... "(putting them into ac-stdint.h)"
checking for uintptr_t... yes
checking for uint64_t... yes
... seen our uintptr_t in stdint.h (uint64_t too)
creating ac-stdint.h : _AC_STDINT_H
checking for int_least32_t... yes
checking for int_fast32_t... yes
..adding include stdint.h
... seen good stdint.h inttypes
... seen good uint64_t
... DONE ac-stdint.h
checking whether closedir returns void... no
checking for working alloca.h... yes
checking for alloca... yes
checking for mbstate_t... yes
checking whether getenv is declared... yes
checking for btowc... yes
checking for mbsrtowcs... yes
checking for mempcpy... yes
checking for wmempcpy... yes
checking for fork... yes
checking for vfork... yes
checking for alarm... yes
checking for vprintf... yes
checking for working POSIX fnmatch... cross
checking for working fork... cross
configure: WARNING: result yes guessed because of cross compilation
checking for working vfork... (cached) yes
checking for working memcmp... no
checking for working mktime... no
checking types of arguments for select... int,fd_set *,struct timeval *
checking return type of signal handlers... void
checking whether lstat correctly handles trailing slash... yes
checking whether stat accepts an empty string... yes
checking types of arguments for select... (cached) int,fd_set *,struct timeval *
checking for close... yes
checking for dup2... yes
checking for fcntl... yes
checking for _findfirst... no
checking for gethostname... yes
checking for getopt... yes
checking for getpagesize... yes
checking for getpid... yes
checking for gettimeofday... yes
checking for inet_aton... yes
checking for inet_ntoa... yes
checking for ioctl... yes
checking for isascii... yes
checking for memchr... yes
checking for memmove... yes
checking for memset... yes
checking for mkdir... yes
checking for _mkdir... no
checking for modf... yes
checking for select... yes
checking for setenv... yes
checking for sleep... yes
checking for Sleep... no
checking for socket... yes
checking for strcasecmp... yes
checking for strchr... yes
checking for strdup... yes
checking for strerror... yes
checking for stricmp... no
checking for strncasecmp... yes
checking for strndup... yes
checking for strnicmp... no
checking for strstr... yes
checking for tzset... yes
checking for uname... yes
checking for crypt... no
checking for crypt in -lcrypt... yes
checking for connect... yes
checking for _head_libws2_32_a in -lws2_32... no
checking for gethostbyname... yes
checking for gethostbyname... (cached) yes
checking for library containing inet_ntop... none required
checking for library containing inet_pton... none required
checking for res_query... yes
checking for syslog... yes
checking for vsyslog... yes
checking for snprintf... yes
checking for vsnprintf... yes
checking if snprintf can handle NULL arguments... configure: error: in '/<<PKGBUILDDIR>>':
configure: error: cannot run test program while cross compiling
See 'config.log' for more details
	tail -v -n \+0 config.log
==> config.log <==
This file contains any messages produced by compilers while
running configure, to aid debugging if configure makes a mistake.

It was created by jabberd2 configure 2.7.0, which was
generated by GNU Autoconf 2.72.  Invocation command line was

  $ ./configure --build=x86_64-linux-gnu --prefix=/usr '--includedir=${prefix}/include' '--mandir=${prefix}/share/man' '--infodir=${prefix}/share/info' --sysconfdir=/etc --localstatedir=/var --disable-option-checking --disable-silent-rules '--libdir=${prefix}/lib/mips64el-linux-gnuabi64' --runstatedir=/run --disable-maintainer-mode --disable-dependency-tracking --host=mips64el-linux-gnuabi64 --prefix=/usr '--bindir=${prefix}/sbin' --sysconfdir=/etc/jabberd2 --program-prefix=jabberd2- --enable-ssl --enable-mysql --enable-pgsql --enable-sqlite --enable-db --enable-ldap --enable-pam --enable-pipe --enable-anon --enable-fs --enable-websocket --without-subst

## --------- ##
## Platform. ##
## --------- ##

hostname = debian-ci-siliconvalley
uname -m = x86_64
uname -r = 6.1.0-31-amd64
uname -s = Linux
uname -v = #1 SMP PREEMPT_DYNAMIC Debian 6.1.128-1 (2025-02-07)

/usr/bin/uname -p = unknown
/bin/uname -X     = unknown

/bin/arch              = x86_64
/usr/bin/arch -k       = unknown
/usr/convex/getsysinfo = unknown
/usr/bin/hostinfo      = unknown
/bin/machine           = unknown
/usr/bin/oslevel       = unknown
/bin/universe          = unknown

PATH: /usr/local/sbin/
PATH: /usr/local/bin/
PATH: /usr/sbin/
PATH: /usr/bin/
PATH: /sbin/
PATH: /bin/
PATH: /usr/games/


## ----------- ##
## Core tests. ##
## ----------- ##

configure:2454: loading site script /etc/dpkg-cross/cross-config.mips64el
| . `dirname $ac_site_file`/cross-config.cache
configure:2842: looking for aux files: config.guess config.sub ltmain.sh compile missing install-sh
configure:2855:  trying ./
configure:2884:   ./config.guess found
configure:2884:   ./config.sub found
configure:2884:   ./ltmain.sh found
configure:2884:   ./compile found
configure:2884:   ./missing found
configure:2866:   ./install-sh found
configure:3018: checking for a BSD-compatible install
configure:3092: result: /usr/bin/install -c
configure:3103: checking whether sleep supports fractional seconds
configure:3119: result: yes
configure:3122: checking filesystem timestamp resolution
configure:3257: result: 0.01
configure:3262: checking whether build environment is sane
configure:3303: result: yes
configure:3369: checking for mips64el-linux-gnuabi64-strip
configure:3390: found /usr/bin/mips64el-linux-gnuabi64-strip
configure:3402: result: mips64el-linux-gnuabi64-strip
configure:3474: checking for a race-free mkdir -p
configure:3517: result: /usr/bin/mkdir -p
configure:3524: checking for gawk
configure:3560: result: no
configure:3524: checking for mawk
configure:3545: found /usr/bin/mawk
configure:3557: result: mawk
configure:3568: checking whether make sets $(MAKE)
configure:3592: result: yes
configure:3618: checking whether make supports nested variables
configure:3637: result: yes
configure:3651: checking xargs -n works
configure:3667: result: yes
configure:3786: checking for mips64el-linux-gnuabi64-gcc
configure:3807: found /usr/bin/mips64el-linux-gnuabi64-gcc
configure:3819: result: mips64el-linux-gnuabi64-gcc
configure:4224: checking for C compiler version
configure:4233: mips64el-linux-gnuabi64-gcc --version >&5
mips64el-linux-gnuabi64-gcc (Debian 14.2.0-13) 14.2.0
Copyright (C) 2024 Free Software Foundation, Inc.
This is free software; see the source for copying conditions.  There is NO
warranty; not even for MERCHANTABILITY or FITNESS FOR A PARTICULAR PURPOSE.

configure:4244: $? = 0
configure:4233: mips64el-linux-gnuabi64-gcc -v >&5
Using built-in specs.
COLLECT_GCC=mips64el-linux-gnuabi64-gcc
COLLECT_LTO_WRAPPER=/usr/libexec/gcc-cross/mips64el-linux-gnuabi64/14/lto-wrapper
Target: mips64el-linux-gnuabi64
Configured with: ../src/configure -v --with-pkgversion='Debian 14.2.0-13' --with-bugurl=file:///usr/share/doc/gcc-14/README.Bugs --enable-languages=c,ada,c++,go,d,fortran,objc,obj-c++,m2 --prefix=/usr --with-gcc-major-version-only --program-suffix=-14 --enable-shared --enable-linker-build-id --libexecdir=/usr/libexec --without-included-gettext --enable-threads=posix --libdir=/usr/lib --enable-nls --with-sysroot=/ --enable-clocale=gnu --enable-libstdcxx-debug --enable-libstdcxx-time=yes --with-default-libstdcxx-abi=new --enable-libstdcxx-backtrace --enable-gnu-unique-object --disable-libitm --disable-libsanitizer --disable-libquadmath --disable-libquadmath-support --enable-plugin --enable-default-pie --with-system-zlib --enable-libphobos-checking=release --without-target-system-zlib --enable-multiarch --disable-werror --enable-multilib --with-mips-plt --with-arch-64=mips64r2 --with-madd4=no --enable-targets=all --with-arch-32=mips32r2 --with-fp-32=xx --enable-checking=release --build=x86_64-linux-gnu --host=x86_64-linux-gnu --target=mips64el-linux-gnuabi64 --program-prefix=mips64el-linux-gnuabi64- --includedir=/usr/mips64el-linux-gnuabi64/include --with-build-config=bootstrap-lto-lean --enable-link-serialization=3
Thread model: posix
Supported LTO compression algorithms: zlib zstd
gcc version 14.2.0 (Debian 14.2.0-13) 
configure:4244: $? = 0
configure:4233: mips64el-linux-gnuabi64-gcc -V >&5
mips64el-linux-gnuabi64-gcc: error: unrecognized command-line option '-V'
mips64el-linux-gnuabi64-gcc: fatal error: no input files
compilation terminated.
configure:4244: $? = 1
configure:4233: mips64el-linux-gnuabi64-gcc -qversion >&5
mips64el-linux-gnuabi64-gcc: error: unrecognized command-line option '-qversion'; did you mean '--version'?
mips64el-linux-gnuabi64-gcc: fatal error: no input files
compilation terminated.
configure:4244: $? = 1
configure:4233: mips64el-linux-gnuabi64-gcc -version >&5
mips64el-linux-gnuabi64-gcc: error: unrecognized command-line option '-version'
mips64el-linux-gnuabi64-gcc: fatal error: no input files
compilation terminated.
configure:4244: $? = 1
configure:4264: checking whether the C compiler works
configure:4286: mips64el-linux-gnuabi64-gcc -g -O2 -Werror=implicit-function-declaration -ffile-prefix-map=/<<PKGBUILDDIR>>=. -fstack-protector-strong -Wformat -Werror=format-security -Wdate-time -D_FORTIFY_SOURCE=2 -Wl,-z,relro -Wl,-z,now conftest.c  >&5
configure:4290: $? = 0
configure:4341: result: yes
configure:4345: checking for C compiler default output file name
configure:4347: result: a.out
configure:4353: checking for suffix of executables
configure:4360: mips64el-linux-gnuabi64-gcc -o conftest -g -O2 -Werror=implicit-function-declaration -ffile-prefix-map=/<<PKGBUILDDIR>>=. -fstack-protector-strong -Wformat -Werror=format-security -Wdate-time -D_FORTIFY_SOURCE=2 -Wl,-z,relro -Wl,-z,now conftest.c  >&5
configure:4364: $? = 0
configure:4388: result: 
configure:4412: checking whether we are cross compiling
configure:4450: result: yes
configure:4456: checking for suffix of object files
configure:4479: mips64el-linux-gnuabi64-gcc -c -g -O2 -Werror=implicit-function-declaration -ffile-prefix-map=/<<PKGBUILDDIR>>=. -fstack-protector-strong -Wformat -Werror=format-security -Wdate-time -D_FORTIFY_SOURCE=2 conftest.c >&5
configure:4483: $? = 0
configure:4507: result: o
configure:4511: checking whether the compiler supports GNU C
configure:4531: mips64el-linux-gnuabi64-gcc -c -g -O2 -Werror=implicit-function-declaration -ffile-prefix-map=/<<PKGBUILDDIR>>=. -fstack-protector-strong -Wformat -Werror=format-security -Wdate-time -D_FORTIFY_SOURCE=2 conftest.c >&5
configure:4531: $? = 0
configure:4543: result: yes
configure:4554: checking whether mips64el-linux-gnuabi64-gcc accepts -g
configure:4575: mips64el-linux-gnuabi64-gcc -c -g -Wdate-time -D_FORTIFY_SOURCE=2 conftest.c >&5
configure:4575: $? = 0
configure:4622: result: yes
configure:4642: checking for mips64el-linux-gnuabi64-gcc option to enable C11 features
configure:4657: mips64el-linux-gnuabi64-gcc  -c -g -O2 -Werror=implicit-function-declaration -ffile-prefix-map=/<<PKGBUILDDIR>>=. -fstack-protector-strong -Wformat -Werror=format-security -Wdate-time -D_FORTIFY_SOURCE=2 conftest.c >&5
configure:4657: $? = 0
configure:4676: result: none needed
configure:4800: checking whether mips64el-linux-gnuabi64-gcc understands -c and -o together
configure:4823: mips64el-linux-gnuabi64-gcc -c conftest.c -o conftest2.o
configure:4826: $? = 0
configure:4823: mips64el-linux-gnuabi64-gcc -c conftest.c -o conftest2.o
configure:4826: $? = 0
configure:4839: result: yes
configure:4859: checking whether make supports the include directive
configure:4874: make -f confmf.GNU && cat confinc.out
make[2]: Entering directory '/<<PKGBUILDDIR>>'
make[2]: Leaving directory '/<<PKGBUILDDIR>>'
this is the am__doit target
configure:4877: $? = 0
configure:4896: result: yes (GNU style)
configure:4922: checking dependency style of mips64el-linux-gnuabi64-gcc
configure:5035: result: none
configure:5057: checking how to run the C preprocessor
configure:5083: mips64el-linux-gnuabi64-gcc -E -Wdate-time -D_FORTIFY_SOURCE=2 conftest.c
configure:5083: $? = 0
configure:5099: mips64el-linux-gnuabi64-gcc -E -Wdate-time -D_FORTIFY_SOURCE=2 conftest.c
conftest.c:11:10: fatal error: ac_nonexistent.h: No such file or directory
   11 | #include <ac_nonexistent.h>
      |          ^~~~~~~~~~~~~~~~~~
compilation terminated.
configure:5099: $? = 1
configure: failed program was:
| /* confdefs.h */
| #define PACKAGE_NAME "jabberd2"
| #define PACKAGE_TARNAME "jabberd2"
| #define PACKAGE_VERSION "2.7.0"
| #define PACKAGE_STRING "jabberd2 2.7.0"
| #define PACKAGE_BUGREPORT "jabberd2@lists.xiaoka.com"
| #define PACKAGE_URL ""
| #define PACKAGE "jabberd2"
| #define VERSION "2.7.0"
| /* end confdefs.h.  */
| #include <ac_nonexistent.h>
configure:5128: result: mips64el-linux-gnuabi64-gcc -E
configure:5142: mips64el-linux-gnuabi64-gcc -E -Wdate-time -D_FORTIFY_SOURCE=2 conftest.c
configure:5142: $? = 0
configure:5158: mips64el-linux-gnuabi64-gcc -E -Wdate-time -D_FORTIFY_SOURCE=2 conftest.c
conftest.c:11:10: fatal error: ac_nonexistent.h: No such file or directory
   11 | #include <ac_nonexistent.h>
      |          ^~~~~~~~~~~~~~~~~~
compilation terminated.
configure:5158: $? = 1
configure: failed program was:
| /* confdefs.h */
| #define PACKAGE_NAME "jabberd2"
| #define PACKAGE_TARNAME "jabberd2"
| #define PACKAGE_VERSION "2.7.0"
| #define PACKAGE_STRING "jabberd2 2.7.0"
| #define PACKAGE_BUGREPORT "jabberd2@lists.xiaoka.com"
| #define PACKAGE_URL ""
| #define PACKAGE "jabberd2"
| #define VERSION "2.7.0"
| /* end confdefs.h.  */
| #include <ac_nonexistent.h>
configure:5191: checking whether ln -s works
configure:5195: result: yes
configure:5202: checking whether make sets $(MAKE)
configure:5226: result: yes
configure:5305: checking build system type
configure:5321: result: x86_64-pc-linux-gnu
configure:5341: checking host system type
configure:5356: result: mips64el-unknown-linux-gnuabi64
configure:5397: checking how to print strings
configure:5424: result: printf
configure:5445: checking for a sed that does not truncate output
configure:5517: result: /usr/bin/sed
configure:5535: checking for grep that handles long lines and -e
configure:5601: result: /usr/bin/grep
configure:5606: checking for egrep
configure:5676: result: /usr/bin/grep -E
configure:5683: checking for fgrep
configure:5753: result: /usr/bin/grep -F
configure:5790: checking for ld used by mips64el-linux-gnuabi64-gcc
configure:5859: result: /usr/mips64el-linux-gnuabi64/bin/ld
configure:5866: checking if the linker (/usr/mips64el-linux-gnuabi64/bin/ld) is GNU ld
configure:5883: result: yes
configure:5895: checking for BSD- or MS-compatible name lister (nm)
configure:5951: result: /usr/bin/mips64el-linux-gnuabi64-nm -B
configure:6093: checking the name lister (/usr/bin/mips64el-linux-gnuabi64-nm -B) interface
configure:6101: mips64el-linux-gnuabi64-gcc -c -g -O2 -Werror=implicit-function-declaration -ffile-prefix-map=/<<PKGBUILDDIR>>=. -fstack-protector-strong -Wformat -Werror=format-security -Wdate-time -D_FORTIFY_SOURCE=2 conftest.c >&5
configure:6104: /usr/bin/mips64el-linux-gnuabi64-nm -B "conftest.o"
configure:6107: output
0000000000000000 B some_variable
configure:6115: result: BSD nm
configure:6119: checking the maximum length of command line arguments
configure:6252: result: 1572864
configure:6300: checking how to convert x86_64-pc-linux-gnu file names to mips64el-unknown-linux-gnuabi64 format
configure:6342: result: func_convert_file_noop
configure:6349: checking how to convert x86_64-pc-linux-gnu file names to toolchain format
configure:6371: result: func_convert_file_noop
configure:6378: checking for /usr/mips64el-linux-gnuabi64/bin/ld option to reload object files
configure:6387: result: -r
configure:6420: checking for file
configure:6441: found /usr/bin/file
configure:6454: result: file
configure:6471: checking for mips64el-linux-gnuabi64-objdump
configure:6492: found /usr/bin/mips64el-linux-gnuabi64-objdump
configure:6504: result: mips64el-linux-gnuabi64-objdump
configure:6582: checking how to recognize dependent libraries
configure:6791: result: pass_all
configure:6836: checking for mips64el-linux-gnuabi64-dlltool
configure:6872: result: no
configure:6882: checking for dlltool
configure:6918: result: no
configure:6948: checking how to associate runtime and link libraries
configure:6977: result: printf %s\n
configure:6992: checking for mips64el-linux-gnuabi64-ranlib
configure:7013: found /usr/bin/mips64el-linux-gnuabi64-ranlib
configure:7025: result: mips64el-linux-gnuabi64-ranlib
configure:7098: checking for mips64el-linux-gnuabi64-ar
configure:7119: found /usr/bin/mips64el-linux-gnuabi64-ar
configure:7131: result: mips64el-linux-gnuabi64-ar
configure:7234: checking for archiver @FILE support
configure:7252: mips64el-linux-gnuabi64-gcc -c -g -O2 -Werror=implicit-function-declaration -ffile-prefix-map=/<<PKGBUILDDIR>>=. -fstack-protector-strong -Wformat -Werror=format-security -Wdate-time -D_FORTIFY_SOURCE=2 conftest.c >&5
configure:7252: $? = 0
configure:7256: mips64el-linux-gnuabi64-ar cr libconftest.a @conftest.lst >&5
configure:7259: $? = 0
configure:7264: mips64el-linux-gnuabi64-ar cr libconftest.a @conftest.lst >&5
mips64el-linux-gnuabi64-ar: conftest.o: No such file or directory
configure:7267: $? = 1
configure:7280: result: @
configure:7298: checking for mips64el-linux-gnuabi64-strip
configure:7331: result: mips64el-linux-gnuabi64-strip
configure:7480: checking command to parse /usr/bin/mips64el-linux-gnuabi64-nm -B output from mips64el-linux-gnuabi64-gcc object
configure:7634: mips64el-linux-gnuabi64-gcc -c -g -O2 -Werror=implicit-function-declaration -ffile-prefix-map=/<<PKGBUILDDIR>>=. -fstack-protector-strong -Wformat -Werror=format-security -Wdate-time -D_FORTIFY_SOURCE=2 conftest.c >&5
configure:7637: $? = 0
configure:7641: /usr/bin/mips64el-linux-gnuabi64-nm -B conftest.o | /usr/bin/sed -n -e 's/^.*[	 ]\([ABCDGIRSTW][ABCDGIRSTW]*\)[	 ][	 ]*\([_A-Za-z][_A-Za-z0-9]*\)$/\1 \2 \2/p' | /usr/bin/sed '/ __gnu_lto/d' > conftest.nm
configure:7707: mips64el-linux-gnuabi64-gcc -o conftest -g -O2 -Werror=implicit-function-declaration -ffile-prefix-map=/<<PKGBUILDDIR>>=. -fstack-protector-strong -Wformat -Werror=format-security -Wdate-time -D_FORTIFY_SOURCE=2 -Wl,-z,relro -Wl,-z,now conftest.c conftstm.o >&5
configure:7710: $? = 0
configure:7749: result: ok
configure:7796: checking for sysroot
configure:7830: result: no
configure:7837: checking for a working dd
configure:7882: result: /usr/bin/dd
configure:7886: checking how to truncate binary pipes
configure:7903: result: /usr/bin/dd bs=4096 count=1
configure:7999: mips64el-linux-gnuabi64-gcc -c -g -O2 -Werror=implicit-function-declaration -ffile-prefix-map=/<<PKGBUILDDIR>>=. -fstack-protector-strong -Wformat -Werror=format-security -Wdate-time -D_FORTIFY_SOURCE=2 conftest.c >&5
configure:8002: $? = 0
configure:8197: checking for mips64el-linux-gnuabi64-mt
configure:8233: result: no
configure:8243: checking for mt
configure:8279: result: no
configure:8299: checking if : is a manifest tool
configure:8306: : '-?'
configure:8315: result: no
configure:9112: checking for stdio.h
configure:9112: mips64el-linux-gnuabi64-gcc -c -g -O2 -Werror=implicit-function-declaration -ffile-prefix-map=/<<PKGBUILDDIR>>=. -fstack-protector-strong -Wformat -Werror=format-security -Wdate-time -D_FORTIFY_SOURCE=2 conftest.c >&5
configure:9112: $? = 0
configure:9112: result: yes
configure:9112: checking for stdlib.h
configure:9112: mips64el-linux-gnuabi64-gcc -c -g -O2 -Werror=implicit-function-declaration -ffile-prefix-map=/<<PKGBUILDDIR>>=. -fstack-protector-strong -Wformat -Werror=format-security -Wdate-time -D_FORTIFY_SOURCE=2 conftest.c >&5
configure:9112: $? = 0
configure:9112: result: yes
configure:9112: checking for string.h
configure:9112: mips64el-linux-gnuabi64-gcc -c -g -O2 -Werror=implicit-function-declaration -ffile-prefix-map=/<<PKGBUILDDIR>>=. -fstack-protector-strong -Wformat -Werror=format-security -Wdate-time -D_FORTIFY_SOURCE=2 conftest.c >&5
configure:9112: $? = 0
configure:9112: result: yes
configure:9112: checking for inttypes.h
configure:9112: mips64el-linux-gnuabi64-gcc -c -g -O2 -Werror=implicit-function-declaration -ffile-prefix-map=/<<PKGBUILDDIR>>=. -fstack-protector-strong -Wformat -Werror=format-security -Wdate-time -D_FORTIFY_SOURCE=2 conftest.c >&5
configure:9112: $? = 0
configure:9112: result: yes
configure:9112: checking for stdint.h
configure:9112: mips64el-linux-gnuabi64-gcc -c -g -O2 -Werror=implicit-function-declaration -ffile-prefix-map=/<<PKGBUILDDIR>>=. -fstack-protector-strong -Wformat -Werror=format-security -Wdate-time -D_FORTIFY_SOURCE=2 conftest.c >&5
configure:9112: $? = 0
configure:9112: result: yes
configure:9112: checking for strings.h
configure:9112: mips64el-linux-gnuabi64-gcc -c -g -O2 -Werror=implicit-function-declaration -ffile-prefix-map=/<<PKGBUILDDIR>>=. -fstack-protector-strong -Wformat -Werror=format-security -Wdate-time -D_FORTIFY_SOURCE=2 conftest.c >&5
configure:9112: $? = 0
configure:9112: result: yes
configure:9112: checking for sys/stat.h
configure:9112: mips64el-linux-gnuabi64-gcc -c -g -O2 -Werror=implicit-function-declaration -ffile-prefix-map=/<<PKGBUILDDIR>>=. -fstack-protector-strong -Wformat -Werror=format-security -Wdate-time -D_FORTIFY_SOURCE=2 conftest.c >&5
configure:9112: $? = 0
configure:9112: result: yes
configure:9112: checking for sys/types.h
configure:9112: mips64el-linux-gnuabi64-gcc -c -g -O2 -Werror=implicit-function-declaration -ffile-prefix-map=/<<PKGBUILDDIR>>=. -fstack-protector-strong -Wformat -Werror=format-security -Wdate-time -D_FORTIFY_SOURCE=2 conftest.c >&5
configure:9112: $? = 0
configure:9112: result: yes
configure:9112: checking for unistd.h
configure:9112: mips64el-linux-gnuabi64-gcc -c -g -O2 -Werror=implicit-function-declaration -ffile-prefix-map=/<<PKGBUILDDIR>>=. -fstack-protector-strong -Wformat -Werror=format-security -Wdate-time -D_FORTIFY_SOURCE=2 conftest.c >&5
configure:9112: $? = 0
configure:9112: result: yes
configure:9112: checking for sys/time.h
configure:9112: mips64el-linux-gnuabi64-gcc -c -g -O2 -Werror=implicit-function-declaration -ffile-prefix-map=/<<PKGBUILDDIR>>=. -fstack-protector-strong -Wformat -Werror=format-security -Wdate-time -D_FORTIFY_SOURCE=2 conftest.c >&5
configure:9112: $? = 0
configure:9112: result: yes
configure:9112: checking for vfork.h
configure:9112: mips64el-linux-gnuabi64-gcc -c -g -O2 -Werror=implicit-function-declaration -ffile-prefix-map=/<<PKGBUILDDIR>>=. -fstack-protector-strong -Wformat -Werror=format-security -Wdate-time -D_FORTIFY_SOURCE=2 conftest.c >&5
conftest.c:49:10: fatal error: vfork.h: No such file or directory
   49 | #include <vfork.h>
      |          ^~~~~~~~~
compilation terminated.
configure:9112: $? = 1
configure: failed program was:
| /* confdefs.h */
| #define PACKAGE_NAME "jabberd2"
| #define PACKAGE_TARNAME "jabberd2"
| #define PACKAGE_VERSION "2.7.0"
| #define PACKAGE_STRING "jabberd2 2.7.0"
| #define PACKAGE_BUGREPORT "jabberd2@lists.xiaoka.com"
| #define PACKAGE_URL ""
| #define PACKAGE "jabberd2"
| #define VERSION "2.7.0"
| #define HAVE_STDIO_H 1
| #define HAVE_STDLIB_H 1
| #define HAVE_STRING_H 1
| #define HAVE_INTTYPES_H 1
| #define HAVE_STDINT_H 1
| #define HAVE_STRINGS_H 1
| #define HAVE_SYS_STAT_H 1
| #define HAVE_SYS_TYPES_H 1
| #define HAVE_UNISTD_H 1
| #define HAVE_SYS_TIME_H 1
| /* end confdefs.h.  */
| #include <stddef.h>
| #ifdef HAVE_STDIO_H
| # include <stdio.h>
| #endif
| #ifdef HAVE_STDLIB_H
| # include <stdlib.h>
| #endif
| #ifdef HAVE_STRING_H
| # include <string.h>
| #endif
| #ifdef HAVE_INTTYPES_H
| # include <inttypes.h>
| #endif
| #ifdef HAVE_STDINT_H
| # include <stdint.h>
| #endif
| #ifdef HAVE_STRINGS_H
| # include <strings.h>
| #endif
| #ifdef HAVE_SYS_TYPES_H
| # include <sys/types.h>
| #endif
| #ifdef HAVE_SYS_STAT_H
| # include <sys/stat.h>
| #endif
| #ifdef HAVE_UNISTD_H
| # include <unistd.h>
| #endif
| #include <vfork.h>
configure:9112: result: no
configure:9112: checking for sys/select.h
configure:9112: mips64el-linux-gnuabi64-gcc -c -g -O2 -Werror=implicit-function-declaration -ffile-prefix-map=/<<PKGBUILDDIR>>=. -fstack-protector-strong -Wformat -Werror=format-security -Wdate-time -D_FORTIFY_SOURCE=2 conftest.c >&5
configure:9112: $? = 0
configure:9112: result: yes
configure:9112: checking for sys/socket.h
configure:9112: mips64el-linux-gnuabi64-gcc -c -g -O2 -Werror=implicit-function-declaration -ffile-prefix-map=/<<PKGBUILDDIR>>=. -fstack-protector-strong -Wformat -Werror=format-security -Wdate-time -D_FORTIFY_SOURCE=2 conftest.c >&5
configure:9112: $? = 0
configure:9112: result: yes
configure:9137: checking for dlfcn.h
configure:9137: mips64el-linux-gnuabi64-gcc -c -g -O2 -Werror=implicit-function-declaration -ffile-prefix-map=/<<PKGBUILDDIR>>=. -fstack-protector-strong -Wformat -Werror=format-security -Wdate-time -D_FORTIFY_SOURCE=2 conftest.c >&5
configure:9137: $? = 0
configure:9137: result: yes
configure:9406: checking for objdir
configure:9423: result: .libs
configure:9689: checking if mips64el-linux-gnuabi64-gcc supports -fno-rtti -fno-exceptions
configure:9708: mips64el-linux-gnuabi64-gcc -c -g -O2 -Werror=implicit-function-declaration -ffile-prefix-map=/<<PKGBUILDDIR>>=. -fstack-protector-strong -Wformat -Werror=format-security -Wdate-time -D_FORTIFY_SOURCE=2 -fno-rtti -fno-exceptions conftest.c >&5
cc1: warning: command-line option '-fno-rtti' is valid for C++/D/ObjC++ but not for C
configure:9712: $? = 0
configure:9726: result: no
configure:10105: checking for mips64el-linux-gnuabi64-gcc option to produce PIC
configure:10114: result: -fPIC -DPIC
configure:10122: checking if mips64el-linux-gnuabi64-gcc PIC flag -fPIC -DPIC works
configure:10141: mips64el-linux-gnuabi64-gcc -c -g -O2 -Werror=implicit-function-declaration -ffile-prefix-map=/<<PKGBUILDDIR>>=. -fstack-protector-strong -Wformat -Werror=format-security -Wdate-time -D_FORTIFY_SOURCE=2 -fPIC -DPIC -DPIC conftest.c >&5
configure:10145: $? = 0
configure:10159: result: yes
configure:10188: checking if mips64el-linux-gnuabi64-gcc static flag -static works
configure:10218: result: yes
configure:10233: checking if mips64el-linux-gnuabi64-gcc supports -c -o file.o
configure:10255: mips64el-linux-gnuabi64-gcc -c -g -O2 -Werror=implicit-function-declaration -ffile-prefix-map=/<<PKGBUILDDIR>>=. -fstack-protector-strong -Wformat -Werror=format-security -Wdate-time -D_FORTIFY_SOURCE=2 -o out/conftest2.o conftest.c >&5
configure:10259: $? = 0
configure:10282: result: yes
configure:10290: checking if mips64el-linux-gnuabi64-gcc supports -c -o file.o
configure:10339: result: yes
configure:10372: checking whether the mips64el-linux-gnuabi64-gcc linker (/usr/mips64el-linux-gnuabi64/bin/ld -m elf64ltsmip) supports shared libraries
configure:11660: result: yes
configure:11697: checking whether -lc should be explicitly linked in
configure:11706: mips64el-linux-gnuabi64-gcc -c -g -O2 -Werror=implicit-function-declaration -ffile-prefix-map=/<<PKGBUILDDIR>>=. -fstack-protector-strong -Wformat -Werror=format-security -Wdate-time -D_FORTIFY_SOURCE=2 conftest.c >&5
configure:11709: $? = 0
configure:11724: mips64el-linux-gnuabi64-gcc -shared  -fPIC -DPIC conftest.o  -v -Wl,-soname -Wl,conftest -o conftest 2\>\&1 \| /usr/bin/grep  -lc  \>/dev/null 2\>\&1
configure:11727: $? = 0
configure:11742: result: no
configure:11902: checking dynamic linker characteristics
configure:12521: mips64el-linux-gnuabi64-gcc -o conftest -g -O2 -Werror=implicit-function-declaration -ffile-prefix-map=/<<PKGBUILDDIR>>=. -fstack-protector-strong -Wformat -Werror=format-security -Wdate-time -D_FORTIFY_SOURCE=2 -Wl,-z,relro -Wl,-z,now -Wl,-rpath -Wl,/foo conftest.c  >&5
configure:12521: $? = 0
configure:13304: result: GNU/Linux ld.so
configure:13426: checking how to hardcode library paths into programs
configure:13451: result: immediate
configure:13562: checking for shl_load
configure:13562: mips64el-linux-gnuabi64-gcc -o conftest -g -O2 -Werror=implicit-function-declaration -ffile-prefix-map=/<<PKGBUILDDIR>>=. -fstack-protector-strong -Wformat -Werror=format-security -Wdate-time -D_FORTIFY_SOURCE=2 -Wl,-z,relro -Wl,-z,now conftest.c  >&5
/usr/lib/gcc-cross/mips64el-linux-gnuabi64/14/../../../../mips64el-linux-gnuabi64/bin/ld: /tmp/ccFkdkhb.o: in function `main':
./conftest.c:53:(.text.startup+0x14): undefined reference to `shl_load'
/usr/lib/gcc-cross/mips64el-linux-gnuabi64/14/../../../../mips64el-linux-gnuabi64/bin/ld: ./conftest.c:53:(.text.startup+0x1c): undefined reference to `shl_load'
collect2: error: ld returned 1 exit status
configure:13562: $? = 1
configure: failed program was:
| /* confdefs.h */
| #define PACKAGE_NAME "jabberd2"
| #define PACKAGE_TARNAME "jabberd2"
| #define PACKAGE_VERSION "2.7.0"
| #define PACKAGE_STRING "jabberd2 2.7.0"
| #define PACKAGE_BUGREPORT "jabberd2@lists.xiaoka.com"
| #define PACKAGE_URL ""
| #define PACKAGE "jabberd2"
| #define VERSION "2.7.0"
| #define HAVE_STDIO_H 1
| #define HAVE_STDLIB_H 1
| #define HAVE_STRING_H 1
| #define HAVE_INTTYPES_H 1
| #define HAVE_STDINT_H 1
| #define HAVE_STRINGS_H 1
| #define HAVE_SYS_STAT_H 1
| #define HAVE_SYS_TYPES_H 1
| #define HAVE_UNISTD_H 1
| #define HAVE_SYS_TIME_H 1
| #define HAVE_SYS_SELECT_H 1
| #define HAVE_SYS_SOCKET_H 1
| #define STDC_HEADERS 1
| #define HAVE_DLFCN_H 1
| #define LT_OBJDIR ".libs/"
| /* end confdefs.h.  */
| /* Define shl_load to an innocuous variant, in case <limits.h> declares shl_load.
|    For example, HP-UX 11i <limits.h> declares gettimeofday.  */
| #define shl_load innocuous_shl_load
| 
| /* System header to define __stub macros and hopefully few prototypes,
|    which can conflict with char shl_load (void); below.  */
| 
| #include <limits.h>
| #undef shl_load
| 
| /* Override any GCC internal prototype to avoid an error.
|    Use char because int might match the return type of a GCC
|    builtin and then its argument prototype would still apply.  */
| #ifdef __cplusplus
| extern "C"
| #endif
| char shl_load (void);
| /* The GNU C library defines this for functions which it implements
|     to always fail with ENOSYS.  Some functions are actually named
|     something starting with __ and the normal name is an alias.  */
| #if defined __stub_shl_load || defined __stub___shl_load
| choke me
| #endif
| 
| int
| main (void)
| {
| return shl_load ();
|   ;
|   return 0;
| }
configure:13562: result: no
configure:13567: checking for shl_load in -ldld
configure:13596: mips64el-linux-gnuabi64-gcc -o conftest -g -O2 -Werror=implicit-function-declaration -ffile-prefix-map=/<<PKGBUILDDIR>>=. -fstack-protector-strong -Wformat -Werror=format-security -Wdate-time -D_FORTIFY_SOURCE=2 -Wl,-z,relro -Wl,-z,now conftest.c -ldld   >&5
/usr/lib/gcc-cross/mips64el-linux-gnuabi64/14/../../../../mips64el-linux-gnuabi64/bin/ld: cannot find -ldld: No such file or directory
collect2: error: ld returned 1 exit status
configure:13596: $? = 1
configure: failed program was:
| /* confdefs.h */
| #define PACKAGE_NAME "jabberd2"
| #define PACKAGE_TARNAME "jabberd2"
| #define PACKAGE_VERSION "2.7.0"
| #define PACKAGE_STRING "jabberd2 2.7.0"
| #define PACKAGE_BUGREPORT "jabberd2@lists.xiaoka.com"
| #define PACKAGE_URL ""
| #define PACKAGE "jabberd2"
| #define VERSION "2.7.0"
| #define HAVE_STDIO_H 1
| #define HAVE_STDLIB_H 1
| #define HAVE_STRING_H 1
| #define HAVE_INTTYPES_H 1
| #define HAVE_STDINT_H 1
| #define HAVE_STRINGS_H 1
| #define HAVE_SYS_STAT_H 1
| #define HAVE_SYS_TYPES_H 1
| #define HAVE_UNISTD_H 1
| #define HAVE_SYS_TIME_H 1
| #define HAVE_SYS_SELECT_H 1
| #define HAVE_SYS_SOCKET_H 1
| #define STDC_HEADERS 1
| #define HAVE_DLFCN_H 1
| #define LT_OBJDIR ".libs/"
| /* end confdefs.h.  */
| 
| /* Override any GCC internal prototype to avoid an error.
|    Use char because int might match the return type of a GCC
|    builtin and then its argument prototype would still apply.
|    The 'extern "C"' is for builds by C++ compilers;
|    although this is not generally supported in C code supporting it here
|    has little cost and some practical benefit (sr 110532).  */
| #ifdef __cplusplus
| extern "C"
| #endif
| char shl_load (void);
| int
| main (void)
| {
| return shl_load ();
|   ;
|   return 0;
| }
configure:13608: result: no
configure:13614: checking for dlopen
configure:13614: mips64el-linux-gnuabi64-gcc -o conftest -g -O2 -Werror=implicit-function-declaration -ffile-prefix-map=/<<PKGBUILDDIR>>=. -fstack-protector-strong -Wformat -Werror=format-security -Wdate-time -D_FORTIFY_SOURCE=2 -Wl,-z,relro -Wl,-z,now conftest.c  >&5
configure:13614: $? = 0
configure:13614: result: yes
configure:13801: checking whether a program can dlopen itself
configure:13904: result: cross
configure:14051: checking whether stripping libraries is possible
configure:14060: result: yes
configure:14102: checking if libtool supports shared libraries
configure:14104: result: yes
configure:14107: checking whether to build shared libraries
configure:14132: result: yes
configure:14135: checking whether to build static libraries
configure:14139: result: no
configure:14281: checking whether C compiler accepts -fdiagnostics-color
configure:14301: mips64el-linux-gnuabi64-gcc -c -g -O2 -Werror=implicit-function-declaration -ffile-prefix-map=/<<PKGBUILDDIR>>=. -fstack-protector-strong -Wformat -Werror=format-security -funsigned-char  -fdiagnostics-color -Wdate-time -D_FORTIFY_SOURCE=2 conftest.c >&5
configure:14301: $? = 0
configure:14312: result: yes
configure:14368: checking for dirent.h that defines DIR
configure:14388: mips64el-linux-gnuabi64-gcc -c -g -O2 -Werror=implicit-function-declaration -ffile-prefix-map=/<<PKGBUILDDIR>>=. -fstack-protector-strong -Wformat -Werror=format-security -funsigned-char -fdiagnostics-color -Wdate-time -D_FORTIFY_SOURCE=2 conftest.c >&5
configure:14388: $? = 0
configure:14399: result: yes
configure:14413: checking for library containing opendir
configure:14449: mips64el-linux-gnuabi64-gcc -o conftest -g -O2 -Werror=implicit-function-declaration -ffile-prefix-map=/<<PKGBUILDDIR>>=. -fstack-protector-strong -Wformat -Werror=format-security -funsigned-char -fdiagnostics-color -Wdate-time -D_FORTIFY_SOURCE=2 -Wl,-z,relro -Wl,-z,now conftest.c  >&5
configure:14449: $? = 0
configure:14471: result: none required
configure:14550: checking for sys/types.h
configure:14550: result: yes
configure:14568: checking for netinet/in.h
configure:14568: mips64el-linux-gnuabi64-gcc -c -g -O2 -Werror=implicit-function-declaration -ffile-prefix-map=/<<PKGBUILDDIR>>=. -fstack-protector-strong -Wformat -Werror=format-security -funsigned-char -fdiagnostics-color -Wdate-time -D_FORTIFY_SOURCE=2 conftest.c >&5
configure:14568: $? = 0
configure:14568: result: yes
configure:14586: checking for arpa/nameser.h
configure:14586: mips64el-linux-gnuabi64-gcc -c -g -O2 -Werror=implicit-function-declaration -ffile-prefix-map=/<<PKGBUILDDIR>>=. -fstack-protector-strong -Wformat -Werror=format-security -funsigned-char -fdiagnostics-color -Wdate-time -D_FORTIFY_SOURCE=2 conftest.c >&5
configure:14586: $? = 0
configure:14586: result: yes
configure:14604: checking for netdb.h
configure:14604: mips64el-linux-gnuabi64-gcc -c -g -O2 -Werror=implicit-function-declaration -ffile-prefix-map=/<<PKGBUILDDIR>>=. -fstack-protector-strong -Wformat -Werror=format-security -funsigned-char -fdiagnostics-color -Wdate-time -D_FORTIFY_SOURCE=2 conftest.c >&5
configure:14604: $? = 0
configure:14604: result: yes
configure:14622: checking for resolv.h
configure:14622: mips64el-linux-gnuabi64-gcc -c -g -O2 -Werror=implicit-function-declaration -ffile-prefix-map=/<<PKGBUILDDIR>>=. -fstack-protector-strong -Wformat -Werror=format-security -funsigned-char -fdiagnostics-color -Wdate-time -D_FORTIFY_SOURCE=2 conftest.c >&5
configure:14622: $? = 0
configure:14622: result: yes
configure:14645: checking for egrep
configure:14715: result: /usr/bin/grep -E
configure:14723: checking for sys/wait.h that is POSIX.1 compatible
configure:14750: mips64el-linux-gnuabi64-gcc -c -g -O2 -Werror=implicit-function-declaration -ffile-prefix-map=/<<PKGBUILDDIR>>=. -fstack-protector-strong -Wformat -Werror=format-security -funsigned-char -fdiagnostics-color -Wdate-time -D_FORTIFY_SOURCE=2 conftest.c >&5
configure:14750: $? = 0
configure:14760: result: yes
configure:14778: checking for arpa/inet.h
configure:14778: mips64el-linux-gnuabi64-gcc -c -g -O2 -Werror=implicit-function-declaration -ffile-prefix-map=/<<PKGBUILDDIR>>=. -fstack-protector-strong -Wformat -Werror=format-security -funsigned-char -fdiagnostics-color -Wdate-time -D_FORTIFY_SOURCE=2 conftest.c >&5
configure:14778: $? = 0
configure:14778: result: yes
configure:14784: checking for arpa/nameser.h
configure:14784: result: yes
configure:14790: checking for fcntl.h
configure:14790: mips64el-linux-gnuabi64-gcc -c -g -O2 -Werror=implicit-function-declaration -ffile-prefix-map=/<<PKGBUILDDIR>>=. -fstack-protector-strong -Wformat -Werror=format-security -funsigned-char -fdiagnostics-color -Wdate-time -D_FORTIFY_SOURCE=2 conftest.c >&5
configure:14790: $? = 0
configure:14790: result: yes
configure:14796: checking for netinet/in.h
configure:14796: result: yes
configure:14802: checking for signal.h
configure:14802: mips64el-linux-gnuabi64-gcc -c -g -O2 -Werror=implicit-function-declaration -ffile-prefix-map=/<<PKGBUILDDIR>>=. -fstack-protector-strong -Wformat -Werror=format-security -funsigned-char -fdiagnostics-color -Wdate-time -D_FORTIFY_SOURCE=2 conftest.c >&5
configure:14802: $? = 0
configure:14802: result: yes
configure:14808: checking for stdarg.h
configure:14808: mips64el-linux-gnuabi64-gcc -c -g -O2 -Werror=implicit-function-declaration -ffile-prefix-map=/<<PKGBUILDDIR>>=. -fstack-protector-strong -Wformat -Werror=format-security -funsigned-char -fdiagnostics-color -Wdate-time -D_FORTIFY_SOURCE=2 conftest.c >&5
configure:14808: $? = 0
configure:14808: result: yes
configure:14814: checking for stdint.h
configure:14814: result: yes
configure:14820: checking for stdlib.h
configure:14820: result: yes
configure:14826: checking for string.h
configure:14826: result: yes
configure:14832: checking for sys/filio.h
configure:14832: mips64el-linux-gnuabi64-gcc -c -g -O2 -Werror=implicit-function-declaration -ffile-prefix-map=/<<PKGBUILDDIR>>=. -fstack-protector-strong -Wformat -Werror=format-security -funsigned-char -fdiagnostics-color -Wdate-time -D_FORTIFY_SOURCE=2 conftest.c >&5
conftest.c:71:10: fatal error: sys/filio.h: No such file or directory
   71 | #include <sys/filio.h>
      |          ^~~~~~~~~~~~~
compilation terminated.
configure:14832: $? = 1
configure: failed program was:
| /* confdefs.h */
| #define PACKAGE_NAME "jabberd2"
| #define PACKAGE_TARNAME "jabberd2"
| #define PACKAGE_VERSION "2.7.0"
| #define PACKAGE_STRING "jabberd2 2.7.0"
| #define PACKAGE_BUGREPORT "jabberd2@lists.xiaoka.com"
| #define PACKAGE_URL ""
| #define PACKAGE "jabberd2"
| #define VERSION "2.7.0"
| #define HAVE_STDIO_H 1
| #define HAVE_STDLIB_H 1
| #define HAVE_STRING_H 1
| #define HAVE_INTTYPES_H 1
| #define HAVE_STDINT_H 1
| #define HAVE_STRINGS_H 1
| #define HAVE_SYS_STAT_H 1
| #define HAVE_SYS_TYPES_H 1
| #define HAVE_UNISTD_H 1
| #define HAVE_SYS_TIME_H 1
| #define HAVE_SYS_SELECT_H 1
| #define HAVE_SYS_SOCKET_H 1
| #define STDC_HEADERS 1
| #define HAVE_DLFCN_H 1
| #define LT_OBJDIR ".libs/"
| #define HAVE_DIRENT_H 1
| #define HAVE_SYS_TYPES_H 1
| #define HAVE_NETINET_IN_H 1
| #define HAVE_ARPA_NAMESER_H 1
| #define HAVE_NETDB_H 1
| #define HAVE_RESOLV_H 1
| #define HAVE_SYS_WAIT_H 1
| #define TIME_WITH_SYS_TIME 1
| #define HAVE_ARPA_INET_H 1
| #define HAVE_ARPA_NAMESER_H 1
| #define HAVE_FCNTL_H 1
| #define HAVE_NETINET_IN_H 1
| #define HAVE_SIGNAL_H 1
| #define HAVE_STDARG_H 1
| #define HAVE_STDINT_H 1
| #define HAVE_STDLIB_H 1
| #define HAVE_STRING_H 1
| /* end confdefs.h.  */
| #include <stddef.h>
| #ifdef HAVE_STDIO_H
| # include <stdio.h>
| #endif
| #ifdef HAVE_STDLIB_H
| # include <stdlib.h>
| #endif
| #ifdef HAVE_STRING_H
| # include <string.h>
| #endif
| #ifdef HAVE_INTTYPES_H
| # include <inttypes.h>
| #endif
| #ifdef HAVE_STDINT_H
| # include <stdint.h>
| #endif
| #ifdef HAVE_STRINGS_H
| # include <strings.h>
| #endif
| #ifdef HAVE_SYS_TYPES_H
| # include <sys/types.h>
| #endif
| #ifdef HAVE_SYS_STAT_H
| # include <sys/stat.h>
| #endif
| #ifdef HAVE_UNISTD_H
| # include <unistd.h>
| #endif
| #include <sys/filio.h>
configure:14832: result: no
configure:14838: checking for sys/ioctl.h
configure:14838: mips64el-linux-gnuabi64-gcc -c -g -O2 -Werror=implicit-function-declaration -ffile-prefix-map=/<<PKGBUILDDIR>>=. -fstack-protector-strong -Wformat -Werror=format-security -funsigned-char -fdiagnostics-color -Wdate-time -D_FORTIFY_SOURCE=2 conftest.c >&5
configure:14838: $? = 0
configure:14838: result: yes
configure:14844: checking for sys/socket.h
configure:14844: result: yes
configure:14850: checking for sys/time.h
configure:14850: result: yes
configure:14856: checking for sys/timeb.h
configure:14856: mips64el-linux-gnuabi64-gcc -c -g -O2 -Werror=implicit-function-declaration -ffile-prefix-map=/<<PKGBUILDDIR>>=. -fstack-protector-strong -Wformat -Werror=format-security -funsigned-char -fdiagnostics-color -Wdate-time -D_FORTIFY_SOURCE=2 conftest.c >&5
configure:14856: $? = 0
configure:14856: result: yes
configure:14862: checking for sys/types.h
configure:14862: result: yes
configure:14868: checking for sys/stat.h
configure:14868: result: yes
configure:14874: checking for sys/utsname.h
configure:14874: mips64el-linux-gnuabi64-gcc -c -g -O2 -Werror=implicit-function-declaration -ffile-prefix-map=/<<PKGBUILDDIR>>=. -fstack-protector-strong -Wformat -Werror=format-security -funsigned-char -fdiagnostics-color -Wdate-time -D_FORTIFY_SOURCE=2 conftest.c >&5
configure:14874: $? = 0
configure:14874: result: yes
configure:14880: checking for syslog.h
configure:14880: mips64el-linux-gnuabi64-gcc -c -g -O2 -Werror=implicit-function-declaration -ffile-prefix-map=/<<PKGBUILDDIR>>=. -fstack-protector-strong -Wformat -Werror=format-security -funsigned-char -fdiagnostics-color -Wdate-time -D_FORTIFY_SOURCE=2 conftest.c >&5
configure:14880: $? = 0
configure:14880: result: yes
configure:14886: checking for unistd.h
configure:14886: result: yes
configure:14892: checking for windows.h
configure:14892: mips64el-linux-gnuabi64-gcc -c -g -O2 -Werror=implicit-function-declaration -ffile-prefix-map=/<<PKGBUILDDIR>>=. -fstack-protector-strong -Wformat -Werror=format-security -funsigned-char -fdiagnostics-color -Wdate-time -D_FORTIFY_SOURCE=2 conftest.c >&5
conftest.c:80:10: fatal error: windows.h: No such file or directory
   80 | #include <windows.h>
      |          ^~~~~~~~~~~
compilation terminated.
configure:14892: $? = 1
configure: failed program was:
| /* confdefs.h */
| #define PACKAGE_NAME "jabberd2"
| #define PACKAGE_TARNAME "jabberd2"
| #define PACKAGE_VERSION "2.7.0"
| #define PACKAGE_STRING "jabberd2 2.7.0"
| #define PACKAGE_BUGREPORT "jabberd2@lists.xiaoka.com"
| #define PACKAGE_URL ""
| #define PACKAGE "jabberd2"
| #define VERSION "2.7.0"
| #define HAVE_STDIO_H 1
| #define HAVE_STDLIB_H 1
| #define HAVE_STRING_H 1
| #define HAVE_INTTYPES_H 1
| #define HAVE_STDINT_H 1
| #define HAVE_STRINGS_H 1
| #define HAVE_SYS_STAT_H 1
| #define HAVE_SYS_TYPES_H 1
| #define HAVE_UNISTD_H 1
| #define HAVE_SYS_TIME_H 1
| #define HAVE_SYS_SELECT_H 1
| #define HAVE_SYS_SOCKET_H 1
| #define STDC_HEADERS 1
| #define HAVE_DLFCN_H 1
| #define LT_OBJDIR ".libs/"
| #define HAVE_DIRENT_H 1
| #define HAVE_SYS_TYPES_H 1
| #define HAVE_NETINET_IN_H 1
| #define HAVE_ARPA_NAMESER_H 1
| #define HAVE_NETDB_H 1
| #define HAVE_RESOLV_H 1
| #define HAVE_SYS_WAIT_H 1
| #define TIME_WITH_SYS_TIME 1
| #define HAVE_ARPA_INET_H 1
| #define HAVE_ARPA_NAMESER_H 1
| #define HAVE_FCNTL_H 1
| #define HAVE_NETINET_IN_H 1
| #define HAVE_SIGNAL_H 1
| #define HAVE_STDARG_H 1
| #define HAVE_STDINT_H 1
| #define HAVE_STDLIB_H 1
| #define HAVE_STRING_H 1
| #define HAVE_SYS_IOCTL_H 1
| #define HAVE_SYS_SOCKET_H 1
| #define HAVE_SYS_TIME_H 1
| #define HAVE_SYS_TIMEB_H 1
| #define HAVE_SYS_TYPES_H 1
| #define HAVE_SYS_STAT_H 1
| #define HAVE_SYS_UTSNAME_H 1
| #define HAVE_SYSLOG_H 1
| #define HAVE_UNISTD_H 1
| /* end confdefs.h.  */
| #include <stddef.h>
| #ifdef HAVE_STDIO_H
| # include <stdio.h>
| #endif
| #ifdef HAVE_STDLIB_H
| # include <stdlib.h>
| #endif
| #ifdef HAVE_STRING_H
| # include <string.h>
| #endif
| #ifdef HAVE_INTTYPES_H
| # include <inttypes.h>
| #endif
| #ifdef HAVE_STDINT_H
| # include <stdint.h>
| #endif
| #ifdef HAVE_STRINGS_H
| # include <strings.h>
| #endif
| #ifdef HAVE_SYS_TYPES_H
| # include <sys/types.h>
| #endif
| #ifdef HAVE_SYS_STAT_H
| # include <sys/stat.h>
| #endif
| #ifdef HAVE_UNISTD_H
| # include <unistd.h>
| #endif
| #include <windows.h>
configure:14892: result: no
configure:14898: checking for winsock2.h
configure:14898: mips64el-linux-gnuabi64-gcc -c -g -O2 -Werror=implicit-function-declaration -ffile-prefix-map=/<<PKGBUILDDIR>>=. -fstack-protector-strong -Wformat -Werror=format-security -funsigned-char -fdiagnostics-color -Wdate-time -D_FORTIFY_SOURCE=2 conftest.c >&5
conftest.c:80:10: fatal error: winsock2.h: No such file or directory
   80 | #include <winsock2.h>
      |          ^~~~~~~~~~~~
compilation terminated.
configure:14898: $? = 1
configure: failed program was:
| /* confdefs.h */
| #define PACKAGE_NAME "jabberd2"
| #define PACKAGE_TARNAME "jabberd2"
| #define PACKAGE_VERSION "2.7.0"
| #define PACKAGE_STRING "jabberd2 2.7.0"
| #define PACKAGE_BUGREPORT "jabberd2@lists.xiaoka.com"
| #define PACKAGE_URL ""
| #define PACKAGE "jabberd2"
| #define VERSION "2.7.0"
| #define HAVE_STDIO_H 1
| #define HAVE_STDLIB_H 1
| #define HAVE_STRING_H 1
| #define HAVE_INTTYPES_H 1
| #define HAVE_STDINT_H 1
| #define HAVE_STRINGS_H 1
| #define HAVE_SYS_STAT_H 1
| #define HAVE_SYS_TYPES_H 1
| #define HAVE_UNISTD_H 1
| #define HAVE_SYS_TIME_H 1
| #define HAVE_SYS_SELECT_H 1
| #define HAVE_SYS_SOCKET_H 1
| #define STDC_HEADERS 1
| #define HAVE_DLFCN_H 1
| #define LT_OBJDIR ".libs/"
| #define HAVE_DIRENT_H 1
| #define HAVE_SYS_TYPES_H 1
| #define HAVE_NETINET_IN_H 1
| #define HAVE_ARPA_NAMESER_H 1
| #define HAVE_NETDB_H 1
| #define HAVE_RESOLV_H 1
| #define HAVE_SYS_WAIT_H 1
| #define TIME_WITH_SYS_TIME 1
| #define HAVE_ARPA_INET_H 1
| #define HAVE_ARPA_NAMESER_H 1
| #define HAVE_FCNTL_H 1
| #define HAVE_NETINET_IN_H 1
| #define HAVE_SIGNAL_H 1
| #define HAVE_STDARG_H 1
| #define HAVE_STDINT_H 1
| #define HAVE_STDLIB_H 1
| #define HAVE_STRING_H 1
| #define HAVE_SYS_IOCTL_H 1
| #define HAVE_SYS_SOCKET_H 1
| #define HAVE_SYS_TIME_H 1
| #define HAVE_SYS_TIMEB_H 1
| #define HAVE_SYS_TYPES_H 1
| #define HAVE_SYS_STAT_H 1
| #define HAVE_SYS_UTSNAME_H 1
| #define HAVE_SYSLOG_H 1
| #define HAVE_UNISTD_H 1
| /* end confdefs.h.  */
| #include <stddef.h>
| #ifdef HAVE_STDIO_H
| # include <stdio.h>
| #endif
| #ifdef HAVE_STDLIB_H
| # include <stdlib.h>
| #endif
| #ifdef HAVE_STRING_H
| # include <string.h>
| #endif
| #ifdef HAVE_INTTYPES_H
| # include <inttypes.h>
| #endif
| #ifdef HAVE_STDINT_H
| # include <stdint.h>
| #endif
| #ifdef HAVE_STRINGS_H
| # include <strings.h>
| #endif
| #ifdef HAVE_SYS_TYPES_H
| # include <sys/types.h>
| #endif
| #ifdef HAVE_SYS_STAT_H
| # include <sys/stat.h>
| #endif
| #ifdef HAVE_UNISTD_H
| # include <unistd.h>
| #endif
| #include <winsock2.h>
configure:14898: result: no
configure:14908: checking for resolv.h
configure:14908: result: yes
configure:14923: checking for windns.h
configure:14923: mips64el-linux-gnuabi64-gcc -c -g -O2 -Werror=implicit-function-declaration -ffile-prefix-map=/<<PKGBUILDDIR>>=. -fstack-protector-strong -Wformat -Werror=format-security -funsigned-char -fdiagnostics-color -Wdate-time -D_FORTIFY_SOURCE=2 conftest.c >&5
conftest.c:63:10: fatal error: windns.h: No such file or directory
   63 | #include <windns.h>
      |          ^~~~~~~~~~
compilation terminated.
configure:14923: $? = 1
configure: failed program was:
| /* confdefs.h */
| #define PACKAGE_NAME "jabberd2"
| #define PACKAGE_TARNAME "jabberd2"
| #define PACKAGE_VERSION "2.7.0"
| #define PACKAGE_STRING "jabberd2 2.7.0"
| #define PACKAGE_BUGREPORT "jabberd2@lists.xiaoka.com"
| #define PACKAGE_URL ""
| #define PACKAGE "jabberd2"
| #define VERSION "2.7.0"
| #define HAVE_STDIO_H 1
| #define HAVE_STDLIB_H 1
| #define HAVE_STRING_H 1
| #define HAVE_INTTYPES_H 1
| #define HAVE_STDINT_H 1
| #define HAVE_STRINGS_H 1
| #define HAVE_SYS_STAT_H 1
| #define HAVE_SYS_TYPES_H 1
| #define HAVE_UNISTD_H 1
| #define HAVE_SYS_TIME_H 1
| #define HAVE_SYS_SELECT_H 1
| #define HAVE_SYS_SOCKET_H 1
| #define STDC_HEADERS 1
| #define HAVE_DLFCN_H 1
| #define LT_OBJDIR ".libs/"
| #define HAVE_DIRENT_H 1
| #define HAVE_SYS_TYPES_H 1
| #define HAVE_NETINET_IN_H 1
| #define HAVE_ARPA_NAMESER_H 1
| #define HAVE_NETDB_H 1
| #define HAVE_RESOLV_H 1
| #define HAVE_SYS_WAIT_H 1
| #define TIME_WITH_SYS_TIME 1
| #define HAVE_ARPA_INET_H 1
| #define HAVE_ARPA_NAMESER_H 1
| #define HAVE_FCNTL_H 1
| #define HAVE_NETINET_IN_H 1
| #define HAVE_SIGNAL_H 1
| #define HAVE_STDARG_H 1
| #define HAVE_STDINT_H 1
| #define HAVE_STDLIB_H 1
| #define HAVE_STRING_H 1
| #define HAVE_SYS_IOCTL_H 1
| #define HAVE_SYS_SOCKET_H 1
| #define HAVE_SYS_TIME_H 1
| #define HAVE_SYS_TIMEB_H 1
| #define HAVE_SYS_TYPES_H 1
| #define HAVE_SYS_STAT_H 1
| #define HAVE_SYS_UTSNAME_H 1
| #define HAVE_SYSLOG_H 1
| #define HAVE_UNISTD_H 1
| #define HAVE_RESOLV_H 1
| /* end confdefs.h.  */
| #ifdef HAVE_SYS_TYPES_H
| # include <sys/types.h>
| #endif
| #ifdef HAVE_WINSOCK2_H
| # include <winsock2.h>
| #endif
| #ifdef HAVE_NETINET_IN_H
| # include <netinet/in.h>
| #endif
| 
| #include <windns.h>
configure:14923: result: no
configure:14941: checking for an ANSI C-conforming const
configure:15008: mips64el-linux-gnuabi64-gcc -c -g -O2 -Werror=implicit-function-declaration -ffile-prefix-map=/<<PKGBUILDDIR>>=. -fstack-protector-strong -Wformat -Werror=format-security -funsigned-char -fdiagnostics-color -Wdate-time -D_FORTIFY_SOURCE=2 conftest.c >&5
configure:15008: $? = 0
configure:15018: result: yes
configure:15026: checking for mode_t
configure:15026: mips64el-linux-gnuabi64-gcc -c -g -O2 -Werror=implicit-function-declaration -ffile-prefix-map=/<<PKGBUILDDIR>>=. -fstack-protector-strong -Wformat -Werror=format-security -funsigned-char -fdiagnostics-color -Wdate-time -D_FORTIFY_SOURCE=2 conftest.c >&5
configure:15026: $? = 0
configure:15026: mips64el-linux-gnuabi64-gcc -c -g -O2 -Werror=implicit-function-declaration -ffile-prefix-map=/<<PKGBUILDDIR>>=. -fstack-protector-strong -Wformat -Werror=format-security -funsigned-char -fdiagnostics-color -Wdate-time -D_FORTIFY_SOURCE=2 conftest.c >&5
conftest.c: In function 'main':
conftest.c:84:21: error: expected expression before ')' token
   84 | if (sizeof ((mode_t)))
      |                     ^
configure:15026: $? = 1
configure: failed program was:
| /* confdefs.h */
| #define PACKAGE_NAME "jabberd2"
| #define PACKAGE_TARNAME "jabberd2"
| #define PACKAGE_VERSION "2.7.0"
| #define PACKAGE_STRING "jabberd2 2.7.0"
| #define PACKAGE_BUGREPORT "jabberd2@lists.xiaoka.com"
| #define PACKAGE_URL ""
| #define PACKAGE "jabberd2"
| #define VERSION "2.7.0"
| #define HAVE_STDIO_H 1
| #define HAVE_STDLIB_H 1
| #define HAVE_STRING_H 1
| #define HAVE_INTTYPES_H 1
| #define HAVE_STDINT_H 1
| #define HAVE_STRINGS_H 1
| #define HAVE_SYS_STAT_H 1
| #define HAVE_SYS_TYPES_H 1
| #define HAVE_UNISTD_H 1
| #define HAVE_SYS_TIME_H 1
| #define HAVE_SYS_SELECT_H 1
| #define HAVE_SYS_SOCKET_H 1
| #define STDC_HEADERS 1
| #define HAVE_DLFCN_H 1
| #define LT_OBJDIR ".libs/"
| #define HAVE_DIRENT_H 1
| #define HAVE_SYS_TYPES_H 1
| #define HAVE_NETINET_IN_H 1
| #define HAVE_ARPA_NAMESER_H 1
| #define HAVE_NETDB_H 1
| #define HAVE_RESOLV_H 1
| #define HAVE_SYS_WAIT_H 1
| #define TIME_WITH_SYS_TIME 1
| #define HAVE_ARPA_INET_H 1
| #define HAVE_ARPA_NAMESER_H 1
| #define HAVE_FCNTL_H 1
| #define HAVE_NETINET_IN_H 1
| #define HAVE_SIGNAL_H 1
| #define HAVE_STDARG_H 1
| #define HAVE_STDINT_H 1
| #define HAVE_STDLIB_H 1
| #define HAVE_STRING_H 1
| #define HAVE_SYS_IOCTL_H 1
| #define HAVE_SYS_SOCKET_H 1
| #define HAVE_SYS_TIME_H 1
| #define HAVE_SYS_TIMEB_H 1
| #define HAVE_SYS_TYPES_H 1
| #define HAVE_SYS_STAT_H 1
| #define HAVE_SYS_UTSNAME_H 1
| #define HAVE_SYSLOG_H 1
| #define HAVE_UNISTD_H 1
| #define HAVE_RESOLV_H 1
| /* end confdefs.h.  */
| #include <stddef.h>
| #ifdef HAVE_STDIO_H
| # include <stdio.h>
| #endif
| #ifdef HAVE_STDLIB_H
| # include <stdlib.h>
| #endif
| #ifdef HAVE_STRING_H
| # include <string.h>
| #endif
| #ifdef HAVE_INTTYPES_H
| # include <inttypes.h>
| #endif
| #ifdef HAVE_STDINT_H
| # include <stdint.h>
| #endif
| #ifdef HAVE_STRINGS_H
| # include <strings.h>
| #endif
| #ifdef HAVE_SYS_TYPES_H
| # include <sys/types.h>
| #endif
| #ifdef HAVE_SYS_STAT_H
| # include <sys/stat.h>
| #endif
| #ifdef HAVE_UNISTD_H
| # include <unistd.h>
| #endif
| int
| main (void)
| {
| if (sizeof ((mode_t)))
| 	    return 0;
|   ;
|   return 0;
| }
configure:15026: result: yes
configure:15037: checking for off_t
configure:15037: mips64el-linux-gnuabi64-gcc -c -g -O2 -Werror=implicit-function-declaration -ffile-prefix-map=/<<PKGBUILDDIR>>=. -fstack-protector-strong -Wformat -Werror=format-security -funsigned-char -fdiagnostics-color -Wdate-time -D_FORTIFY_SOURCE=2 conftest.c >&5
configure:15037: $? = 0
configure:15037: mips64el-linux-gnuabi64-gcc -c -g -O2 -Werror=implicit-function-declaration -ffile-prefix-map=/<<PKGBUILDDIR>>=. -fstack-protector-strong -Wformat -Werror=format-security -funsigned-char -fdiagnostics-color -Wdate-time -D_FORTIFY_SOURCE=2 conftest.c >&5
conftest.c: In function 'main':
conftest.c:84:20: error: expected expression before ')' token
   84 | if (sizeof ((off_t)))
      |                    ^
configure:15037: $? = 1
configure: failed program was:
| /* confdefs.h */
| #define PACKAGE_NAME "jabberd2"
| #define PACKAGE_TARNAME "jabberd2"
| #define PACKAGE_VERSION "2.7.0"
| #define PACKAGE_STRING "jabberd2 2.7.0"
| #define PACKAGE_BUGREPORT "jabberd2@lists.xiaoka.com"
| #define PACKAGE_URL ""
| #define PACKAGE "jabberd2"
| #define VERSION "2.7.0"
| #define HAVE_STDIO_H 1
| #define HAVE_STDLIB_H 1
| #define HAVE_STRING_H 1
| #define HAVE_INTTYPES_H 1
| #define HAVE_STDINT_H 1
| #define HAVE_STRINGS_H 1
| #define HAVE_SYS_STAT_H 1
| #define HAVE_SYS_TYPES_H 1
| #define HAVE_UNISTD_H 1
| #define HAVE_SYS_TIME_H 1
| #define HAVE_SYS_SELECT_H 1
| #define HAVE_SYS_SOCKET_H 1
| #define STDC_HEADERS 1
| #define HAVE_DLFCN_H 1
| #define LT_OBJDIR ".libs/"
| #define HAVE_DIRENT_H 1
| #define HAVE_SYS_TYPES_H 1
| #define HAVE_NETINET_IN_H 1
| #define HAVE_ARPA_NAMESER_H 1
| #define HAVE_NETDB_H 1
| #define HAVE_RESOLV_H 1
| #define HAVE_SYS_WAIT_H 1
| #define TIME_WITH_SYS_TIME 1
| #define HAVE_ARPA_INET_H 1
| #define HAVE_ARPA_NAMESER_H 1
| #define HAVE_FCNTL_H 1
| #define HAVE_NETINET_IN_H 1
| #define HAVE_SIGNAL_H 1
| #define HAVE_STDARG_H 1
| #define HAVE_STDINT_H 1
| #define HAVE_STDLIB_H 1
| #define HAVE_STRING_H 1
| #define HAVE_SYS_IOCTL_H 1
| #define HAVE_SYS_SOCKET_H 1
| #define HAVE_SYS_TIME_H 1
| #define HAVE_SYS_TIMEB_H 1
| #define HAVE_SYS_TYPES_H 1
| #define HAVE_SYS_STAT_H 1
| #define HAVE_SYS_UTSNAME_H 1
| #define HAVE_SYSLOG_H 1
| #define HAVE_UNISTD_H 1
| #define HAVE_RESOLV_H 1
| /* end confdefs.h.  */
| #include <stddef.h>
| #ifdef HAVE_STDIO_H
| # include <stdio.h>
| #endif
| #ifdef HAVE_STDLIB_H
| # include <stdlib.h>
| #endif
| #ifdef HAVE_STRING_H
| # include <string.h>
| #endif
| #ifdef HAVE_INTTYPES_H
| # include <inttypes.h>
| #endif
| #ifdef HAVE_STDINT_H
| # include <stdint.h>
| #endif
| #ifdef HAVE_STRINGS_H
| # include <strings.h>
| #endif
| #ifdef HAVE_SYS_TYPES_H
| # include <sys/types.h>
| #endif
| #ifdef HAVE_SYS_STAT_H
| # include <sys/stat.h>
| #endif
| #ifdef HAVE_UNISTD_H
| # include <unistd.h>
| #endif
| int
| main (void)
| {
| if (sizeof ((off_t)))
| 	    return 0;
|   ;
|   return 0;
| }
configure:15037: result: yes
configure:15049: checking for pid_t
configure:15049: mips64el-linux-gnuabi64-gcc -c -g -O2 -Werror=implicit-function-declaration -ffile-prefix-map=/<<PKGBUILDDIR>>=. -fstack-protector-strong -Wformat -Werror=format-security -funsigned-char -fdiagnostics-color -Wdate-time -D_FORTIFY_SOURCE=2 conftest.c >&5
configure:15049: $? = 0
configure:15049: mips64el-linux-gnuabi64-gcc -c -g -O2 -Werror=implicit-function-declaration -ffile-prefix-map=/<<PKGBUILDDIR>>=. -fstack-protector-strong -Wformat -Werror=format-security -funsigned-char -fdiagnostics-color -Wdate-time -D_FORTIFY_SOURCE=2 conftest.c >&5
conftest.c: In function 'main':
conftest.c:85:20: error: expected expression before ')' token
   85 | if (sizeof ((pid_t)))
      |                    ^
configure:15049: $? = 1
configure: failed program was:
| /* confdefs.h */
| #define PACKAGE_NAME "jabberd2"
| #define PACKAGE_TARNAME "jabberd2"
| #define PACKAGE_VERSION "2.7.0"
| #define PACKAGE_STRING "jabberd2 2.7.0"
| #define PACKAGE_BUGREPORT "jabberd2@lists.xiaoka.com"
| #define PACKAGE_URL ""
| #define PACKAGE "jabberd2"
| #define VERSION "2.7.0"
| #define HAVE_STDIO_H 1
| #define HAVE_STDLIB_H 1
| #define HAVE_STRING_H 1
| #define HAVE_INTTYPES_H 1
| #define HAVE_STDINT_H 1
| #define HAVE_STRINGS_H 1
| #define HAVE_SYS_STAT_H 1
| #define HAVE_SYS_TYPES_H 1
| #define HAVE_UNISTD_H 1
| #define HAVE_SYS_TIME_H 1
| #define HAVE_SYS_SELECT_H 1
| #define HAVE_SYS_SOCKET_H 1
| #define STDC_HEADERS 1
| #define HAVE_DLFCN_H 1
| #define LT_OBJDIR ".libs/"
| #define HAVE_DIRENT_H 1
| #define HAVE_SYS_TYPES_H 1
| #define HAVE_NETINET_IN_H 1
| #define HAVE_ARPA_NAMESER_H 1
| #define HAVE_NETDB_H 1
| #define HAVE_RESOLV_H 1
| #define HAVE_SYS_WAIT_H 1
| #define TIME_WITH_SYS_TIME 1
| #define HAVE_ARPA_INET_H 1
| #define HAVE_ARPA_NAMESER_H 1
| #define HAVE_FCNTL_H 1
| #define HAVE_NETINET_IN_H 1
| #define HAVE_SIGNAL_H 1
| #define HAVE_STDARG_H 1
| #define HAVE_STDINT_H 1
| #define HAVE_STDLIB_H 1
| #define HAVE_STRING_H 1
| #define HAVE_SYS_IOCTL_H 1
| #define HAVE_SYS_SOCKET_H 1
| #define HAVE_SYS_TIME_H 1
| #define HAVE_SYS_TIMEB_H 1
| #define HAVE_SYS_TYPES_H 1
| #define HAVE_SYS_STAT_H 1
| #define HAVE_SYS_UTSNAME_H 1
| #define HAVE_SYSLOG_H 1
| #define HAVE_UNISTD_H 1
| #define HAVE_RESOLV_H 1
| /* end confdefs.h.  */
| #include <stddef.h>
| #ifdef HAVE_STDIO_H
| # include <stdio.h>
| #endif
| #ifdef HAVE_STDLIB_H
| # include <stdlib.h>
| #endif
| #ifdef HAVE_STRING_H
| # include <string.h>
| #endif
| #ifdef HAVE_INTTYPES_H
| # include <inttypes.h>
| #endif
| #ifdef HAVE_STDINT_H
| # include <stdint.h>
| #endif
| #ifdef HAVE_STRINGS_H
| # include <strings.h>
| #endif
| #ifdef HAVE_SYS_TYPES_H
| # include <sys/types.h>
| #endif
| #ifdef HAVE_SYS_STAT_H
| # include <sys/stat.h>
| #endif
| #ifdef HAVE_UNISTD_H
| # include <unistd.h>
| #endif
| 
| int
| main (void)
| {
| if (sizeof ((pid_t)))
| 	    return 0;
|   ;
|   return 0;
| }
configure:15049: result: yes
configure:15087: checking for size_t
configure:15087: mips64el-linux-gnuabi64-gcc -c -g -O2 -Werror=implicit-function-declaration -ffile-prefix-map=/<<PKGBUILDDIR>>=. -fstack-protector-strong -Wformat -Werror=format-security -funsigned-char -fdiagnostics-color -Wdate-time -D_FORTIFY_SOURCE=2 conftest.c >&5
configure:15087: $? = 0
configure:15087: mips64el-linux-gnuabi64-gcc -c -g -O2 -Werror=implicit-function-declaration -ffile-prefix-map=/<<PKGBUILDDIR>>=. -fstack-protector-strong -Wformat -Werror=format-security -funsigned-char -fdiagnostics-color -Wdate-time -D_FORTIFY_SOURCE=2 conftest.c >&5
conftest.c: In function 'main':
conftest.c:84:21: error: expected expression before ')' token
   84 | if (sizeof ((size_t)))
      |                     ^
configure:15087: $? = 1
configure: failed program was:
| /* confdefs.h */
| #define PACKAGE_NAME "jabberd2"
| #define PACKAGE_TARNAME "jabberd2"
| #define PACKAGE_VERSION "2.7.0"
| #define PACKAGE_STRING "jabberd2 2.7.0"
| #define PACKAGE_BUGREPORT "jabberd2@lists.xiaoka.com"
| #define PACKAGE_URL ""
| #define PACKAGE "jabberd2"
| #define VERSION "2.7.0"
| #define HAVE_STDIO_H 1
| #define HAVE_STDLIB_H 1
| #define HAVE_STRING_H 1
| #define HAVE_INTTYPES_H 1
| #define HAVE_STDINT_H 1
| #define HAVE_STRINGS_H 1
| #define HAVE_SYS_STAT_H 1
| #define HAVE_SYS_TYPES_H 1
| #define HAVE_UNISTD_H 1
| #define HAVE_SYS_TIME_H 1
| #define HAVE_SYS_SELECT_H 1
| #define HAVE_SYS_SOCKET_H 1
| #define STDC_HEADERS 1
| #define HAVE_DLFCN_H 1
| #define LT_OBJDIR ".libs/"
| #define HAVE_DIRENT_H 1
| #define HAVE_SYS_TYPES_H 1
| #define HAVE_NETINET_IN_H 1
| #define HAVE_ARPA_NAMESER_H 1
| #define HAVE_NETDB_H 1
| #define HAVE_RESOLV_H 1
| #define HAVE_SYS_WAIT_H 1
| #define TIME_WITH_SYS_TIME 1
| #define HAVE_ARPA_INET_H 1
| #define HAVE_ARPA_NAMESER_H 1
| #define HAVE_FCNTL_H 1
| #define HAVE_NETINET_IN_H 1
| #define HAVE_SIGNAL_H 1
| #define HAVE_STDARG_H 1
| #define HAVE_STDINT_H 1
| #define HAVE_STDLIB_H 1
| #define HAVE_STRING_H 1
| #define HAVE_SYS_IOCTL_H 1
| #define HAVE_SYS_SOCKET_H 1
| #define HAVE_SYS_TIME_H 1
| #define HAVE_SYS_TIMEB_H 1
| #define HAVE_SYS_TYPES_H 1
| #define HAVE_SYS_STAT_H 1
| #define HAVE_SYS_UTSNAME_H 1
| #define HAVE_SYSLOG_H 1
| #define HAVE_UNISTD_H 1
| #define HAVE_RESOLV_H 1
| /* end confdefs.h.  */
| #include <stddef.h>
| #ifdef HAVE_STDIO_H
| # include <stdio.h>
| #endif
| #ifdef HAVE_STDLIB_H
| # include <stdlib.h>
| #endif
| #ifdef HAVE_STRING_H
| # include <string.h>
| #endif
| #ifdef HAVE_INTTYPES_H
| # include <inttypes.h>
| #endif
| #ifdef HAVE_STDINT_H
| # include <stdint.h>
| #endif
| #ifdef HAVE_STRINGS_H
| # include <strings.h>
| #endif
| #ifdef HAVE_SYS_TYPES_H
| # include <sys/types.h>
| #endif
| #ifdef HAVE_SYS_STAT_H
| # include <sys/stat.h>
| #endif
| #ifdef HAVE_UNISTD_H
| # include <unistd.h>
| #endif
| int
| main (void)
| {
| if (sizeof ((size_t)))
| 	    return 0;
|   ;
|   return 0;
| }
configure:15087: result: yes
configure:15107: checking whether struct tm is in sys/time.h or time.h
configure:15128: mips64el-linux-gnuabi64-gcc -c -g -O2 -Werror=implicit-function-declaration -ffile-prefix-map=/<<PKGBUILDDIR>>=. -fstack-protector-strong -Wformat -Werror=format-security -funsigned-char -fdiagnostics-color -Wdate-time -D_FORTIFY_SOURCE=2 conftest.c >&5
configure:15128: $? = 0
configure:15138: result: time.h
configure:15146: checking for mips64el-linux-gnuabi64-gcc options needed to detect all undeclared functions
configure:15168: mips64el-linux-gnuabi64-gcc -c -g -O2 -Werror=implicit-function-declaration -ffile-prefix-map=/<<PKGBUILDDIR>>=. -fstack-protector-strong -Wformat -Werror=format-security -funsigned-char -fdiagnostics-color  -Wdate-time -D_FORTIFY_SOURCE=2 conftest.c >&5
conftest.c: In function 'main':
conftest.c:58:8: error: 'strchr' undeclared (first use in this function)
   58 | (void) strchr;
      |        ^~~~~~
conftest.c:1:1: note: 'strchr' is defined in header '<string.h>'; this is probably fixable by adding '#include <string.h>'
    1 | /* confdefs.h */
conftest.c:58:8: note: each undeclared identifier is reported only once for each function it appears in
   58 | (void) strchr;
      |        ^~~~~~
configure:15168: $? = 1
configure: failed program was:
| /* confdefs.h */
| #define PACKAGE_NAME "jabberd2"
| #define PACKAGE_TARNAME "jabberd2"
| #define PACKAGE_VERSION "2.7.0"
| #define PACKAGE_STRING "jabberd2 2.7.0"
| #define PACKAGE_BUGREPORT "jabberd2@lists.xiaoka.com"
| #define PACKAGE_URL ""
| #define PACKAGE "jabberd2"
| #define VERSION "2.7.0"
| #define HAVE_STDIO_H 1
| #define HAVE_STDLIB_H 1
| #define HAVE_STRING_H 1
| #define HAVE_INTTYPES_H 1
| #define HAVE_STDINT_H 1
| #define HAVE_STRINGS_H 1
| #define HAVE_SYS_STAT_H 1
| #define HAVE_SYS_TYPES_H 1
| #define HAVE_UNISTD_H 1
| #define HAVE_SYS_TIME_H 1
| #define HAVE_SYS_SELECT_H 1
| #define HAVE_SYS_SOCKET_H 1
| #define STDC_HEADERS 1
| #define HAVE_DLFCN_H 1
| #define LT_OBJDIR ".libs/"
| #define HAVE_DIRENT_H 1
| #define HAVE_SYS_TYPES_H 1
| #define HAVE_NETINET_IN_H 1
| #define HAVE_ARPA_NAMESER_H 1
| #define HAVE_NETDB_H 1
| #define HAVE_RESOLV_H 1
| #define HAVE_SYS_WAIT_H 1
| #define TIME_WITH_SYS_TIME 1
| #define HAVE_ARPA_INET_H 1
| #define HAVE_ARPA_NAMESER_H 1
| #define HAVE_FCNTL_H 1
| #define HAVE_NETINET_IN_H 1
| #define HAVE_SIGNAL_H 1
| #define HAVE_STDARG_H 1
| #define HAVE_STDINT_H 1
| #define HAVE_STDLIB_H 1
| #define HAVE_STRING_H 1
| #define HAVE_SYS_IOCTL_H 1
| #define HAVE_SYS_SOCKET_H 1
| #define HAVE_SYS_TIME_H 1
| #define HAVE_SYS_TIMEB_H 1
| #define HAVE_SYS_TYPES_H 1
| #define HAVE_SYS_STAT_H 1
| #define HAVE_SYS_UTSNAME_H 1
| #define HAVE_SYSLOG_H 1
| #define HAVE_UNISTD_H 1
| #define HAVE_RESOLV_H 1
| #define TIME_WITH_SYS_TIME 1
| /* end confdefs.h.  */
| 
| int
| main (void)
| {
| (void) strchr;
|   ;
|   return 0;
| }
configure:15195: mips64el-linux-gnuabi64-gcc -c -g -O2 -Werror=implicit-function-declaration -ffile-prefix-map=/<<PKGBUILDDIR>>=. -fstack-protector-strong -Wformat -Werror=format-security -funsigned-char -fdiagnostics-color  -Wdate-time -D_FORTIFY_SOURCE=2 conftest.c >&5
configure:15195: $? = 0
configure:15215: result: none needed
configure:15229: checking for struct tm.tm_zone
configure:15229: mips64el-linux-gnuabi64-gcc -c -g -O2 -Werror=implicit-function-declaration -ffile-prefix-map=/<<PKGBUILDDIR>>=. -fstack-protector-strong -Wformat -Werror=format-security -funsigned-char -fdiagnostics-color -Wdate-time -D_FORTIFY_SOURCE=2 conftest.c >&5
configure:15229: $? = 0
configure:15229: result: yes
configure:15298: checking for uint16_t
configure:15298: mips64el-linux-gnuabi64-gcc -c -g -O2 -Werror=implicit-function-declaration -ffile-prefix-map=/<<PKGBUILDDIR>>=. -fstack-protector-strong -Wformat -Werror=format-security -funsigned-char -fdiagnostics-color -Wdate-time -D_FORTIFY_SOURCE=2 conftest.c >&5
configure:15298: $? = 0
configure:15298: result: yes
configure:15308: checking for uint32_t
configure:15308: mips64el-linux-gnuabi64-gcc -c -g -O2 -Werror=implicit-function-declaration -ffile-prefix-map=/<<PKGBUILDDIR>>=. -fstack-protector-strong -Wformat -Werror=format-security -funsigned-char -fdiagnostics-color -Wdate-time -D_FORTIFY_SOURCE=2 conftest.c >&5
configure:15308: $? = 0
configure:15308: result: yes
configure:15320: checking for uint8_t
configure:15320: mips64el-linux-gnuabi64-gcc -c -g -O2 -Werror=implicit-function-declaration -ffile-prefix-map=/<<PKGBUILDDIR>>=. -fstack-protector-strong -Wformat -Werror=format-security -funsigned-char -fdiagnostics-color -Wdate-time -D_FORTIFY_SOURCE=2 conftest.c >&5
configure:15320: $? = 0
configure:15320: result: yes
configure:15335: checking for stdint-types....
configure:15345: result: "(putting them into ac-stdint.h)"
configure:15358: checking for uintptr_t
configure:15358: mips64el-linux-gnuabi64-gcc -c -g -O2 -Werror=implicit-function-declaration -ffile-prefix-map=/<<PKGBUILDDIR>>=. -fstack-protector-strong -Wformat -Werror=format-security -funsigned-char -fdiagnostics-color -Wdate-time -D_FORTIFY_SOURCE=2 conftest.c >&5
configure:15358: $? = 0
configure:15358: mips64el-linux-gnuabi64-gcc -c -g -O2 -Werror=implicit-function-declaration -ffile-prefix-map=/<<PKGBUILDDIR>>=. -fstack-protector-strong -Wformat -Werror=format-security -funsigned-char -fdiagnostics-color -Wdate-time -D_FORTIFY_SOURCE=2 conftest.c >&5
conftest.c: In function 'main':
conftest.c:61:24: error: expected expression before ')' token
   61 | if (sizeof ((uintptr_t)))
      |                        ^
configure:15358: $? = 1
configure: failed program was:
| /* confdefs.h */
| #define PACKAGE_NAME "jabberd2"
| #define PACKAGE_TARNAME "jabberd2"
| #define PACKAGE_VERSION "2.7.0"
| #define PACKAGE_STRING "jabberd2 2.7.0"
| #define PACKAGE_BUGREPORT "jabberd2@lists.xiaoka.com"
| #define PACKAGE_URL ""
| #define PACKAGE "jabberd2"
| #define VERSION "2.7.0"
| #define HAVE_STDIO_H 1
| #define HAVE_STDLIB_H 1
| #define HAVE_STRING_H 1
| #define HAVE_INTTYPES_H 1
| #define HAVE_STDINT_H 1
| #define HAVE_STRINGS_H 1
| #define HAVE_SYS_STAT_H 1
| #define HAVE_SYS_TYPES_H 1
| #define HAVE_UNISTD_H 1
| #define HAVE_SYS_TIME_H 1
| #define HAVE_SYS_SELECT_H 1
| #define HAVE_SYS_SOCKET_H 1
| #define STDC_HEADERS 1
| #define HAVE_DLFCN_H 1
| #define LT_OBJDIR ".libs/"
| #define HAVE_DIRENT_H 1
| #define HAVE_SYS_TYPES_H 1
| #define HAVE_NETINET_IN_H 1
| #define HAVE_ARPA_NAMESER_H 1
| #define HAVE_NETDB_H 1
| #define HAVE_RESOLV_H 1
| #define HAVE_SYS_WAIT_H 1
| #define TIME_WITH_SYS_TIME 1
| #define HAVE_ARPA_INET_H 1
| #define HAVE_ARPA_NAMESER_H 1
| #define HAVE_FCNTL_H 1
| #define HAVE_NETINET_IN_H 1
| #define HAVE_SIGNAL_H 1
| #define HAVE_STDARG_H 1
| #define HAVE_STDINT_H 1
| #define HAVE_STDLIB_H 1
| #define HAVE_STRING_H 1
| #define HAVE_SYS_IOCTL_H 1
| #define HAVE_SYS_SOCKET_H 1
| #define HAVE_SYS_TIME_H 1
| #define HAVE_SYS_TIMEB_H 1
| #define HAVE_SYS_TYPES_H 1
| #define HAVE_SYS_STAT_H 1
| #define HAVE_SYS_UTSNAME_H 1
| #define HAVE_SYSLOG_H 1
| #define HAVE_UNISTD_H 1
| #define HAVE_RESOLV_H 1
| #define TIME_WITH_SYS_TIME 1
| #define HAVE_STRUCT_TM_TM_ZONE 1
| #define HAVE_TM_ZONE 1
| /* end confdefs.h.  */
| #include <stdint.h>
| 
| int
| main (void)
| {
| if (sizeof ((uintptr_t)))
| 	    return 0;
|   ;
|   return 0;
| }
configure:15358: result: yes
configure:15368: checking for uint64_t
configure:15368: mips64el-linux-gnuabi64-gcc -c -g -O2 -Werror=implicit-function-declaration -ffile-prefix-map=/<<PKGBUILDDIR>>=. -fstack-protector-strong -Wformat -Werror=format-security -funsigned-char -fdiagnostics-color -Wdate-time -D_FORTIFY_SOURCE=2 conftest.c >&5
configure:15368: $? = 0
configure:15368: mips64el-linux-gnuabi64-gcc -c -g -O2 -Werror=implicit-function-declaration -ffile-prefix-map=/<<PKGBUILDDIR>>=. -fstack-protector-strong -Wformat -Werror=format-security -funsigned-char -fdiagnostics-color -Wdate-time -D_FORTIFY_SOURCE=2 conftest.c >&5
conftest.c: In function 'main':
conftest.c:61:23: error: expected expression before ')' token
   61 | if (sizeof ((uint64_t)))
      |                       ^
configure:15368: $? = 1
configure: failed program was:
| /* confdefs.h */
| #define PACKAGE_NAME "jabberd2"
| #define PACKAGE_TARNAME "jabberd2"
| #define PACKAGE_VERSION "2.7.0"
| #define PACKAGE_STRING "jabberd2 2.7.0"
| #define PACKAGE_BUGREPORT "jabberd2@lists.xiaoka.com"
| #define PACKAGE_URL ""
| #define PACKAGE "jabberd2"
| #define VERSION "2.7.0"
| #define HAVE_STDIO_H 1
| #define HAVE_STDLIB_H 1
| #define HAVE_STRING_H 1
| #define HAVE_INTTYPES_H 1
| #define HAVE_STDINT_H 1
| #define HAVE_STRINGS_H 1
| #define HAVE_SYS_STAT_H 1
| #define HAVE_SYS_TYPES_H 1
| #define HAVE_UNISTD_H 1
| #define HAVE_SYS_TIME_H 1
| #define HAVE_SYS_SELECT_H 1
| #define HAVE_SYS_SOCKET_H 1
| #define STDC_HEADERS 1
| #define HAVE_DLFCN_H 1
| #define LT_OBJDIR ".libs/"
| #define HAVE_DIRENT_H 1
| #define HAVE_SYS_TYPES_H 1
| #define HAVE_NETINET_IN_H 1
| #define HAVE_ARPA_NAMESER_H 1
| #define HAVE_NETDB_H 1
| #define HAVE_RESOLV_H 1
| #define HAVE_SYS_WAIT_H 1
| #define TIME_WITH_SYS_TIME 1
| #define HAVE_ARPA_INET_H 1
| #define HAVE_ARPA_NAMESER_H 1
| #define HAVE_FCNTL_H 1
| #define HAVE_NETINET_IN_H 1
| #define HAVE_SIGNAL_H 1
| #define HAVE_STDARG_H 1
| #define HAVE_STDINT_H 1
| #define HAVE_STDLIB_H 1
| #define HAVE_STRING_H 1
| #define HAVE_SYS_IOCTL_H 1
| #define HAVE_SYS_SOCKET_H 1
| #define HAVE_SYS_TIME_H 1
| #define HAVE_SYS_TIMEB_H 1
| #define HAVE_SYS_TYPES_H 1
| #define HAVE_SYS_STAT_H 1
| #define HAVE_SYS_UTSNAME_H 1
| #define HAVE_SYSLOG_H 1
| #define HAVE_UNISTD_H 1
| #define HAVE_RESOLV_H 1
| #define TIME_WITH_SYS_TIME 1
| #define HAVE_STRUCT_TM_TM_ZONE 1
| #define HAVE_TM_ZONE 1
| /* end confdefs.h.  */
| #include<stdint.h>
| 
| int
| main (void)
| {
| if (sizeof ((uint64_t)))
| 	    return 0;
|   ;
|   return 0;
| }
configure:15368: result: yes
configure:15378: result: ... seen our uintptr_t in stdint.h (uint64_t too)
configure:15656: result: creating ac-stdint.h : _AC_STDINT_H
configure:15683: checking for int_least32_t
configure:15683: mips64el-linux-gnuabi64-gcc -c -g -O2 -Werror=implicit-function-declaration -ffile-prefix-map=/<<PKGBUILDDIR>>=. -fstack-protector-strong -Wformat -Werror=format-security -funsigned-char -fdiagnostics-color -Wdate-time -D_FORTIFY_SOURCE=2 conftest.c >&5
configure:15683: $? = 0
configure:15683: mips64el-linux-gnuabi64-gcc -c -g -O2 -Werror=implicit-function-declaration -ffile-prefix-map=/<<PKGBUILDDIR>>=. -fstack-protector-strong -Wformat -Werror=format-security -funsigned-char -fdiagnostics-color -Wdate-time -D_FORTIFY_SOURCE=2 conftest.c >&5
conftest.c: In function 'main':
conftest.c:61:28: error: expected expression before ')' token
   61 | if (sizeof ((int_least32_t)))
      |                            ^
configure:15683: $? = 1
configure: failed program was:
| /* confdefs.h */
| #define PACKAGE_NAME "jabberd2"
| #define PACKAGE_TARNAME "jabberd2"
| #define PACKAGE_VERSION "2.7.0"
| #define PACKAGE_STRING "jabberd2 2.7.0"
| #define PACKAGE_BUGREPORT "jabberd2@lists.xiaoka.com"
| #define PACKAGE_URL ""
| #define PACKAGE "jabberd2"
| #define VERSION "2.7.0"
| #define HAVE_STDIO_H 1
| #define HAVE_STDLIB_H 1
| #define HAVE_STRING_H 1
| #define HAVE_INTTYPES_H 1
| #define HAVE_STDINT_H 1
| #define HAVE_STRINGS_H 1
| #define HAVE_SYS_STAT_H 1
| #define HAVE_SYS_TYPES_H 1
| #define HAVE_UNISTD_H 1
| #define HAVE_SYS_TIME_H 1
| #define HAVE_SYS_SELECT_H 1
| #define HAVE_SYS_SOCKET_H 1
| #define STDC_HEADERS 1
| #define HAVE_DLFCN_H 1
| #define LT_OBJDIR ".libs/"
| #define HAVE_DIRENT_H 1
| #define HAVE_SYS_TYPES_H 1
| #define HAVE_NETINET_IN_H 1
| #define HAVE_ARPA_NAMESER_H 1
| #define HAVE_NETDB_H 1
| #define HAVE_RESOLV_H 1
| #define HAVE_SYS_WAIT_H 1
| #define TIME_WITH_SYS_TIME 1
| #define HAVE_ARPA_INET_H 1
| #define HAVE_ARPA_NAMESER_H 1
| #define HAVE_FCNTL_H 1
| #define HAVE_NETINET_IN_H 1
| #define HAVE_SIGNAL_H 1
| #define HAVE_STDARG_H 1
| #define HAVE_STDINT_H 1
| #define HAVE_STDLIB_H 1
| #define HAVE_STRING_H 1
| #define HAVE_SYS_IOCTL_H 1
| #define HAVE_SYS_SOCKET_H 1
| #define HAVE_SYS_TIME_H 1
| #define HAVE_SYS_TIMEB_H 1
| #define HAVE_SYS_TYPES_H 1
| #define HAVE_SYS_STAT_H 1
| #define HAVE_SYS_UTSNAME_H 1
| #define HAVE_SYSLOG_H 1
| #define HAVE_UNISTD_H 1
| #define HAVE_RESOLV_H 1
| #define TIME_WITH_SYS_TIME 1
| #define HAVE_STRUCT_TM_TM_ZONE 1
| #define HAVE_TM_ZONE 1
| /* end confdefs.h.  */
| #include <stdint.h>
| 
| int
| main (void)
| {
| if (sizeof ((int_least32_t)))
| 	    return 0;
|   ;
|   return 0;
| }
configure:15683: result: yes
configure:15690: checking for int_fast32_t
configure:15690: mips64el-linux-gnuabi64-gcc -c -g -O2 -Werror=implicit-function-declaration -ffile-prefix-map=/<<PKGBUILDDIR>>=. -fstack-protector-strong -Wformat -Werror=format-security -funsigned-char -fdiagnostics-color -Wdate-time -D_FORTIFY_SOURCE=2 conftest.c >&5
configure:15690: $? = 0
configure:15690: mips64el-linux-gnuabi64-gcc -c -g -O2 -Werror=implicit-function-declaration -ffile-prefix-map=/<<PKGBUILDDIR>>=. -fstack-protector-strong -Wformat -Werror=format-security -funsigned-char -fdiagnostics-color -Wdate-time -D_FORTIFY_SOURCE=2 conftest.c >&5
conftest.c: In function 'main':
conftest.c:61:27: error: expected expression before ')' token
   61 | if (sizeof ((int_fast32_t)))
      |                           ^
configure:15690: $? = 1
configure: failed program was:
| /* confdefs.h */
| #define PACKAGE_NAME "jabberd2"
| #define PACKAGE_TARNAME "jabberd2"
| #define PACKAGE_VERSION "2.7.0"
| #define PACKAGE_STRING "jabberd2 2.7.0"
| #define PACKAGE_BUGREPORT "jabberd2@lists.xiaoka.com"
| #define PACKAGE_URL ""
| #define PACKAGE "jabberd2"
| #define VERSION "2.7.0"
| #define HAVE_STDIO_H 1
| #define HAVE_STDLIB_H 1
| #define HAVE_STRING_H 1
| #define HAVE_INTTYPES_H 1
| #define HAVE_STDINT_H 1
| #define HAVE_STRINGS_H 1
| #define HAVE_SYS_STAT_H 1
| #define HAVE_SYS_TYPES_H 1
| #define HAVE_UNISTD_H 1
| #define HAVE_SYS_TIME_H 1
| #define HAVE_SYS_SELECT_H 1
| #define HAVE_SYS_SOCKET_H 1
| #define STDC_HEADERS 1
| #define HAVE_DLFCN_H 1
| #define LT_OBJDIR ".libs/"
| #define HAVE_DIRENT_H 1
| #define HAVE_SYS_TYPES_H 1
| #define HAVE_NETINET_IN_H 1
| #define HAVE_ARPA_NAMESER_H 1
| #define HAVE_NETDB_H 1
| #define HAVE_RESOLV_H 1
| #define HAVE_SYS_WAIT_H 1
| #define TIME_WITH_SYS_TIME 1
| #define HAVE_ARPA_INET_H 1
| #define HAVE_ARPA_NAMESER_H 1
| #define HAVE_FCNTL_H 1
| #define HAVE_NETINET_IN_H 1
| #define HAVE_SIGNAL_H 1
| #define HAVE_STDARG_H 1
| #define HAVE_STDINT_H 1
| #define HAVE_STDLIB_H 1
| #define HAVE_STRING_H 1
| #define HAVE_SYS_IOCTL_H 1
| #define HAVE_SYS_SOCKET_H 1
| #define HAVE_SYS_TIME_H 1
| #define HAVE_SYS_TIMEB_H 1
| #define HAVE_SYS_TYPES_H 1
| #define HAVE_SYS_STAT_H 1
| #define HAVE_SYS_UTSNAME_H 1
| #define HAVE_SYSLOG_H 1
| #define HAVE_UNISTD_H 1
| #define HAVE_RESOLV_H 1
| #define TIME_WITH_SYS_TIME 1
| #define HAVE_STRUCT_TM_TM_ZONE 1
| #define HAVE_TM_ZONE 1
| /* end confdefs.h.  */
| #include<stdint.h>
| 
| int
| main (void)
| {
| if (sizeof ((int_fast32_t)))
| 	    return 0;
|   ;
|   return 0;
| }
configure:15690: result: yes
configure:15704: result: ..adding include stdint.h
configure:15714: result: ... seen good stdint.h inttypes
configure:15850: result: ... seen good uint64_t
configure:16070: result: ... DONE ac-stdint.h
configure:16081: checking whether closedir returns void
configure:16102: mips64el-linux-gnuabi64-gcc -c -g -O2 -Werror=implicit-function-declaration -ffile-prefix-map=/<<PKGBUILDDIR>>=. -fstack-protector-strong -Wformat -Werror=format-security -funsigned-char -fdiagnostics-color -Wdate-time -D_FORTIFY_SOURCE=2 conftest.c >&5
conftest.c: In function 'main':
conftest.c:63:10: warning: argument 1 null where non-null expected [-Wnonnull]
   63 |   return closedir(0);
      |          ^~~~~~~~
In file included from conftest.c:57:
/usr/mips64el-linux-gnuabi64/include/dirent.h:134:12: note: in a call to function 'closedir' declared 'nonnull'
  134 | extern int closedir (DIR *__dirp) __nonnull ((1));
      |            ^~~~~~~~
conftest.c:63:10: warning: argument 1 null where non-null expected [-Wnonnull]
   63 |   return closedir(0);
      |          ^~~~~~~~~~~
/usr/mips64el-linux-gnuabi64/include/dirent.h:134:12: note: in a call to function 'closedir' declared 'nonnull'
  134 | extern int closedir (DIR *__dirp) __nonnull ((1));
      |            ^~~~~~~~
configure:16102: $? = 0
configure:16112: result: no
configure:16122: checking for working alloca.h
configure:16140: mips64el-linux-gnuabi64-gcc -o conftest -g -O2 -Werror=implicit-function-declaration -ffile-prefix-map=/<<PKGBUILDDIR>>=. -fstack-protector-strong -Wformat -Werror=format-security -funsigned-char -fdiagnostics-color -Wdate-time -D_FORTIFY_SOURCE=2 -Wl,-z,relro -Wl,-z,now conftest.c  >&5
configure:16140: $? = 0
configure:16151: result: yes
configure:16159: checking for alloca
configure:16204: result: yes
configure:16273: checking for mbstate_t
configure:16291: mips64el-linux-gnuabi64-gcc -c -g -O2 -Werror=implicit-function-declaration -ffile-prefix-map=/<<PKGBUILDDIR>>=. -fstack-protector-strong -Wformat -Werror=format-security -funsigned-char -fdiagnostics-color -Wdate-time -D_FORTIFY_SOURCE=2 conftest.c >&5
configure:16291: $? = 0
configure:16301: result: yes
configure:16312: checking whether getenv is declared
configure:16312: mips64el-linux-gnuabi64-gcc -c -g -O2 -Werror=implicit-function-declaration -ffile-prefix-map=/<<PKGBUILDDIR>>=. -fstack-protector-strong -Wformat -Werror=format-security -funsigned-char -fdiagnostics-color  -Wdate-time -D_FORTIFY_SOURCE=2 conftest.c >&5
configure:16312: $? = 0
configure:16312: result: yes
configure:16326: checking for btowc
configure:16326: mips64el-linux-gnuabi64-gcc -o conftest -g -O2 -Werror=implicit-function-declaration -ffile-prefix-map=/<<PKGBUILDDIR>>=. -fstack-protector-strong -Wformat -Werror=format-security -funsigned-char -fdiagnostics-color -Wdate-time -D_FORTIFY_SOURCE=2 -Wl,-z,relro -Wl,-z,now conftest.c  >&5
configure:16326: $? = 0
configure:16326: result: yes
configure:16326: checking for mbsrtowcs
configure:16326: mips64el-linux-gnuabi64-gcc -o conftest -g -O2 -Werror=implicit-function-declaration -ffile-prefix-map=/<<PKGBUILDDIR>>=. -fstack-protector-strong -Wformat -Werror=format-security -funsigned-char -fdiagnostics-color -Wdate-time -D_FORTIFY_SOURCE=2 -Wl,-z,relro -Wl,-z,now conftest.c  >&5
configure:16326: $? = 0
configure:16326: result: yes
configure:16326: checking for mempcpy
configure:16326: mips64el-linux-gnuabi64-gcc -o conftest -g -O2 -Werror=implicit-function-declaration -ffile-prefix-map=/<<PKGBUILDDIR>>=. -fstack-protector-strong -Wformat -Werror=format-security -funsigned-char -fdiagnostics-color -Wdate-time -D_FORTIFY_SOURCE=2 -Wl,-z,relro -Wl,-z,now conftest.c  >&5
conftest.c:78:6: warning: conflicting types for built-in function 'mempcpy'; expected 'void *(void *, const void *, long unsigned int)' [-Wbuiltin-declaration-mismatch]
   78 | char mempcpy (void);
      |      ^~~~~~~
configure:16326: $? = 0
configure:16326: result: yes
configure:16326: checking for wmempcpy
configure:16326: mips64el-linux-gnuabi64-gcc -o conftest -g -O2 -Werror=implicit-function-declaration -ffile-prefix-map=/<<PKGBUILDDIR>>=. -fstack-protector-strong -Wformat -Werror=format-security -funsigned-char -fdiagnostics-color -Wdate-time -D_FORTIFY_SOURCE=2 -Wl,-z,relro -Wl,-z,now conftest.c  >&5
configure:16326: $? = 0
configure:16326: result: yes
configure:16326: checking for fork
configure:16326: mips64el-linux-gnuabi64-gcc -o conftest -g -O2 -Werror=implicit-function-declaration -ffile-prefix-map=/<<PKGBUILDDIR>>=. -fstack-protector-strong -Wformat -Werror=format-security -funsigned-char -fdiagnostics-color -Wdate-time -D_FORTIFY_SOURCE=2 -Wl,-z,relro -Wl,-z,now conftest.c  >&5
conftest.c:80:6: warning: conflicting types for built-in function 'fork'; expected 'int(void)' [-Wbuiltin-declaration-mismatch]
   80 | char fork (void);
      |      ^~~~
configure:16326: $? = 0
configure:16326: result: yes
configure:16326: checking for vfork
configure:16326: mips64el-linux-gnuabi64-gcc -o conftest -g -O2 -Werror=implicit-function-declaration -ffile-prefix-map=/<<PKGBUILDDIR>>=. -fstack-protector-strong -Wformat -Werror=format-security -funsigned-char -fdiagnostics-color -Wdate-time -D_FORTIFY_SOURCE=2 -Wl,-z,relro -Wl,-z,now conftest.c  >&5
configure:16326: $? = 0
configure:16326: result: yes
configure:16326: checking for alarm
configure:16326: mips64el-linux-gnuabi64-gcc -o conftest -g -O2 -Werror=implicit-function-declaration -ffile-prefix-map=/<<PKGBUILDDIR>>=. -fstack-protector-strong -Wformat -Werror=format-security -funsigned-char -fdiagnostics-color -Wdate-time -D_FORTIFY_SOURCE=2 -Wl,-z,relro -Wl,-z,now conftest.c  >&5
configure:16326: $? = 0
configure:16326: result: yes
configure:16326: checking for vprintf
configure:16326: mips64el-linux-gnuabi64-gcc -o conftest -g -O2 -Werror=implicit-function-declaration -ffile-prefix-map=/<<PKGBUILDDIR>>=. -fstack-protector-strong -Wformat -Werror=format-security -funsigned-char -fdiagnostics-color -Wdate-time -D_FORTIFY_SOURCE=2 -Wl,-z,relro -Wl,-z,now conftest.c  >&5
conftest.c:83:6: warning: conflicting types for built-in function 'vprintf'; expected 'int(const char *, void *)' [-Wbuiltin-declaration-mismatch]
   83 | char vprintf (void);
      |      ^~~~~~~
conftest.c:75:1: note: 'vprintf' is declared in header '<stdio.h>'
   74 | #include <limits.h>
   75 | #undef vprintf
configure:16326: $? = 0
configure:16326: result: yes
configure:16338: checking for working POSIX fnmatch
configure:16387: result: cross
configure:16417: checking for working fork
configure:16455: result: cross
configure:16471: WARNING: result yes guessed because of cross compilation
configure:16476: checking for working vfork
configure:16608: result: yes
configure:16633: checking for working memcmp
configure:16692: result: no
configure:16704: checking for working mktime
configure:16916: result: no
configure:16930: checking types of arguments for select
configure:16960: mips64el-linux-gnuabi64-gcc -c -g -O2 -Werror=implicit-function-declaration -ffile-prefix-map=/<<PKGBUILDDIR>>=. -fstack-protector-strong -Wformat -Werror=format-security -funsigned-char -fdiagnostics-color -Wdate-time -D_FORTIFY_SOURCE=2 conftest.c >&5
configure:16960: $? = 0
configure:16971: result: int,fd_set *,struct timeval *
configure:16988: checking return type of signal handlers
configure:17007: mips64el-linux-gnuabi64-gcc -c -g -O2 -Werror=implicit-function-declaration -ffile-prefix-map=/<<PKGBUILDDIR>>=. -fstack-protector-strong -Wformat -Werror=format-security -funsigned-char -fdiagnostics-color -Wdate-time -D_FORTIFY_SOURCE=2 conftest.c >&5
conftest.c: In function 'main':
conftest.c:80:10: error: void value not ignored as it ought to be
   80 | return *(signal (0, 0)) (0) == 1;
      |         ~^~~~~~~~~~~~~~~~~~
configure:17007: $? = 1
configure: failed program was:
| /* confdefs.h */
| #define PACKAGE_NAME "jabberd2"
| #define PACKAGE_TARNAME "jabberd2"
| #define PACKAGE_VERSION "2.7.0"
| #define PACKAGE_STRING "jabberd2 2.7.0"
| #define PACKAGE_BUGREPORT "jabberd2@lists.xiaoka.com"
| #define PACKAGE_URL ""
| #define PACKAGE "jabberd2"
| #define VERSION "2.7.0"
| #define HAVE_STDIO_H 1
| #define HAVE_STDLIB_H 1
| #define HAVE_STRING_H 1
| #define HAVE_INTTYPES_H 1
| #define HAVE_STDINT_H 1
| #define HAVE_STRINGS_H 1
| #define HAVE_SYS_STAT_H 1
| #define HAVE_SYS_TYPES_H 1
| #define HAVE_UNISTD_H 1
| #define HAVE_SYS_TIME_H 1
| #define HAVE_SYS_SELECT_H 1
| #define HAVE_SYS_SOCKET_H 1
| #define STDC_HEADERS 1
| #define HAVE_DLFCN_H 1
| #define LT_OBJDIR ".libs/"
| #define HAVE_DIRENT_H 1
| #define HAVE_SYS_TYPES_H 1
| #define HAVE_NETINET_IN_H 1
| #define HAVE_ARPA_NAMESER_H 1
| #define HAVE_NETDB_H 1
| #define HAVE_RESOLV_H 1
| #define HAVE_SYS_WAIT_H 1
| #define TIME_WITH_SYS_TIME 1
| #define HAVE_ARPA_INET_H 1
| #define HAVE_ARPA_NAMESER_H 1
| #define HAVE_FCNTL_H 1
| #define HAVE_NETINET_IN_H 1
| #define HAVE_SIGNAL_H 1
| #define HAVE_STDARG_H 1
| #define HAVE_STDINT_H 1
| #define HAVE_STDLIB_H 1
| #define HAVE_STRING_H 1
| #define HAVE_SYS_IOCTL_H 1
| #define HAVE_SYS_SOCKET_H 1
| #define HAVE_SYS_TIME_H 1
| #define HAVE_SYS_TIMEB_H 1
| #define HAVE_SYS_TYPES_H 1
| #define HAVE_SYS_STAT_H 1
| #define HAVE_SYS_UTSNAME_H 1
| #define HAVE_SYSLOG_H 1
| #define HAVE_UNISTD_H 1
| #define HAVE_RESOLV_H 1
| #define TIME_WITH_SYS_TIME 1
| #define HAVE_STRUCT_TM_TM_ZONE 1
| #define HAVE_TM_ZONE 1
| #define HAVE_ALLOCA_H 1
| #define HAVE_ALLOCA 1
| #define HAVE_MBSTATE_T 1
| #define HAVE_DECL_GETENV 1
| #define HAVE_BTOWC 1
| #define HAVE_MBSRTOWCS 1
| #define HAVE_MEMPCPY 1
| #define HAVE_WMEMPCPY 1
| #define HAVE_FORK 1
| #define HAVE_VFORK 1
| #define HAVE_ALARM 1
| #define HAVE_VPRINTF 1
| #define fnmatch rpl_fnmatch
| #define HAVE_WORKING_VFORK 1
| #define HAVE_WORKING_FORK 1
| #define SELECT_TYPE_ARG1 int
| #define SELECT_TYPE_ARG234 (fd_set *)
| #define SELECT_TYPE_ARG5 (struct timeval *)
| /* end confdefs.h.  */
| #include <sys/types.h>
| #include <signal.h>
| 
| int
| main (void)
| {
| return *(signal (0, 0)) (0) == 1;
|   ;
|   return 0;
| }
configure:17017: result: void
configure:17023: checking whether lstat correctly handles trailing slash
configure:17077: result: yes
configure:17094: checking whether stat accepts an empty string
configure:17130: result: yes
configure:17158: checking types of arguments for select
configure:17199: result: int,fd_set *,struct timeval *
configure:17216: checking for close
configure:17216: mips64el-linux-gnuabi64-gcc -o conftest -g -O2 -Werror=implicit-function-declaration -ffile-prefix-map=/<<PKGBUILDDIR>>=. -fstack-protector-strong -Wformat -Werror=format-security -funsigned-char -fdiagnostics-color -Wdate-time -D_FORTIFY_SOURCE=2 -Wl,-z,relro -Wl,-z,now conftest.c  >&5
configure:17216: $? = 0
configure:17216: result: yes
configure:17222: checking for dup2
configure:17222: mips64el-linux-gnuabi64-gcc -o conftest -g -O2 -Werror=implicit-function-declaration -ffile-prefix-map=/<<PKGBUILDDIR>>=. -fstack-protector-strong -Wformat -Werror=format-security -funsigned-char -fdiagnostics-color -Wdate-time -D_FORTIFY_SOURCE=2 -Wl,-z,relro -Wl,-z,now conftest.c  >&5
configure:17222: $? = 0
configure:17222: result: yes
configure:17228: checking for fcntl
configure:17228: mips64el-linux-gnuabi64-gcc -o conftest -g -O2 -Werror=implicit-function-declaration -ffile-prefix-map=/<<PKGBUILDDIR>>=. -fstack-protector-strong -Wformat -Werror=format-security -funsigned-char -fdiagnostics-color -Wdate-time -D_FORTIFY_SOURCE=2 -Wl,-z,relro -Wl,-z,now conftest.c  >&5
configure:17228: $? = 0
configure:17228: result: yes
configure:17234: checking for _findfirst
configure:17234: mips64el-linux-gnuabi64-gcc -o conftest -g -O2 -Werror=implicit-function-declaration -ffile-prefix-map=/<<PKGBUILDDIR>>=. -fstack-protector-strong -Wformat -Werror=format-security -funsigned-char -fdiagnostics-color -Wdate-time -D_FORTIFY_SOURCE=2 -Wl,-z,relro -Wl,-z,now conftest.c  >&5
/usr/lib/gcc-cross/mips64el-linux-gnuabi64/14/../../../../mips64el-linux-gnuabi64/bin/ld: /tmp/ccw9lrUe.o: in function `main':
./conftest.c:110:(.text.startup+0x14): undefined reference to `_findfirst'
/usr/lib/gcc-cross/mips64el-linux-gnuabi64/14/../../../../mips64el-linux-gnuabi64/bin/ld: ./conftest.c:110:(.text.startup+0x1c): undefined reference to `_findfirst'
collect2: error: ld returned 1 exit status
configure:17234: $? = 1
configure: failed program was:
| /* confdefs.h */
| #define PACKAGE_NAME "jabberd2"
| #define PACKAGE_TARNAME "jabberd2"
| #define PACKAGE_VERSION "2.7.0"
| #define PACKAGE_STRING "jabberd2 2.7.0"
| #define PACKAGE_BUGREPORT "jabberd2@lists.xiaoka.com"
| #define PACKAGE_URL ""
| #define PACKAGE "jabberd2"
| #define VERSION "2.7.0"
| #define HAVE_STDIO_H 1
| #define HAVE_STDLIB_H 1
| #define HAVE_STRING_H 1
| #define HAVE_INTTYPES_H 1
| #define HAVE_STDINT_H 1
| #define HAVE_STRINGS_H 1
| #define HAVE_SYS_STAT_H 1
| #define HAVE_SYS_TYPES_H 1
| #define HAVE_UNISTD_H 1
| #define HAVE_SYS_TIME_H 1
| #define HAVE_SYS_SELECT_H 1
| #define HAVE_SYS_SOCKET_H 1
| #define STDC_HEADERS 1
| #define HAVE_DLFCN_H 1
| #define LT_OBJDIR ".libs/"
| #define HAVE_DIRENT_H 1
| #define HAVE_SYS_TYPES_H 1
| #define HAVE_NETINET_IN_H 1
| #define HAVE_ARPA_NAMESER_H 1
| #define HAVE_NETDB_H 1
| #define HAVE_RESOLV_H 1
| #define HAVE_SYS_WAIT_H 1
| #define TIME_WITH_SYS_TIME 1
| #define HAVE_ARPA_INET_H 1
| #define HAVE_ARPA_NAMESER_H 1
| #define HAVE_FCNTL_H 1
| #define HAVE_NETINET_IN_H 1
| #define HAVE_SIGNAL_H 1
| #define HAVE_STDARG_H 1
| #define HAVE_STDINT_H 1
| #define HAVE_STDLIB_H 1
| #define HAVE_STRING_H 1
| #define HAVE_SYS_IOCTL_H 1
| #define HAVE_SYS_SOCKET_H 1
| #define HAVE_SYS_TIME_H 1
| #define HAVE_SYS_TIMEB_H 1
| #define HAVE_SYS_TYPES_H 1
| #define HAVE_SYS_STAT_H 1
| #define HAVE_SYS_UTSNAME_H 1
| #define HAVE_SYSLOG_H 1
| #define HAVE_UNISTD_H 1
| #define HAVE_RESOLV_H 1
| #define TIME_WITH_SYS_TIME 1
| #define HAVE_STRUCT_TM_TM_ZONE 1
| #define HAVE_TM_ZONE 1
| #define HAVE_ALLOCA_H 1
| #define HAVE_ALLOCA 1
| #define HAVE_MBSTATE_T 1
| #define HAVE_DECL_GETENV 1
| #define HAVE_BTOWC 1
| #define HAVE_MBSRTOWCS 1
| #define HAVE_MEMPCPY 1
| #define HAVE_WMEMPCPY 1
| #define HAVE_FORK 1
| #define HAVE_VFORK 1
| #define HAVE_ALARM 1
| #define HAVE_VPRINTF 1
| #define fnmatch rpl_fnmatch
| #define HAVE_WORKING_VFORK 1
| #define HAVE_WORKING_FORK 1
| #define SELECT_TYPE_ARG1 int
| #define SELECT_TYPE_ARG234 (fd_set *)
| #define SELECT_TYPE_ARG5 (struct timeval *)
| #define RETSIGTYPE void
| #define LSTAT_FOLLOWS_SLASHED_SYMLINK 1
| #define HAVE_STAT_EMPTY_STRING_BUG 1
| #define SELECT_TYPE_ARG1 int
| #define SELECT_TYPE_ARG234 (fd_set *)
| #define SELECT_TYPE_ARG5 (struct timeval *)
| #define HAVE_CLOSE 1
| #define HAVE_DUP2 1
| #define HAVE_FCNTL 1
| /* end confdefs.h.  */
| /* Define _findfirst to an innocuous variant, in case <limits.h> declares _findfirst.
|    For example, HP-UX 11i <limits.h> declares gettimeofday.  */
| #define _findfirst innocuous__findfirst
| 
| /* System header to define __stub macros and hopefully few prototypes,
|    which can conflict with char _findfirst (void); below.  */
| 
| #include <limits.h>
| #undef _findfirst
| 
| /* Override any GCC internal prototype to avoid an error.
|    Use char because int might match the return type of a GCC
|    builtin and then its argument prototype would still apply.  */
| #ifdef __cplusplus
| extern "C"
| #endif
| char _findfirst (void);
| /* The GNU C library defines this for functions which it implements
|     to always fail with ENOSYS.  Some functions are actually named
|     something starting with __ and the normal name is an alias.  */
| #if defined __stub__findfirst || defined __stub____findfirst
| choke me
| #endif
| 
| int
| main (void)
| {
| return _findfirst ();
|   ;
|   return 0;
| }
configure:17234: result: no
configure:17240: checking for gethostname
configure:17240: mips64el-linux-gnuabi64-gcc -o conftest -g -O2 -Werror=implicit-function-declaration -ffile-prefix-map=/<<PKGBUILDDIR>>=. -fstack-protector-strong -Wformat -Werror=format-security -funsigned-char -fdiagnostics-color -Wdate-time -D_FORTIFY_SOURCE=2 -Wl,-z,relro -Wl,-z,now conftest.c  >&5
configure:17240: $? = 0
configure:17240: result: yes
configure:17246: checking for getopt
configure:17246: mips64el-linux-gnuabi64-gcc -o conftest -g -O2 -Werror=implicit-function-declaration -ffile-prefix-map=/<<PKGBUILDDIR>>=. -fstack-protector-strong -Wformat -Werror=format-security -funsigned-char -fdiagnostics-color -Wdate-time -D_FORTIFY_SOURCE=2 -Wl,-z,relro -Wl,-z,now conftest.c  >&5
configure:17246: $? = 0
configure:17246: result: yes
configure:17252: checking for getpagesize
configure:17252: mips64el-linux-gnuabi64-gcc -o conftest -g -O2 -Werror=implicit-function-declaration -ffile-prefix-map=/<<PKGBUILDDIR>>=. -fstack-protector-strong -Wformat -Werror=format-security -funsigned-char -fdiagnostics-color -Wdate-time -D_FORTIFY_SOURCE=2 -Wl,-z,relro -Wl,-z,now conftest.c  >&5
configure:17252: $? = 0
configure:17252: result: yes
configure:17258: checking for getpid
configure:17258: mips64el-linux-gnuabi64-gcc -o conftest -g -O2 -Werror=implicit-function-declaration -ffile-prefix-map=/<<PKGBUILDDIR>>=. -fstack-protector-strong -Wformat -Werror=format-security -funsigned-char -fdiagnostics-color -Wdate-time -D_FORTIFY_SOURCE=2 -Wl,-z,relro -Wl,-z,now conftest.c  >&5
configure:17258: $? = 0
configure:17258: result: yes
configure:17264: checking for gettimeofday
configure:17264: mips64el-linux-gnuabi64-gcc -o conftest -g -O2 -Werror=implicit-function-declaration -ffile-prefix-map=/<<PKGBUILDDIR>>=. -fstack-protector-strong -Wformat -Werror=format-security -funsigned-char -fdiagnostics-color -Wdate-time -D_FORTIFY_SOURCE=2 -Wl,-z,relro -Wl,-z,now conftest.c  >&5
configure:17264: $? = 0
configure:17264: result: yes
configure:17270: checking for inet_aton
configure:17270: mips64el-linux-gnuabi64-gcc -o conftest -g -O2 -Werror=implicit-function-declaration -ffile-prefix-map=/<<PKGBUILDDIR>>=. -fstack-protector-strong -Wformat -Werror=format-security -funsigned-char -fdiagnostics-color -Wdate-time -D_FORTIFY_SOURCE=2 -Wl,-z,relro -Wl,-z,now conftest.c  >&5
configure:17270: $? = 0
configure:17270: result: yes
configure:17276: checking for inet_ntoa
configure:17276: mips64el-linux-gnuabi64-gcc -o conftest -g -O2 -Werror=implicit-function-declaration -ffile-prefix-map=/<<PKGBUILDDIR>>=. -fstack-protector-strong -Wformat -Werror=format-security -funsigned-char -fdiagnostics-color -Wdate-time -D_FORTIFY_SOURCE=2 -Wl,-z,relro -Wl,-z,now conftest.c  >&5
configure:17276: $? = 0
configure:17276: result: yes
configure:17282: checking for ioctl
configure:17282: mips64el-linux-gnuabi64-gcc -o conftest -g -O2 -Werror=implicit-function-declaration -ffile-prefix-map=/<<PKGBUILDDIR>>=. -fstack-protector-strong -Wformat -Werror=format-security -funsigned-char -fdiagnostics-color -Wdate-time -D_FORTIFY_SOURCE=2 -Wl,-z,relro -Wl,-z,now conftest.c  >&5
configure:17282: $? = 0
configure:17282: result: yes
configure:17288: checking for isascii
configure:17288: mips64el-linux-gnuabi64-gcc -o conftest -g -O2 -Werror=implicit-function-declaration -ffile-prefix-map=/<<PKGBUILDDIR>>=. -fstack-protector-strong -Wformat -Werror=format-security -funsigned-char -fdiagnostics-color -Wdate-time -D_FORTIFY_SOURCE=2 -Wl,-z,relro -Wl,-z,now conftest.c  >&5
conftest.c:107:6: warning: conflicting types for built-in function 'isascii'; expected 'int(int)' [-Wbuiltin-declaration-mismatch]
  107 | char isascii (void);
      |      ^~~~~~~
configure:17288: $? = 0
configure:17288: result: yes
configure:17294: checking for memchr
configure:17294: mips64el-linux-gnuabi64-gcc -o conftest -g -O2 -Werror=implicit-function-declaration -ffile-prefix-map=/<<PKGBUILDDIR>>=. -fstack-protector-strong -Wformat -Werror=format-security -funsigned-char -fdiagnostics-color -Wdate-time -D_FORTIFY_SOURCE=2 -Wl,-z,relro -Wl,-z,now conftest.c  >&5
conftest.c:108:6: warning: conflicting types for built-in function 'memchr'; expected 'void *(const void *, int,  long unsigned int)' [-Wbuiltin-declaration-mismatch]
  108 | char memchr (void);
      |      ^~~~~~
conftest.c:100:1: note: 'memchr' is declared in header '<string.h>'
   99 | #include <limits.h>
  100 | #undef memchr
configure:17294: $? = 0
configure:17294: result: yes
configure:17300: checking for memmove
configure:17300: mips64el-linux-gnuabi64-gcc -o conftest -g -O2 -Werror=implicit-function-declaration -ffile-prefix-map=/<<PKGBUILDDIR>>=. -fstack-protector-strong -Wformat -Werror=format-security -funsigned-char -fdiagnostics-color -Wdate-time -D_FORTIFY_SOURCE=2 -Wl,-z,relro -Wl,-z,now conftest.c  >&5
conftest.c:109:6: warning: conflicting types for built-in function 'memmove'; expected 'void *(void *, const void *, long unsigned int)' [-Wbuiltin-declaration-mismatch]
  109 | char memmove (void);
      |      ^~~~~~~
conftest.c:101:1: note: 'memmove' is declared in header '<string.h>'
  100 | #include <limits.h>
  101 | #undef memmove
configure:17300: $? = 0
configure:17300: result: yes
configure:17306: checking for memset
configure:17306: mips64el-linux-gnuabi64-gcc -o conftest -g -O2 -Werror=implicit-function-declaration -ffile-prefix-map=/<<PKGBUILDDIR>>=. -fstack-protector-strong -Wformat -Werror=format-security -funsigned-char -fdiagnostics-color -Wdate-time -D_FORTIFY_SOURCE=2 -Wl,-z,relro -Wl,-z,now conftest.c  >&5
conftest.c:110:6: warning: conflicting types for built-in function 'memset'; expected 'void *(void *, int,  long unsigned int)' [-Wbuiltin-declaration-mismatch]
  110 | char memset (void);
      |      ^~~~~~
conftest.c:102:1: note: 'memset' is declared in header '<string.h>'
  101 | #include <limits.h>
  102 | #undef memset
configure:17306: $? = 0
configure:17306: result: yes
configure:17312: checking for mkdir
configure:17312: mips64el-linux-gnuabi64-gcc -o conftest -g -O2 -Werror=implicit-function-declaration -ffile-prefix-map=/<<PKGBUILDDIR>>=. -fstack-protector-strong -Wformat -Werror=format-security -funsigned-char -fdiagnostics-color -Wdate-time -D_FORTIFY_SOURCE=2 -Wl,-z,relro -Wl,-z,now conftest.c  >&5
configure:17312: $? = 0
configure:17312: result: yes
configure:17318: checking for _mkdir
configure:17318: mips64el-linux-gnuabi64-gcc -o conftest -g -O2 -Werror=implicit-function-declaration -ffile-prefix-map=/<<PKGBUILDDIR>>=. -fstack-protector-strong -Wformat -Werror=format-security -funsigned-char -fdiagnostics-color -Wdate-time -D_FORTIFY_SOURCE=2 -Wl,-z,relro -Wl,-z,now conftest.c  >&5
/usr/lib/gcc-cross/mips64el-linux-gnuabi64/14/../../../../mips64el-linux-gnuabi64/bin/ld: /tmp/cc4Fo4K8.o: in function `main':
./conftest.c:123:(.text.startup+0x14): undefined reference to `_mkdir'
/usr/lib/gcc-cross/mips64el-linux-gnuabi64/14/../../../../mips64el-linux-gnuabi64/bin/ld: ./conftest.c:123:(.text.startup+0x1c): undefined reference to `_mkdir'
collect2: error: ld returned 1 exit status
configure:17318: $? = 1
configure: failed program was:
| /* confdefs.h */
| #define PACKAGE_NAME "jabberd2"
| #define PACKAGE_TARNAME "jabberd2"
| #define PACKAGE_VERSION "2.7.0"
| #define PACKAGE_STRING "jabberd2 2.7.0"
| #define PACKAGE_BUGREPORT "jabberd2@lists.xiaoka.com"
| #define PACKAGE_URL ""
| #define PACKAGE "jabberd2"
| #define VERSION "2.7.0"
| #define HAVE_STDIO_H 1
| #define HAVE_STDLIB_H 1
| #define HAVE_STRING_H 1
| #define HAVE_INTTYPES_H 1
| #define HAVE_STDINT_H 1
| #define HAVE_STRINGS_H 1
| #define HAVE_SYS_STAT_H 1
| #define HAVE_SYS_TYPES_H 1
| #define HAVE_UNISTD_H 1
| #define HAVE_SYS_TIME_H 1
| #define HAVE_SYS_SELECT_H 1
| #define HAVE_SYS_SOCKET_H 1
| #define STDC_HEADERS 1
| #define HAVE_DLFCN_H 1
| #define LT_OBJDIR ".libs/"
| #define HAVE_DIRENT_H 1
| #define HAVE_SYS_TYPES_H 1
| #define HAVE_NETINET_IN_H 1
| #define HAVE_ARPA_NAMESER_H 1
| #define HAVE_NETDB_H 1
| #define HAVE_RESOLV_H 1
| #define HAVE_SYS_WAIT_H 1
| #define TIME_WITH_SYS_TIME 1
| #define HAVE_ARPA_INET_H 1
| #define HAVE_ARPA_NAMESER_H 1
| #define HAVE_FCNTL_H 1
| #define HAVE_NETINET_IN_H 1
| #define HAVE_SIGNAL_H 1
| #define HAVE_STDARG_H 1
| #define HAVE_STDINT_H 1
| #define HAVE_STDLIB_H 1
| #define HAVE_STRING_H 1
| #define HAVE_SYS_IOCTL_H 1
| #define HAVE_SYS_SOCKET_H 1
| #define HAVE_SYS_TIME_H 1
| #define HAVE_SYS_TIMEB_H 1
| #define HAVE_SYS_TYPES_H 1
| #define HAVE_SYS_STAT_H 1
| #define HAVE_SYS_UTSNAME_H 1
| #define HAVE_SYSLOG_H 1
| #define HAVE_UNISTD_H 1
| #define HAVE_RESOLV_H 1
| #define TIME_WITH_SYS_TIME 1
| #define HAVE_STRUCT_TM_TM_ZONE 1
| #define HAVE_TM_ZONE 1
| #define HAVE_ALLOCA_H 1
| #define HAVE_ALLOCA 1
| #define HAVE_MBSTATE_T 1
| #define HAVE_DECL_GETENV 1
| #define HAVE_BTOWC 1
| #define HAVE_MBSRTOWCS 1
| #define HAVE_MEMPCPY 1
| #define HAVE_WMEMPCPY 1
| #define HAVE_FORK 1
| #define HAVE_VFORK 1
| #define HAVE_ALARM 1
| #define HAVE_VPRINTF 1
| #define fnmatch rpl_fnmatch
| #define HAVE_WORKING_VFORK 1
| #define HAVE_WORKING_FORK 1
| #define SELECT_TYPE_ARG1 int
| #define SELECT_TYPE_ARG234 (fd_set *)
| #define SELECT_TYPE_ARG5 (struct timeval *)
| #define RETSIGTYPE void
| #define LSTAT_FOLLOWS_SLASHED_SYMLINK 1
| #define HAVE_STAT_EMPTY_STRING_BUG 1
| #define SELECT_TYPE_ARG1 int
| #define SELECT_TYPE_ARG234 (fd_set *)
| #define SELECT_TYPE_ARG5 (struct timeval *)
| #define HAVE_CLOSE 1
| #define HAVE_DUP2 1
| #define HAVE_FCNTL 1
| #define HAVE_GETHOSTNAME 1
| #define HAVE_GETOPT 1
| #define HAVE_GETPAGESIZE 1
| #define HAVE_GETPID 1
| #define HAVE_GETTIMEOFDAY 1
| #define HAVE_INET_ATON 1
| #define HAVE_INET_NTOA 1
| #define HAVE_IOCTL 1
| #define HAVE_ISASCII 1
| #define HAVE_MEMCHR 1
| #define HAVE_MEMMOVE 1
| #define HAVE_MEMSET 1
| #define HAVE_MKDIR 1
| /* end confdefs.h.  */
| /* Define _mkdir to an innocuous variant, in case <limits.h> declares _mkdir.
|    For example, HP-UX 11i <limits.h> declares gettimeofday.  */
| #define _mkdir innocuous__mkdir
| 
| /* System header to define __stub macros and hopefully few prototypes,
|    which can conflict with char _mkdir (void); below.  */
| 
| #include <limits.h>
| #undef _mkdir
| 
| /* Override any GCC internal prototype to avoid an error.
|    Use char because int might match the return type of a GCC
|    builtin and then its argument prototype would still apply.  */
| #ifdef __cplusplus
| extern "C"
| #endif
| char _mkdir (void);
| /* The GNU C library defines this for functions which it implements
|     to always fail with ENOSYS.  Some functions are actually named
|     something starting with __ and the normal name is an alias.  */
| #if defined __stub__mkdir || defined __stub____mkdir
| choke me
| #endif
| 
| int
| main (void)
| {
| return _mkdir ();
|   ;
|   return 0;
| }
configure:17318: result: no
configure:17324: checking for modf
configure:17324: mips64el-linux-gnuabi64-gcc -o conftest -g -O2 -Werror=implicit-function-declaration -ffile-prefix-map=/<<PKGBUILDDIR>>=. -fstack-protector-strong -Wformat -Werror=format-security -funsigned-char -fdiagnostics-color -Wdate-time -D_FORTIFY_SOURCE=2 -Wl,-z,relro -Wl,-z,now conftest.c  >&5
conftest.c:112:6: warning: conflicting types for built-in function 'modf'; expected 'double(double,  double *)' [-Wbuiltin-declaration-mismatch]
  112 | char modf (void);
      |      ^~~~
conftest.c:104:1: note: 'modf' is declared in header '<math.h>'
  103 | #include <limits.h>
  104 | #undef modf
configure:17324: $? = 0
configure:17324: result: yes
configure:17330: checking for select
configure:17330: mips64el-linux-gnuabi64-gcc -o conftest -g -O2 -Werror=implicit-function-declaration -ffile-prefix-map=/<<PKGBUILDDIR>>=. -fstack-protector-strong -Wformat -Werror=format-security -funsigned-char -fdiagnostics-color -Wdate-time -D_FORTIFY_SOURCE=2 -Wl,-z,relro -Wl,-z,now conftest.c  >&5
configure:17330: $? = 0
configure:17330: result: yes
configure:17336: checking for setenv
configure:17336: mips64el-linux-gnuabi64-gcc -o conftest -g -O2 -Werror=implicit-function-declaration -ffile-prefix-map=/<<PKGBUILDDIR>>=. -fstack-protector-strong -Wformat -Werror=format-security -funsigned-char -fdiagnostics-color -Wdate-time -D_FORTIFY_SOURCE=2 -Wl,-z,relro -Wl,-z,now conftest.c  >&5
configure:17336: $? = 0
configure:17336: result: yes
configure:17342: checking for sleep
configure:17342: mips64el-linux-gnuabi64-gcc -o conftest -g -O2 -Werror=implicit-function-declaration -ffile-prefix-map=/<<PKGBUILDDIR>>=. -fstack-protector-strong -Wformat -Werror=format-security -funsigned-char -fdiagnostics-color -Wdate-time -D_FORTIFY_SOURCE=2 -Wl,-z,relro -Wl,-z,now conftest.c  >&5
configure:17342: $? = 0
configure:17342: result: yes
configure:17348: checking for Sleep
configure:17348: mips64el-linux-gnuabi64-gcc -o conftest -g -O2 -Werror=implicit-function-declaration -ffile-prefix-map=/<<PKGBUILDDIR>>=. -fstack-protector-strong -Wformat -Werror=format-security -funsigned-char -fdiagnostics-color -Wdate-time -D_FORTIFY_SOURCE=2 -Wl,-z,relro -Wl,-z,now conftest.c  >&5
/usr/lib/gcc-cross/mips64el-linux-gnuabi64/14/../../../../mips64el-linux-gnuabi64/bin/ld: /tmp/cc3WiLS1.o: in function `main':
./conftest.c:127:(.text.startup+0x14): undefined reference to `Sleep'
/usr/lib/gcc-cross/mips64el-linux-gnuabi64/14/../../../../mips64el-linux-gnuabi64/bin/ld: ./conftest.c:127:(.text.startup+0x1c): undefined reference to `Sleep'
collect2: error: ld returned 1 exit status
configure:17348: $? = 1
configure: failed program was:
| /* confdefs.h */
| #define PACKAGE_NAME "jabberd2"
| #define PACKAGE_TARNAME "jabberd2"
| #define PACKAGE_VERSION "2.7.0"
| #define PACKAGE_STRING "jabberd2 2.7.0"
| #define PACKAGE_BUGREPORT "jabberd2@lists.xiaoka.com"
| #define PACKAGE_URL ""
| #define PACKAGE "jabberd2"
| #define VERSION "2.7.0"
| #define HAVE_STDIO_H 1
| #define HAVE_STDLIB_H 1
| #define HAVE_STRING_H 1
| #define HAVE_INTTYPES_H 1
| #define HAVE_STDINT_H 1
| #define HAVE_STRINGS_H 1
| #define HAVE_SYS_STAT_H 1
| #define HAVE_SYS_TYPES_H 1
| #define HAVE_UNISTD_H 1
| #define HAVE_SYS_TIME_H 1
| #define HAVE_SYS_SELECT_H 1
| #define HAVE_SYS_SOCKET_H 1
| #define STDC_HEADERS 1
| #define HAVE_DLFCN_H 1
| #define LT_OBJDIR ".libs/"
| #define HAVE_DIRENT_H 1
| #define HAVE_SYS_TYPES_H 1
| #define HAVE_NETINET_IN_H 1
| #define HAVE_ARPA_NAMESER_H 1
| #define HAVE_NETDB_H 1
| #define HAVE_RESOLV_H 1
| #define HAVE_SYS_WAIT_H 1
| #define TIME_WITH_SYS_TIME 1
| #define HAVE_ARPA_INET_H 1
| #define HAVE_ARPA_NAMESER_H 1
| #define HAVE_FCNTL_H 1
| #define HAVE_NETINET_IN_H 1
| #define HAVE_SIGNAL_H 1
| #define HAVE_STDARG_H 1
| #define HAVE_STDINT_H 1
| #define HAVE_STDLIB_H 1
| #define HAVE_STRING_H 1
| #define HAVE_SYS_IOCTL_H 1
| #define HAVE_SYS_SOCKET_H 1
| #define HAVE_SYS_TIME_H 1
| #define HAVE_SYS_TIMEB_H 1
| #define HAVE_SYS_TYPES_H 1
| #define HAVE_SYS_STAT_H 1
| #define HAVE_SYS_UTSNAME_H 1
| #define HAVE_SYSLOG_H 1
| #define HAVE_UNISTD_H 1
| #define HAVE_RESOLV_H 1
| #define TIME_WITH_SYS_TIME 1
| #define HAVE_STRUCT_TM_TM_ZONE 1
| #define HAVE_TM_ZONE 1
| #define HAVE_ALLOCA_H 1
| #define HAVE_ALLOCA 1
| #define HAVE_MBSTATE_T 1
| #define HAVE_DECL_GETENV 1
| #define HAVE_BTOWC 1
| #define HAVE_MBSRTOWCS 1
| #define HAVE_MEMPCPY 1
| #define HAVE_WMEMPCPY 1
| #define HAVE_FORK 1
| #define HAVE_VFORK 1
| #define HAVE_ALARM 1
| #define HAVE_VPRINTF 1
| #define fnmatch rpl_fnmatch
| #define HAVE_WORKING_VFORK 1
| #define HAVE_WORKING_FORK 1
| #define SELECT_TYPE_ARG1 int
| #define SELECT_TYPE_ARG234 (fd_set *)
| #define SELECT_TYPE_ARG5 (struct timeval *)
| #define RETSIGTYPE void
| #define LSTAT_FOLLOWS_SLASHED_SYMLINK 1
| #define HAVE_STAT_EMPTY_STRING_BUG 1
| #define SELECT_TYPE_ARG1 int
| #define SELECT_TYPE_ARG234 (fd_set *)
| #define SELECT_TYPE_ARG5 (struct timeval *)
| #define HAVE_CLOSE 1
| #define HAVE_DUP2 1
| #define HAVE_FCNTL 1
| #define HAVE_GETHOSTNAME 1
| #define HAVE_GETOPT 1
| #define HAVE_GETPAGESIZE 1
| #define HAVE_GETPID 1
| #define HAVE_GETTIMEOFDAY 1
| #define HAVE_INET_ATON 1
| #define HAVE_INET_NTOA 1
| #define HAVE_IOCTL 1
| #define HAVE_ISASCII 1
| #define HAVE_MEMCHR 1
| #define HAVE_MEMMOVE 1
| #define HAVE_MEMSET 1
| #define HAVE_MKDIR 1
| #define HAVE_MODF 1
| #define HAVE_SELECT 1
| #define HAVE_SETENV 1
| #define HAVE_SLEEP 1
| /* end confdefs.h.  */
| /* Define Sleep to an innocuous variant, in case <limits.h> declares Sleep.
|    For example, HP-UX 11i <limits.h> declares gettimeofday.  */
| #define Sleep innocuous_Sleep
| 
| /* System header to define __stub macros and hopefully few prototypes,
|    which can conflict with char Sleep (void); below.  */
| 
| #include <limits.h>
| #undef Sleep
| 
| /* Override any GCC internal prototype to avoid an error.
|    Use char because int might match the return type of a GCC
|    builtin and then its argument prototype would still apply.  */
| #ifdef __cplusplus
| extern "C"
| #endif
| char Sleep (void);
| /* The GNU C library defines this for functions which it implements
|     to always fail with ENOSYS.  Some functions are actually named
|     something starting with __ and the normal name is an alias.  */
| #if defined __stub_Sleep || defined __stub___Sleep
| choke me
| #endif
| 
| int
| main (void)
| {
| return Sleep ();
|   ;
|   return 0;
| }
configure:17348: result: no
configure:17354: checking for socket
configure:17354: mips64el-linux-gnuabi64-gcc -o conftest -g -O2 -Werror=implicit-function-declaration -ffile-prefix-map=/<<PKGBUILDDIR>>=. -fstack-protector-strong -Wformat -Werror=format-security -funsigned-char -fdiagnostics-color -Wdate-time -D_FORTIFY_SOURCE=2 -Wl,-z,relro -Wl,-z,now conftest.c  >&5
configure:17354: $? = 0
configure:17354: result: yes
configure:17360: checking for strcasecmp
configure:17360: mips64el-linux-gnuabi64-gcc -o conftest -g -O2 -Werror=implicit-function-declaration -ffile-prefix-map=/<<PKGBUILDDIR>>=. -fstack-protector-strong -Wformat -Werror=format-security -funsigned-char -fdiagnostics-color -Wdate-time -D_FORTIFY_SOURCE=2 -Wl,-z,relro -Wl,-z,now conftest.c  >&5
conftest.c:117:6: warning: conflicting types for built-in function 'strcasecmp'; expected 'int(const char *, const char *)' [-Wbuiltin-declaration-mismatch]
  117 | char strcasecmp (void);
      |      ^~~~~~~~~~
configure:17360: $? = 0
configure:17360: result: yes
configure:17366: checking for strchr
configure:17366: mips64el-linux-gnuabi64-gcc -o conftest -g -O2 -Werror=implicit-function-declaration -ffile-prefix-map=/<<PKGBUILDDIR>>=. -fstack-protector-strong -Wformat -Werror=format-security -funsigned-char -fdiagnostics-color -Wdate-time -D_FORTIFY_SOURCE=2 -Wl,-z,relro -Wl,-z,now conftest.c  >&5
conftest.c:118:6: warning: conflicting types for built-in function 'strchr'; expected 'char *(const char *, int)' [-Wbuiltin-declaration-mismatch]
  118 | char strchr (void);
      |      ^~~~~~
conftest.c:110:1: note: 'strchr' is declared in header '<string.h>'
  109 | #include <limits.h>
  110 | #undef strchr
configure:17366: $? = 0
configure:17366: result: yes
configure:17372: checking for strdup
configure:17372: mips64el-linux-gnuabi64-gcc -o conftest -g -O2 -Werror=implicit-function-declaration -ffile-prefix-map=/<<PKGBUILDDIR>>=. -fstack-protector-strong -Wformat -Werror=format-security -funsigned-char -fdiagnostics-color -Wdate-time -D_FORTIFY_SOURCE=2 -Wl,-z,relro -Wl,-z,now conftest.c  >&5
conftest.c:119:6: warning: conflicting types for built-in function 'strdup'; expected 'char *(const char *)' [-Wbuiltin-declaration-mismatch]
  119 | char strdup (void);
      |      ^~~~~~
configure:17372: $? = 0
configure:17372: result: yes
configure:17378: checking for strerror
configure:17378: mips64el-linux-gnuabi64-gcc -o conftest -g -O2 -Werror=implicit-function-declaration -ffile-prefix-map=/<<PKGBUILDDIR>>=. -fstack-protector-strong -Wformat -Werror=format-security -funsigned-char -fdiagnostics-color -Wdate-time -D_FORTIFY_SOURCE=2 -Wl,-z,relro -Wl,-z,now conftest.c  >&5
configure:17378: $? = 0
configure:17378: result: yes
configure:17384: checking for stricmp
configure:17384: mips64el-linux-gnuabi64-gcc -o conftest -g -O2 -Werror=implicit-function-declaration -ffile-prefix-map=/<<PKGBUILDDIR>>=. -fstack-protector-strong -Wformat -Werror=format-security -funsigned-char -fdiagnostics-color -Wdate-time -D_FORTIFY_SOURCE=2 -Wl,-z,relro -Wl,-z,now conftest.c  >&5
/usr/lib/gcc-cross/mips64el-linux-gnuabi64/14/../../../../mips64el-linux-gnuabi64/bin/ld: /tmp/ccrUag7A.o: in function `main':
./conftest.c:132:(.text.startup+0x14): undefined reference to `stricmp'
/usr/lib/gcc-cross/mips64el-linux-gnuabi64/14/../../../../mips64el-linux-gnuabi64/bin/ld: ./conftest.c:132:(.text.startup+0x1c): undefined reference to `stricmp'
collect2: error: ld returned 1 exit status
configure:17384: $? = 1
configure: failed program was:
| /* confdefs.h */
| #define PACKAGE_NAME "jabberd2"
| #define PACKAGE_TARNAME "jabberd2"
| #define PACKAGE_VERSION "2.7.0"
| #define PACKAGE_STRING "jabberd2 2.7.0"
| #define PACKAGE_BUGREPORT "jabberd2@lists.xiaoka.com"
| #define PACKAGE_URL ""
| #define PACKAGE "jabberd2"
| #define VERSION "2.7.0"
| #define HAVE_STDIO_H 1
| #define HAVE_STDLIB_H 1
| #define HAVE_STRING_H 1
| #define HAVE_INTTYPES_H 1
| #define HAVE_STDINT_H 1
| #define HAVE_STRINGS_H 1
| #define HAVE_SYS_STAT_H 1
| #define HAVE_SYS_TYPES_H 1
| #define HAVE_UNISTD_H 1
| #define HAVE_SYS_TIME_H 1
| #define HAVE_SYS_SELECT_H 1
| #define HAVE_SYS_SOCKET_H 1
| #define STDC_HEADERS 1
| #define HAVE_DLFCN_H 1
| #define LT_OBJDIR ".libs/"
| #define HAVE_DIRENT_H 1
| #define HAVE_SYS_TYPES_H 1
| #define HAVE_NETINET_IN_H 1
| #define HAVE_ARPA_NAMESER_H 1
| #define HAVE_NETDB_H 1
| #define HAVE_RESOLV_H 1
| #define HAVE_SYS_WAIT_H 1
| #define TIME_WITH_SYS_TIME 1
| #define HAVE_ARPA_INET_H 1
| #define HAVE_ARPA_NAMESER_H 1
| #define HAVE_FCNTL_H 1
| #define HAVE_NETINET_IN_H 1
| #define HAVE_SIGNAL_H 1
| #define HAVE_STDARG_H 1
| #define HAVE_STDINT_H 1
| #define HAVE_STDLIB_H 1
| #define HAVE_STRING_H 1
| #define HAVE_SYS_IOCTL_H 1
| #define HAVE_SYS_SOCKET_H 1
| #define HAVE_SYS_TIME_H 1
| #define HAVE_SYS_TIMEB_H 1
| #define HAVE_SYS_TYPES_H 1
| #define HAVE_SYS_STAT_H 1
| #define HAVE_SYS_UTSNAME_H 1
| #define HAVE_SYSLOG_H 1
| #define HAVE_UNISTD_H 1
| #define HAVE_RESOLV_H 1
| #define TIME_WITH_SYS_TIME 1
| #define HAVE_STRUCT_TM_TM_ZONE 1
| #define HAVE_TM_ZONE 1
| #define HAVE_ALLOCA_H 1
| #define HAVE_ALLOCA 1
| #define HAVE_MBSTATE_T 1
| #define HAVE_DECL_GETENV 1
| #define HAVE_BTOWC 1
| #define HAVE_MBSRTOWCS 1
| #define HAVE_MEMPCPY 1
| #define HAVE_WMEMPCPY 1
| #define HAVE_FORK 1
| #define HAVE_VFORK 1
| #define HAVE_ALARM 1
| #define HAVE_VPRINTF 1
| #define fnmatch rpl_fnmatch
| #define HAVE_WORKING_VFORK 1
| #define HAVE_WORKING_FORK 1
| #define SELECT_TYPE_ARG1 int
| #define SELECT_TYPE_ARG234 (fd_set *)
| #define SELECT_TYPE_ARG5 (struct timeval *)
| #define RETSIGTYPE void
| #define LSTAT_FOLLOWS_SLASHED_SYMLINK 1
| #define HAVE_STAT_EMPTY_STRING_BUG 1
| #define SELECT_TYPE_ARG1 int
| #define SELECT_TYPE_ARG234 (fd_set *)
| #define SELECT_TYPE_ARG5 (struct timeval *)
| #define HAVE_CLOSE 1
| #define HAVE_DUP2 1
| #define HAVE_FCNTL 1
| #define HAVE_GETHOSTNAME 1
| #define HAVE_GETOPT 1
| #define HAVE_GETPAGESIZE 1
| #define HAVE_GETPID 1
| #define HAVE_GETTIMEOFDAY 1
| #define HAVE_INET_ATON 1
| #define HAVE_INET_NTOA 1
| #define HAVE_IOCTL 1
| #define HAVE_ISASCII 1
| #define HAVE_MEMCHR 1
| #define HAVE_MEMMOVE 1
| #define HAVE_MEMSET 1
| #define HAVE_MKDIR 1
| #define HAVE_MODF 1
| #define HAVE_SELECT 1
| #define HAVE_SETENV 1
| #define HAVE_SLEEP 1
| #define HAVE_SOCKET 1
| #define HAVE_STRCASECMP 1
| #define HAVE_STRCHR 1
| #define HAVE_STRDUP 1
| #define HAVE_STRERROR 1
| /* end confdefs.h.  */
| /* Define stricmp to an innocuous variant, in case <limits.h> declares stricmp.
|    For example, HP-UX 11i <limits.h> declares gettimeofday.  */
| #define stricmp innocuous_stricmp
| 
| /* System header to define __stub macros and hopefully few prototypes,
|    which can conflict with char stricmp (void); below.  */
| 
| #include <limits.h>
| #undef stricmp
| 
| /* Override any GCC internal prototype to avoid an error.
|    Use char because int might match the return type of a GCC
|    builtin and then its argument prototype would still apply.  */
| #ifdef __cplusplus
| extern "C"
| #endif
| char stricmp (void);
| /* The GNU C library defines this for functions which it implements
|     to always fail with ENOSYS.  Some functions are actually named
|     something starting with __ and the normal name is an alias.  */
| #if defined __stub_stricmp || defined __stub___stricmp
| choke me
| #endif
| 
| int
| main (void)
| {
| return stricmp ();
|   ;
|   return 0;
| }
configure:17384: result: no
configure:17390: checking for strncasecmp
configure:17390: mips64el-linux-gnuabi64-gcc -o conftest -g -O2 -Werror=implicit-function-declaration -ffile-prefix-map=/<<PKGBUILDDIR>>=. -fstack-protector-strong -Wformat -Werror=format-security -funsigned-char -fdiagnostics-color -Wdate-time -D_FORTIFY_SOURCE=2 -Wl,-z,relro -Wl,-z,now conftest.c  >&5
conftest.c:121:6: warning: conflicting types for built-in function 'strncasecmp'; expected 'int(const char *, const char *, long unsigned int)' [-Wbuiltin-declaration-mismatch]
  121 | char strncasecmp (void);
      |      ^~~~~~~~~~~
configure:17390: $? = 0
configure:17390: result: yes
configure:17396: checking for strndup
configure:17396: mips64el-linux-gnuabi64-gcc -o conftest -g -O2 -Werror=implicit-function-declaration -ffile-prefix-map=/<<PKGBUILDDIR>>=. -fstack-protector-strong -Wformat -Werror=format-security -funsigned-char -fdiagnostics-color -Wdate-time -D_FORTIFY_SOURCE=2 -Wl,-z,relro -Wl,-z,now conftest.c  >&5
conftest.c:122:6: warning: conflicting types for built-in function 'strndup'; expected 'char *(const char *, long unsigned int)' [-Wbuiltin-declaration-mismatch]
  122 | char strndup (void);
      |      ^~~~~~~
configure:17396: $? = 0
configure:17396: result: yes
configure:17402: checking for strnicmp
configure:17402: mips64el-linux-gnuabi64-gcc -o conftest -g -O2 -Werror=implicit-function-declaration -ffile-prefix-map=/<<PKGBUILDDIR>>=. -fstack-protector-strong -Wformat -Werror=format-security -funsigned-char -fdiagnostics-color -Wdate-time -D_FORTIFY_SOURCE=2 -Wl,-z,relro -Wl,-z,now conftest.c  >&5
/usr/lib/gcc-cross/mips64el-linux-gnuabi64/14/../../../../mips64el-linux-gnuabi64/bin/ld: /tmp/ccmuVxYu.o: in function `main':
./conftest.c:134:(.text.startup+0x14): undefined reference to `strnicmp'
/usr/lib/gcc-cross/mips64el-linux-gnuabi64/14/../../../../mips64el-linux-gnuabi64/bin/ld: ./conftest.c:134:(.text.startup+0x1c): undefined reference to `strnicmp'
collect2: error: ld returned 1 exit status
configure:17402: $? = 1
configure: failed program was:
| /* confdefs.h */
| #define PACKAGE_NAME "jabberd2"
| #define PACKAGE_TARNAME "jabberd2"
| #define PACKAGE_VERSION "2.7.0"
| #define PACKAGE_STRING "jabberd2 2.7.0"
| #define PACKAGE_BUGREPORT "jabberd2@lists.xiaoka.com"
| #define PACKAGE_URL ""
| #define PACKAGE "jabberd2"
| #define VERSION "2.7.0"
| #define HAVE_STDIO_H 1
| #define HAVE_STDLIB_H 1
| #define HAVE_STRING_H 1
| #define HAVE_INTTYPES_H 1
| #define HAVE_STDINT_H 1
| #define HAVE_STRINGS_H 1
| #define HAVE_SYS_STAT_H 1
| #define HAVE_SYS_TYPES_H 1
| #define HAVE_UNISTD_H 1
| #define HAVE_SYS_TIME_H 1
| #define HAVE_SYS_SELECT_H 1
| #define HAVE_SYS_SOCKET_H 1
| #define STDC_HEADERS 1
| #define HAVE_DLFCN_H 1
| #define LT_OBJDIR ".libs/"
| #define HAVE_DIRENT_H 1
| #define HAVE_SYS_TYPES_H 1
| #define HAVE_NETINET_IN_H 1
| #define HAVE_ARPA_NAMESER_H 1
| #define HAVE_NETDB_H 1
| #define HAVE_RESOLV_H 1
| #define HAVE_SYS_WAIT_H 1
| #define TIME_WITH_SYS_TIME 1
| #define HAVE_ARPA_INET_H 1
| #define HAVE_ARPA_NAMESER_H 1
| #define HAVE_FCNTL_H 1
| #define HAVE_NETINET_IN_H 1
| #define HAVE_SIGNAL_H 1
| #define HAVE_STDARG_H 1
| #define HAVE_STDINT_H 1
| #define HAVE_STDLIB_H 1
| #define HAVE_STRING_H 1
| #define HAVE_SYS_IOCTL_H 1
| #define HAVE_SYS_SOCKET_H 1
| #define HAVE_SYS_TIME_H 1
| #define HAVE_SYS_TIMEB_H 1
| #define HAVE_SYS_TYPES_H 1
| #define HAVE_SYS_STAT_H 1
| #define HAVE_SYS_UTSNAME_H 1
| #define HAVE_SYSLOG_H 1
| #define HAVE_UNISTD_H 1
| #define HAVE_RESOLV_H 1
| #define TIME_WITH_SYS_TIME 1
| #define HAVE_STRUCT_TM_TM_ZONE 1
| #define HAVE_TM_ZONE 1
| #define HAVE_ALLOCA_H 1
| #define HAVE_ALLOCA 1
| #define HAVE_MBSTATE_T 1
| #define HAVE_DECL_GETENV 1
| #define HAVE_BTOWC 1
| #define HAVE_MBSRTOWCS 1
| #define HAVE_MEMPCPY 1
| #define HAVE_WMEMPCPY 1
| #define HAVE_FORK 1
| #define HAVE_VFORK 1
| #define HAVE_ALARM 1
| #define HAVE_VPRINTF 1
| #define fnmatch rpl_fnmatch
| #define HAVE_WORKING_VFORK 1
| #define HAVE_WORKING_FORK 1
| #define SELECT_TYPE_ARG1 int
| #define SELECT_TYPE_ARG234 (fd_set *)
| #define SELECT_TYPE_ARG5 (struct timeval *)
| #define RETSIGTYPE void
| #define LSTAT_FOLLOWS_SLASHED_SYMLINK 1
| #define HAVE_STAT_EMPTY_STRING_BUG 1
| #define SELECT_TYPE_ARG1 int
| #define SELECT_TYPE_ARG234 (fd_set *)
| #define SELECT_TYPE_ARG5 (struct timeval *)
| #define HAVE_CLOSE 1
| #define HAVE_DUP2 1
| #define HAVE_FCNTL 1
| #define HAVE_GETHOSTNAME 1
| #define HAVE_GETOPT 1
| #define HAVE_GETPAGESIZE 1
| #define HAVE_GETPID 1
| #define HAVE_GETTIMEOFDAY 1
| #define HAVE_INET_ATON 1
| #define HAVE_INET_NTOA 1
| #define HAVE_IOCTL 1
| #define HAVE_ISASCII 1
| #define HAVE_MEMCHR 1
| #define HAVE_MEMMOVE 1
| #define HAVE_MEMSET 1
| #define HAVE_MKDIR 1
| #define HAVE_MODF 1
| #define HAVE_SELECT 1
| #define HAVE_SETENV 1
| #define HAVE_SLEEP 1
| #define HAVE_SOCKET 1
| #define HAVE_STRCASECMP 1
| #define HAVE_STRCHR 1
| #define HAVE_STRDUP 1
| #define HAVE_STRERROR 1
| #define HAVE_STRNCASECMP 1
| #define HAVE_STRNDUP 1
| /* end confdefs.h.  */
| /* Define strnicmp to an innocuous variant, in case <limits.h> declares strnicmp.
|    For example, HP-UX 11i <limits.h> declares gettimeofday.  */
| #define strnicmp innocuous_strnicmp
| 
| /* System header to define __stub macros and hopefully few prototypes,
|    which can conflict with char strnicmp (void); below.  */
| 
| #include <limits.h>
| #undef strnicmp
| 
| /* Override any GCC internal prototype to avoid an error.
|    Use char because int might match the return type of a GCC
|    builtin and then its argument prototype would still apply.  */
| #ifdef __cplusplus
| extern "C"
| #endif
| char strnicmp (void);
| /* The GNU C library defines this for functions which it implements
|     to always fail with ENOSYS.  Some functions are actually named
|     something starting with __ and the normal name is an alias.  */
| #if defined __stub_strnicmp || defined __stub___strnicmp
| choke me
| #endif
| 
| int
| main (void)
| {
| return strnicmp ();
|   ;
|   return 0;
| }
configure:17402: result: no
configure:17408: checking for strstr
configure:17408: mips64el-linux-gnuabi64-gcc -o conftest -g -O2 -Werror=implicit-function-declaration -ffile-prefix-map=/<<PKGBUILDDIR>>=. -fstack-protector-strong -Wformat -Werror=format-security -funsigned-char -fdiagnostics-color -Wdate-time -D_FORTIFY_SOURCE=2 -Wl,-z,relro -Wl,-z,now conftest.c  >&5
conftest.c:123:6: warning: conflicting types for built-in function 'strstr'; expected 'char *(const char *, const char *)' [-Wbuiltin-declaration-mismatch]
  123 | char strstr (void);
      |      ^~~~~~
conftest.c:115:1: note: 'strstr' is declared in header '<string.h>'
  114 | #include <limits.h>
  115 | #undef strstr
configure:17408: $? = 0
configure:17408: result: yes
configure:17414: checking for tzset
configure:17414: mips64el-linux-gnuabi64-gcc -o conftest -g -O2 -Werror=implicit-function-declaration -ffile-prefix-map=/<<PKGBUILDDIR>>=. -fstack-protector-strong -Wformat -Werror=format-security -funsigned-char -fdiagnostics-color -Wdate-time -D_FORTIFY_SOURCE=2 -Wl,-z,relro -Wl,-z,now conftest.c  >&5
configure:17414: $? = 0
configure:17414: result: yes
configure:17420: checking for uname
configure:17420: mips64el-linux-gnuabi64-gcc -o conftest -g -O2 -Werror=implicit-function-declaration -ffile-prefix-map=/<<PKGBUILDDIR>>=. -fstack-protector-strong -Wformat -Werror=format-security -funsigned-char -fdiagnostics-color -Wdate-time -D_FORTIFY_SOURCE=2 -Wl,-z,relro -Wl,-z,now conftest.c  >&5
configure:17420: $? = 0
configure:17420: result: yes
configure:17428: checking for crypt
configure:17428: mips64el-linux-gnuabi64-gcc -o conftest -g -O2 -Werror=implicit-function-declaration -ffile-prefix-map=/<<PKGBUILDDIR>>=. -fstack-protector-strong -Wformat -Werror=format-security -funsigned-char -fdiagnostics-color -Wdate-time -D_FORTIFY_SOURCE=2 -Wl,-z,relro -Wl,-z,now conftest.c  >&5
/usr/lib/gcc-cross/mips64el-linux-gnuabi64/14/../../../../mips64el-linux-gnuabi64/bin/ld: /tmp/ccw7pq34.o: in function `main':
./conftest.c:137:(.text.startup+0x14): undefined reference to `crypt'
/usr/lib/gcc-cross/mips64el-linux-gnuabi64/14/../../../../mips64el-linux-gnuabi64/bin/ld: ./conftest.c:137:(.text.startup+0x1c): undefined reference to `crypt'
collect2: error: ld returned 1 exit status
configure:17428: $? = 1
configure: failed program was:
| /* confdefs.h */
| #define PACKAGE_NAME "jabberd2"
| #define PACKAGE_TARNAME "jabberd2"
| #define PACKAGE_VERSION "2.7.0"
| #define PACKAGE_STRING "jabberd2 2.7.0"
| #define PACKAGE_BUGREPORT "jabberd2@lists.xiaoka.com"
| #define PACKAGE_URL ""
| #define PACKAGE "jabberd2"
| #define VERSION "2.7.0"
| #define HAVE_STDIO_H 1
| #define HAVE_STDLIB_H 1
| #define HAVE_STRING_H 1
| #define HAVE_INTTYPES_H 1
| #define HAVE_STDINT_H 1
| #define HAVE_STRINGS_H 1
| #define HAVE_SYS_STAT_H 1
| #define HAVE_SYS_TYPES_H 1
| #define HAVE_UNISTD_H 1
| #define HAVE_SYS_TIME_H 1
| #define HAVE_SYS_SELECT_H 1
| #define HAVE_SYS_SOCKET_H 1
| #define STDC_HEADERS 1
| #define HAVE_DLFCN_H 1
| #define LT_OBJDIR ".libs/"
| #define HAVE_DIRENT_H 1
| #define HAVE_SYS_TYPES_H 1
| #define HAVE_NETINET_IN_H 1
| #define HAVE_ARPA_NAMESER_H 1
| #define HAVE_NETDB_H 1
| #define HAVE_RESOLV_H 1
| #define HAVE_SYS_WAIT_H 1
| #define TIME_WITH_SYS_TIME 1
| #define HAVE_ARPA_INET_H 1
| #define HAVE_ARPA_NAMESER_H 1
| #define HAVE_FCNTL_H 1
| #define HAVE_NETINET_IN_H 1
| #define HAVE_SIGNAL_H 1
| #define HAVE_STDARG_H 1
| #define HAVE_STDINT_H 1
| #define HAVE_STDLIB_H 1
| #define HAVE_STRING_H 1
| #define HAVE_SYS_IOCTL_H 1
| #define HAVE_SYS_SOCKET_H 1
| #define HAVE_SYS_TIME_H 1
| #define HAVE_SYS_TIMEB_H 1
| #define HAVE_SYS_TYPES_H 1
| #define HAVE_SYS_STAT_H 1
| #define HAVE_SYS_UTSNAME_H 1
| #define HAVE_SYSLOG_H 1
| #define HAVE_UNISTD_H 1
| #define HAVE_RESOLV_H 1
| #define TIME_WITH_SYS_TIME 1
| #define HAVE_STRUCT_TM_TM_ZONE 1
| #define HAVE_TM_ZONE 1
| #define HAVE_ALLOCA_H 1
| #define HAVE_ALLOCA 1
| #define HAVE_MBSTATE_T 1
| #define HAVE_DECL_GETENV 1
| #define HAVE_BTOWC 1
| #define HAVE_MBSRTOWCS 1
| #define HAVE_MEMPCPY 1
| #define HAVE_WMEMPCPY 1
| #define HAVE_FORK 1
| #define HAVE_VFORK 1
| #define HAVE_ALARM 1
| #define HAVE_VPRINTF 1
| #define fnmatch rpl_fnmatch
| #define HAVE_WORKING_VFORK 1
| #define HAVE_WORKING_FORK 1
| #define SELECT_TYPE_ARG1 int
| #define SELECT_TYPE_ARG234 (fd_set *)
| #define SELECT_TYPE_ARG5 (struct timeval *)
| #define RETSIGTYPE void
| #define LSTAT_FOLLOWS_SLASHED_SYMLINK 1
| #define HAVE_STAT_EMPTY_STRING_BUG 1
| #define SELECT_TYPE_ARG1 int
| #define SELECT_TYPE_ARG234 (fd_set *)
| #define SELECT_TYPE_ARG5 (struct timeval *)
| #define HAVE_CLOSE 1
| #define HAVE_DUP2 1
| #define HAVE_FCNTL 1
| #define HAVE_GETHOSTNAME 1
| #define HAVE_GETOPT 1
| #define HAVE_GETPAGESIZE 1
| #define HAVE_GETPID 1
| #define HAVE_GETTIMEOFDAY 1
| #define HAVE_INET_ATON 1
| #define HAVE_INET_NTOA 1
| #define HAVE_IOCTL 1
| #define HAVE_ISASCII 1
| #define HAVE_MEMCHR 1
| #define HAVE_MEMMOVE 1
| #define HAVE_MEMSET 1
| #define HAVE_MKDIR 1
| #define HAVE_MODF 1
| #define HAVE_SELECT 1
| #define HAVE_SETENV 1
| #define HAVE_SLEEP 1
| #define HAVE_SOCKET 1
| #define HAVE_STRCASECMP 1
| #define HAVE_STRCHR 1
| #define HAVE_STRDUP 1
| #define HAVE_STRERROR 1
| #define HAVE_STRNCASECMP 1
| #define HAVE_STRNDUP 1
| #define HAVE_STRSTR 1
| #define HAVE_TZSET 1
| #define HAVE_UNAME 1
| /* end confdefs.h.  */
| /* Define crypt to an innocuous variant, in case <limits.h> declares crypt.
|    For example, HP-UX 11i <limits.h> declares gettimeofday.  */
| #define crypt innocuous_crypt
| 
| /* System header to define __stub macros and hopefully few prototypes,
|    which can conflict with char crypt (void); below.  */
| 
| #include <limits.h>
| #undef crypt
| 
| /* Override any GCC internal prototype to avoid an error.
|    Use char because int might match the return type of a GCC
|    builtin and then its argument prototype would still apply.  */
| #ifdef __cplusplus
| extern "C"
| #endif
| char crypt (void);
| /* The GNU C library defines this for functions which it implements
|     to always fail with ENOSYS.  Some functions are actually named
|     something starting with __ and the normal name is an alias.  */
| #if defined __stub_crypt || defined __stub___crypt
| choke me
| #endif
| 
| int
| main (void)
| {
| return crypt ();
|   ;
|   return 0;
| }
configure:17428: result: no
configure:17433: checking for crypt in -lcrypt
configure:17462: mips64el-linux-gnuabi64-gcc -o conftest -g -O2 -Werror=implicit-function-declaration -ffile-prefix-map=/<<PKGBUILDDIR>>=. -fstack-protector-strong -Wformat -Werror=format-security -funsigned-char -fdiagnostics-color -Wdate-time -D_FORTIFY_SOURCE=2 -Wl,-z,relro -Wl,-z,now conftest.c -lcrypt   >&5
configure:17462: $? = 0
configure:17474: result: yes
configure:17500: checking for connect
configure:17500: mips64el-linux-gnuabi64-gcc -o conftest -g -O2 -Werror=implicit-function-declaration -ffile-prefix-map=/<<PKGBUILDDIR>>=. -fstack-protector-strong -Wformat -Werror=format-security -funsigned-char -fdiagnostics-color -Wdate-time -D_FORTIFY_SOURCE=2 -Wl,-z,relro -Wl,-z,now conftest.c -lcrypt  >&5
configure:17500: $? = 0
configure:17500: result: yes
configure:17559: checking for _head_libws2_32_a in -lws2_32
configure:17588: mips64el-linux-gnuabi64-gcc -o conftest -g -O2 -Werror=implicit-function-declaration -ffile-prefix-map=/<<PKGBUILDDIR>>=. -fstack-protector-strong -Wformat -Werror=format-security -funsigned-char -fdiagnostics-color -Wdate-time -D_FORTIFY_SOURCE=2 -Wl,-z,relro -Wl,-z,now conftest.c -lws2_32  -lcrypt  >&5
/usr/lib/gcc-cross/mips64el-linux-gnuabi64/14/../../../../mips64el-linux-gnuabi64/bin/ld: cannot find -lws2_32: No such file or directory
collect2: error: ld returned 1 exit status
configure:17588: $? = 1
configure: failed program was:
| /* confdefs.h */
| #define PACKAGE_NAME "jabberd2"
| #define PACKAGE_TARNAME "jabberd2"
| #define PACKAGE_VERSION "2.7.0"
| #define PACKAGE_STRING "jabberd2 2.7.0"
| #define PACKAGE_BUGREPORT "jabberd2@lists.xiaoka.com"
| #define PACKAGE_URL ""
| #define PACKAGE "jabberd2"
| #define VERSION "2.7.0"
| #define HAVE_STDIO_H 1
| #define HAVE_STDLIB_H 1
| #define HAVE_STRING_H 1
| #define HAVE_INTTYPES_H 1
| #define HAVE_STDINT_H 1
| #define HAVE_STRINGS_H 1
| #define HAVE_SYS_STAT_H 1
| #define HAVE_SYS_TYPES_H 1
| #define HAVE_UNISTD_H 1
| #define HAVE_SYS_TIME_H 1
| #define HAVE_SYS_SELECT_H 1
| #define HAVE_SYS_SOCKET_H 1
| #define STDC_HEADERS 1
| #define HAVE_DLFCN_H 1
| #define LT_OBJDIR ".libs/"
| #define HAVE_DIRENT_H 1
| #define HAVE_SYS_TYPES_H 1
| #define HAVE_NETINET_IN_H 1
| #define HAVE_ARPA_NAMESER_H 1
| #define HAVE_NETDB_H 1
| #define HAVE_RESOLV_H 1
| #define HAVE_SYS_WAIT_H 1
| #define TIME_WITH_SYS_TIME 1
| #define HAVE_ARPA_INET_H 1
| #define HAVE_ARPA_NAMESER_H 1
| #define HAVE_FCNTL_H 1
| #define HAVE_NETINET_IN_H 1
| #define HAVE_SIGNAL_H 1
| #define HAVE_STDARG_H 1
| #define HAVE_STDINT_H 1
| #define HAVE_STDLIB_H 1
| #define HAVE_STRING_H 1
| #define HAVE_SYS_IOCTL_H 1
| #define HAVE_SYS_SOCKET_H 1
| #define HAVE_SYS_TIME_H 1
| #define HAVE_SYS_TIMEB_H 1
| #define HAVE_SYS_TYPES_H 1
| #define HAVE_SYS_STAT_H 1
| #define HAVE_SYS_UTSNAME_H 1
| #define HAVE_SYSLOG_H 1
| #define HAVE_UNISTD_H 1
| #define HAVE_RESOLV_H 1
| #define TIME_WITH_SYS_TIME 1
| #define HAVE_STRUCT_TM_TM_ZONE 1
| #define HAVE_TM_ZONE 1
| #define HAVE_ALLOCA_H 1
| #define HAVE_ALLOCA 1
| #define HAVE_MBSTATE_T 1
| #define HAVE_DECL_GETENV 1
| #define HAVE_BTOWC 1
| #define HAVE_MBSRTOWCS 1
| #define HAVE_MEMPCPY 1
| #define HAVE_WMEMPCPY 1
| #define HAVE_FORK 1
| #define HAVE_VFORK 1
| #define HAVE_ALARM 1
| #define HAVE_VPRINTF 1
| #define fnmatch rpl_fnmatch
| #define HAVE_WORKING_VFORK 1
| #define HAVE_WORKING_FORK 1
| #define SELECT_TYPE_ARG1 int
| #define SELECT_TYPE_ARG234 (fd_set *)
| #define SELECT_TYPE_ARG5 (struct timeval *)
| #define RETSIGTYPE void
| #define LSTAT_FOLLOWS_SLASHED_SYMLINK 1
| #define HAVE_STAT_EMPTY_STRING_BUG 1
| #define SELECT_TYPE_ARG1 int
| #define SELECT_TYPE_ARG234 (fd_set *)
| #define SELECT_TYPE_ARG5 (struct timeval *)
| #define HAVE_CLOSE 1
| #define HAVE_DUP2 1
| #define HAVE_FCNTL 1
| #define HAVE_GETHOSTNAME 1
| #define HAVE_GETOPT 1
| #define HAVE_GETPAGESIZE 1
| #define HAVE_GETPID 1
| #define HAVE_GETTIMEOFDAY 1
| #define HAVE_INET_ATON 1
| #define HAVE_INET_NTOA 1
| #define HAVE_IOCTL 1
| #define HAVE_ISASCII 1
| #define HAVE_MEMCHR 1
| #define HAVE_MEMMOVE 1
| #define HAVE_MEMSET 1
| #define HAVE_MKDIR 1
| #define HAVE_MODF 1
| #define HAVE_SELECT 1
| #define HAVE_SETENV 1
| #define HAVE_SLEEP 1
| #define HAVE_SOCKET 1
| #define HAVE_STRCASECMP 1
| #define HAVE_STRCHR 1
| #define HAVE_STRDUP 1
| #define HAVE_STRERROR 1
| #define HAVE_STRNCASECMP 1
| #define HAVE_STRNDUP 1
| #define HAVE_STRSTR 1
| #define HAVE_TZSET 1
| #define HAVE_UNAME 1
| #define HAVE_LIBCRYPT 1
| #define HAVE_CRYPT 1
| /* end confdefs.h.  */
| 
| /* Override any GCC internal prototype to avoid an error.
|    Use char because int might match the return type of a GCC
|    builtin and then its argument prototype would still apply.
|    The 'extern "C"' is for builds by C++ compilers;
|    although this is not generally supported in C code supporting it here
|    has little cost and some practical benefit (sr 110532).  */
| #ifdef __cplusplus
| extern "C"
| #endif
| char _head_libws2_32_a (void);
| int
| main (void)
| {
| return _head_libws2_32_a ();
|   ;
|   return 0;
| }
configure:17600: result: no
configure:17611: checking for gethostbyname
configure:17611: mips64el-linux-gnuabi64-gcc -o conftest -g -O2 -Werror=implicit-function-declaration -ffile-prefix-map=/<<PKGBUILDDIR>>=. -fstack-protector-strong -Wformat -Werror=format-security -funsigned-char -fdiagnostics-color -Wdate-time -D_FORTIFY_SOURCE=2 -Wl,-z,relro -Wl,-z,now conftest.c -lcrypt  >&5
configure:17611: $? = 0
configure:17611: result: yes
configure:17670: checking for gethostbyname
configure:17670: result: yes
configure:17824: checking for library containing inet_ntop
configure:17860: mips64el-linux-gnuabi64-gcc -o conftest -g -O2 -Werror=implicit-function-declaration -ffile-prefix-map=/<<PKGBUILDDIR>>=. -fstack-protector-strong -Wformat -Werror=format-security -funsigned-char -fdiagnostics-color -Wdate-time -D_FORTIFY_SOURCE=2 -Wl,-z,relro -Wl,-z,now conftest.c -lcrypt  >&5
configure:17860: $? = 0
configure:17882: result: none required
configure:17895: checking for library containing inet_pton
configure:17931: mips64el-linux-gnuabi64-gcc -o conftest -g -O2 -Werror=implicit-function-declaration -ffile-prefix-map=/<<PKGBUILDDIR>>=. -fstack-protector-strong -Wformat -Werror=format-security -funsigned-char -fdiagnostics-color -Wdate-time -D_FORTIFY_SOURCE=2 -Wl,-z,relro -Wl,-z,now conftest.c -lcrypt  >&5
configure:17931: $? = 0
configure:17953: result: none required
configure:18060: checking for res_query
configure:18060: mips64el-linux-gnuabi64-gcc -o conftest -g -O2 -Werror=implicit-function-declaration -ffile-prefix-map=/<<PKGBUILDDIR>>=. -fstack-protector-strong -Wformat -Werror=format-security -funsigned-char -fdiagnostics-color -Wdate-time -D_FORTIFY_SOURCE=2 -Wl,-z,relro -Wl,-z,now conftest.c -lcrypt  >&5
configure:18060: $? = 0
configure:18060: result: yes
configure:18256: checking for syslog
configure:18256: mips64el-linux-gnuabi64-gcc -o conftest -g -O2 -Werror=implicit-function-declaration -ffile-prefix-map=/<<PKGBUILDDIR>>=. -fstack-protector-strong -Wformat -Werror=format-security -funsigned-char -fdiagnostics-color -Wdate-time -D_FORTIFY_SOURCE=2 -Wl,-z,relro -Wl,-z,now conftest.c -lcrypt  >&5
configure:18256: $? = 0
configure:18256: result: yes
configure:18262: checking for vsyslog
configure:18262: mips64el-linux-gnuabi64-gcc -o conftest -g -O2 -Werror=implicit-function-declaration -ffile-prefix-map=/<<PKGBUILDDIR>>=. -fstack-protector-strong -Wformat -Werror=format-security -funsigned-char -fdiagnostics-color -Wdate-time -D_FORTIFY_SOURCE=2 -Wl,-z,relro -Wl,-z,now conftest.c -lcrypt  >&5
configure:18262: $? = 0
configure:18262: result: yes
configure:18303: checking for snprintf
configure:18303: mips64el-linux-gnuabi64-gcc -o conftest -g -O2 -Werror=implicit-function-declaration -ffile-prefix-map=/<<PKGBUILDDIR>>=. -fstack-protector-strong -Wformat -Werror=format-security -funsigned-char -fdiagnostics-color -Wdate-time -D_FORTIFY_SOURCE=2 -Wl,-z,relro -Wl,-z,now conftest.c -lcrypt  >&5
conftest.c:134:6: warning: conflicting types for built-in function 'snprintf'; expected 'int(char *, long unsigned int,  const char *, ...)' [-Wbuiltin-declaration-mismatch]
  134 | char snprintf (void);
      |      ^~~~~~~~
conftest.c:126:1: note: 'snprintf' is declared in header '<stdio.h>'
  125 | #include <limits.h>
  126 | #undef snprintf
configure:18303: $? = 0
configure:18303: result: yes
configure:18309: checking for vsnprintf
configure:18309: mips64el-linux-gnuabi64-gcc -o conftest -g -O2 -Werror=implicit-function-declaration -ffile-prefix-map=/<<PKGBUILDDIR>>=. -fstack-protector-strong -Wformat -Werror=format-security -funsigned-char -fdiagnostics-color -Wdate-time -D_FORTIFY_SOURCE=2 -Wl,-z,relro -Wl,-z,now conftest.c -lcrypt  >&5
conftest.c:135:6: warning: conflicting types for built-in function 'vsnprintf'; expected 'int(char *, long unsigned int,  const char *, void *)' [-Wbuiltin-declaration-mismatch]
  135 | char vsnprintf (void);
      |      ^~~~~~~~~
conftest.c:127:1: note: 'vsnprintf' is declared in header '<stdio.h>'
  126 | #include <limits.h>
  127 | #undef vsnprintf
configure:18309: $? = 0
configure:18309: result: yes
configure:18317: checking if snprintf can handle NULL arguments
configure:18321: error: in '/<<PKGBUILDDIR>>':
configure:18323: error: cannot run test program while cross compiling
See 'config.log' for more details

## ---------------- ##
## Cache variables. ##
## ---------------- ##

ac_cv_build=x86_64-pc-linux-gnu
ac_cv_c_compiler_gnu=yes
ac_cv_c_const=yes
ac_cv_c_uint16_t=yes
ac_cv_c_uint32_t=yes
ac_cv_c_uint8_t=yes
ac_cv_c_undeclared_builtin_options='none needed'
ac_cv_env_CC_set=
ac_cv_env_CC_value=
ac_cv_env_CFLAGS_set=set
ac_cv_env_CFLAGS_value='-g -O2 -Werror=implicit-function-declaration -ffile-prefix-map=/<<PKGBUILDDIR>>=. -fstack-protector-strong -Wformat -Werror=format-security'
ac_cv_env_CHECK_CFLAGS_set=
ac_cv_env_CHECK_CFLAGS_value=
ac_cv_env_CHECK_LIBS_set=
ac_cv_env_CHECK_LIBS_value=
ac_cv_env_CPPFLAGS_set=set
ac_cv_env_CPPFLAGS_value='-Wdate-time -D_FORTIFY_SOURCE=2'
ac_cv_env_CPP_set=
ac_cv_env_CPP_value=
ac_cv_env_LDFLAGS_set=set
ac_cv_env_LDFLAGS_value='-Wl,-z,relro -Wl,-z,now'
ac_cv_env_LIBS_set=
ac_cv_env_LIBS_value=
ac_cv_env_LT_SYS_LIBRARY_PATH_set=
ac_cv_env_LT_SYS_LIBRARY_PATH_value=
ac_cv_env_PKG_CONFIG_LIBDIR_set=
ac_cv_env_PKG_CONFIG_LIBDIR_value=
ac_cv_env_PKG_CONFIG_PATH_set=
ac_cv_env_PKG_CONFIG_PATH_value=
ac_cv_env_PKG_CONFIG_set=
ac_cv_env_PKG_CONFIG_value=
ac_cv_env_SSL_CFLAGS_set=
ac_cv_env_SSL_CFLAGS_value=
ac_cv_env_SSL_LIBS_set=
ac_cv_env_SSL_LIBS_value=
ac_cv_env_build_alias_set=set
ac_cv_env_build_alias_value=x86_64-linux-gnu
ac_cv_env_host_alias_set=set
ac_cv_env_host_alias_value=mips64el-linux-gnuabi64
ac_cv_env_target_alias_set=
ac_cv_env_target_alias_value=
ac_cv_func_Sleep=no
ac_cv_func__findfirst=no
ac_cv_func__mkdir=no
ac_cv_func_alarm=yes
ac_cv_func_alloca_works=yes
ac_cv_func_btowc=yes
ac_cv_func_close=yes
ac_cv_func_closedir_void=no
ac_cv_func_connect=yes
ac_cv_func_crypt=no
ac_cv_func_dlopen=yes
ac_cv_func_dup2=yes
ac_cv_func_fcntl=yes
ac_cv_func_fnmatch_works=cross
ac_cv_func_fork=yes
ac_cv_func_fork_works=yes
ac_cv_func_gethostbyname=yes
ac_cv_func_gethostname=yes
ac_cv_func_getopt=yes
ac_cv_func_getpagesize=yes
ac_cv_func_getpid=yes
ac_cv_func_gettimeofday=yes
ac_cv_func_inet_aton=yes
ac_cv_func_inet_ntoa=yes
ac_cv_func_ioctl=yes
ac_cv_func_isascii=yes
ac_cv_func_lstat_dereferences_slashed_symlink=yes
ac_cv_func_malloc_0_nonnull=yes
ac_cv_func_mbsrtowcs=yes
ac_cv_func_memchr=yes
ac_cv_func_memcmp_working=no
ac_cv_func_memmove=yes
ac_cv_func_mempcpy=yes
ac_cv_func_memset=yes
ac_cv_func_mkdir=yes
ac_cv_func_modf=yes
ac_cv_func_realloc_0_nonnull=yes
ac_cv_func_res_query=yes
ac_cv_func_select=yes
ac_cv_func_select_args='int,fd_set *,struct timeval *'
ac_cv_func_setenv=yes
ac_cv_func_setpgrp_void=yes
ac_cv_func_shl_load=no
ac_cv_func_sleep=yes
ac_cv_func_snprintf=yes
ac_cv_func_socket=yes
ac_cv_func_stat_empty_string_bug=yes
ac_cv_func_strcasecmp=yes
ac_cv_func_strchr=yes
ac_cv_func_strdup=yes
ac_cv_func_strerror=yes
ac_cv_func_stricmp=no
ac_cv_func_strncasecmp=yes
ac_cv_func_strndup=yes
ac_cv_func_strnicmp=no
ac_cv_func_strstr=yes
ac_cv_func_syslog=yes
ac_cv_func_tzset=yes
ac_cv_func_uname=yes
ac_cv_func_vfork=yes
ac_cv_func_vfork_works=yes
ac_cv_func_vprintf=yes
ac_cv_func_vsnprintf=yes
ac_cv_func_vsyslog=yes
ac_cv_func_wmempcpy=yes
ac_cv_func_working_mktime=no
ac_cv_have_decl_getenv=yes
ac_cv_header_arpa_inet_h=yes
ac_cv_header_arpa_nameser_h=yes
ac_cv_header_dirent_dirent_h=yes
ac_cv_header_dlfcn_h=yes
ac_cv_header_fcntl_h=yes
ac_cv_header_inttypes_h=yes
ac_cv_header_netdb_h=yes
ac_cv_header_netinet_in_h=yes
ac_cv_header_resolv_h=yes
ac_cv_header_signal_h=yes
ac_cv_header_stdarg_h=yes
ac_cv_header_stdint=stdint.h
ac_cv_header_stdint_h=yes
ac_cv_header_stdint_o=no-file
ac_cv_header_stdint_test=no
ac_cv_header_stdint_u=no-file
ac_cv_header_stdint_x=stdint.h
ac_cv_header_stdio_h=yes
ac_cv_header_stdlib_h=yes
ac_cv_header_string_h=yes
ac_cv_header_strings_h=yes
ac_cv_header_sys_filio_h=no
ac_cv_header_sys_ioctl_h=yes
ac_cv_header_sys_select_h=yes
ac_cv_header_sys_socket_h=yes
ac_cv_header_sys_stat_h=yes
ac_cv_header_sys_time_h=yes
ac_cv_header_sys_timeb_h=yes
ac_cv_header_sys_types_h=yes
ac_cv_header_sys_utsname_h=yes
ac_cv_header_sys_wait_h=yes
ac_cv_header_syslog_h=yes
ac_cv_header_unistd_h=yes
ac_cv_header_vfork_h=no
ac_cv_header_windns_h=no
ac_cv_header_windows_h=no
ac_cv_header_winsock2_h=no
ac_cv_host=mips64el-unknown-linux-gnuabi64
ac_cv_lib_crypt_crypt=yes
ac_cv_lib_dld_shl_load=no
ac_cv_lib_ws2_32__head_libws2_32_a=no
ac_cv_member_struct_tm_tm_zone=yes
ac_cv_objext=o
ac_cv_path_EGREP='/usr/bin/grep -E'
ac_cv_path_EGREP_TRADITIONAL='/usr/bin/grep -E'
ac_cv_path_FGREP='/usr/bin/grep -F'
ac_cv_path_GREP=/usr/bin/grep
ac_cv_path_SED=/usr/bin/sed
ac_cv_path_install='/usr/bin/install -c'
ac_cv_path_lt_DD=/usr/bin/dd
ac_cv_path_mkdir=/usr/bin/mkdir
ac_cv_prog_AR=mips64el-linux-gnuabi64-ar
ac_cv_prog_AWK=mawk
ac_cv_prog_CC=mips64el-linux-gnuabi64-gcc
ac_cv_prog_CPP='mips64el-linux-gnuabi64-gcc -E'
ac_cv_prog_FILECMD=file
ac_cv_prog_OBJDUMP=mips64el-linux-gnuabi64-objdump
ac_cv_prog_RANLIB=mips64el-linux-gnuabi64-ranlib
ac_cv_prog_STRIP=mips64el-linux-gnuabi64-strip
ac_cv_prog_cc_c11=
ac_cv_prog_cc_g=yes
ac_cv_prog_cc_stdc=
ac_cv_prog_make_make_set=yes
ac_cv_search_inet_ntop='none required'
ac_cv_search_inet_pton='none required'
ac_cv_search_opendir='none required'
ac_cv_sizeof_X=::::
ac_cv_sizeof_x=:
ac_cv_struct_tm=time.h
ac_cv_type_int_fast32_t=yes
ac_cv_type_int_least32_t=yes
ac_cv_type_mbstate_t=yes
ac_cv_type_mode_t=yes
ac_cv_type_off_t=yes
ac_cv_type_pid_t=yes
ac_cv_type_signal=void
ac_cv_type_size_t=yes
ac_cv_type_uint64_t=yes
ac_cv_type_uintptr_t=yes
ac_cv_working_alloca_h=yes
am_cv_CC_dependencies_compiler_type=none
am_cv_filesystem_timestamp_resolution=0.01
am_cv_make_support_nested_variables=yes
am_cv_prog_cc_c_o=yes
am_cv_sleep_fractional_seconds=yes
am_cv_xargs_n_works=yes
ax_cv_check_cflags___fdiagnostics_color=yes
lt_cv_ar_at_file=@
lt_cv_archive_cmds_need_lc=no
lt_cv_deplibs_check_method=pass_all
lt_cv_dlopen=dlopen
lt_cv_dlopen_libs=
lt_cv_dlopen_self=cross
lt_cv_file_magic_cmd='$MAGIC_CMD'
lt_cv_file_magic_test_file=
lt_cv_ld_reload_flag=-r
lt_cv_nm_interface='BSD nm'
lt_cv_objdir=.libs
lt_cv_path_LD=/usr/mips64el-linux-gnuabi64/bin/ld
lt_cv_path_NM='/usr/bin/mips64el-linux-gnuabi64-nm -B'
lt_cv_path_manifest_tool=no
lt_cv_prog_compiler_c_o=yes
lt_cv_prog_compiler_pic='-fPIC -DPIC'
lt_cv_prog_compiler_pic_works=yes
lt_cv_prog_compiler_rtti_exceptions=no
lt_cv_prog_compiler_static_works=yes
lt_cv_prog_gnu_ld=yes
lt_cv_sharedlib_from_linklib_cmd='printf %s\n'
lt_cv_shlibpath_overrides_runpath=yes
lt_cv_sys_global_symbol_pipe='/usr/bin/sed -n -e '\''s/^.*[	 ]\([ABCDGIRSTW][ABCDGIRSTW]*\)[	 ][	 ]*\([_A-Za-z][_A-Za-z0-9]*\)$/\1 \2 \2/p'\'' | /usr/bin/sed '\''/ __gnu_lto/d'\'''
lt_cv_sys_global_symbol_to_c_name_address='/usr/bin/sed -n -e '\''s/^: \(.*\) .*$/  {"\1", (void *) 0},/p'\'' -e '\''s/^[ABCDGIRSTW][ABCDGIRSTW]* .* \(.*\)$/  {"\1", (void *) \&\1},/p'\'''
lt_cv_sys_global_symbol_to_c_name_address_lib_prefix='/usr/bin/sed -n -e '\''s/^: \(.*\) .*$/  {"\1", (void *) 0},/p'\'' -e '\''s/^[ABCDGIRSTW][ABCDGIRSTW]* .* \(lib.*\)$/  {"\1", (void *) \&\1},/p'\'' -e '\''s/^[ABCDGIRSTW][ABCDGIRSTW]* .* \(.*\)$/  {"lib\1", (void *) \&\1},/p'\'''
lt_cv_sys_global_symbol_to_cdecl='/usr/bin/sed -n -e '\''s/^T .* \(.*\)$/extern int \1();/p'\'' -e '\''s/^[ABCDGIRSTW][ABCDGIRSTW]* .* \(.*\)$/extern char \1;/p'\'''
lt_cv_sys_global_symbol_to_import=
lt_cv_sys_lib_dlsearch_path_spec=' /lib/mips64el-linux-gnuabi64 /usr/lib/mips64el-linux-gnuabi64 /lib /usr/lib /usr/local/lib'
lt_cv_sys_max_cmd_len=1572864
lt_cv_to_host_file_cmd=func_convert_file_noop
lt_cv_to_tool_file_cmd=func_convert_file_noop
lt_cv_truncate_bin='/usr/bin/dd bs=4096 count=1'
xorg_cv_malloc0_returns_null=no

## ----------------- ##
## Output variables. ##
## ----------------- ##

ACLOCAL='${SHELL} '\''/<<PKGBUILDDIR>>/missing'\'' aclocal-1.17'
ALLOCA=''
AMDEPBACKSLASH=''
AMDEP_FALSE=''
AMDEP_TRUE='#'
AMTAR='$${TAR-tar}'
AM_BACKSLASH='\'
AM_DEFAULT_V=''
AM_DEFAULT_VERBOSITY='0'
AM_V=''
AR='mips64el-linux-gnuabi64-ar'
AUTOCONF='${SHELL} '\''/<<PKGBUILDDIR>>/missing'\'' autoconf'
AUTOHEADER='${SHELL} '\''/<<PKGBUILDDIR>>/missing'\'' autoheader'
AUTOMAKE='${SHELL} '\''/<<PKGBUILDDIR>>/missing'\'' automake-1.17'
AWK='mawk'
CC='mips64el-linux-gnuabi64-gcc'
CCDEPMODE='depmode=none'
CFLAGS='-g -O2 -Werror=implicit-function-declaration -ffile-prefix-map=/<<PKGBUILDDIR>>=. -fstack-protector-strong -Wformat -Werror=format-security -funsigned-char -fdiagnostics-color'
CHECK_CFLAGS=''
CHECK_LIBS=''
CPP='mips64el-linux-gnuabi64-gcc -E'
CPPFLAGS='-Wdate-time -D_FORTIFY_SOURCE=2'
CSCOPE='cscope'
CTAGS='ctags'
CYGPATH_W='echo'
DB_LIBS=''
DEFS=''
DEPDIR='.deps'
DLLTOOL='false'
DSYMUTIL=''
DUMPBIN=''
ECHO_C=''
ECHO_N='-n'
ECHO_T=''
EGREP='/usr/bin/grep -E'
ENABLE_EXPERIMENTAL_FALSE=''
ENABLE_EXPERIMENTAL_TRUE=''
ENABLE_TESTS_FALSE=''
ENABLE_TESTS_TRUE=''
ETAGS='etags'
EXEEXT=''
FGREP='/usr/bin/grep -F'
FILECMD='file'
GREP='/usr/bin/grep'
HAVE_CRYPT_FALSE='#'
HAVE_CRYPT_TRUE=''
HAVE_LIBZ=''
HAVE_LIBZ_FALSE=''
HAVE_LIBZ_TRUE=''
HAVE_SSL_FALSE=''
HAVE_SSL_TRUE=''
INSTALL_DATA='${INSTALL} -m 644'
INSTALL_PROGRAM='${INSTALL}'
INSTALL_SCRIPT='${INSTALL}'
INSTALL_STRIP_PROGRAM='$(install_sh) -c -s'
LD='/usr/mips64el-linux-gnuabi64/bin/ld -m elf64ltsmip'
LDAP_LIBS=''
LDFLAGS='-Wl,-z,relro -Wl,-z,now'
LIBOBJS=' fnmatch.o memcmp.o mktime.o stat.o'
LIBS='-lcrypt '
LIBTOOL='$(SHELL) $(top_builddir)/libtool'
LIPO=''
LN_S='ln -s'
LTLIBOBJS=''
LT_SYS_LIBRARY_PATH=''
MAKEINFO='${SHELL} '\''/<<PKGBUILDDIR>>/missing'\'' makeinfo'
MANIFEST_TOOL=':'
MKDIR_P='/usr/bin/mkdir -p'
MYSQL_CFLAGS=''
MYSQL_LIBS=''
NM='/usr/bin/mips64el-linux-gnuabi64-nm -B'
NMEDIT=''
OBJDUMP='mips64el-linux-gnuabi64-objdump'
OBJEXT='o'
ORACLE_CPPFLAGS=''
ORACLE_LDFLAGS=''
ORACLE_LIBS=''
OTOOL64=''
OTOOL=''
PACKAGE='jabberd2'
PACKAGE_BUGREPORT='jabberd2@lists.xiaoka.com'
PACKAGE_NAME='jabberd2'
PACKAGE_STRING='jabberd2 2.7.0'
PACKAGE_TARNAME='jabberd2'
PACKAGE_URL=''
PACKAGE_VERSION='2.7.0'
PAM_LIBS=''
PATH_SEPARATOR=':'
PGSQL_CFLAGS=''
PGSQL_LIBS=''
PKG_CONFIG=''
PKG_CONFIG_LIBDIR=''
PKG_CONFIG_PATH=''
RANLIB='mips64el-linux-gnuabi64-ranlib'
SED='/usr/bin/sed'
SET_MAKE=''
SHELL='/bin/bash'
SQLITE_LIBS=''
SSL_CFLAGS=''
SSL_LIBS=''
STORAGE_ANON_FALSE=''
STORAGE_ANON_TRUE=''
STORAGE_DB_FALSE=''
STORAGE_DB_TRUE=''
STORAGE_FS_FALSE=''
STORAGE_FS_TRUE=''
STORAGE_LDAP_FALSE=''
STORAGE_LDAP_TRUE=''
STORAGE_MYSQL_FALSE=''
STORAGE_MYSQL_TRUE=''
STORAGE_ORACLE_FALSE=''
STORAGE_ORACLE_TRUE=''
STORAGE_PAM_FALSE=''
STORAGE_PAM_TRUE=''
STORAGE_PGSQL_FALSE=''
STORAGE_PGSQL_TRUE=''
STORAGE_PIPE_FALSE=''
STORAGE_PIPE_TRUE=''
STORAGE_SQLITE_FALSE=''
STORAGE_SQLITE_TRUE=''
STRIP='mips64el-linux-gnuabi64-strip'
USE_LIBSUBST=''
USE_LIBSUBST_FALSE=''
USE_LIBSUBST_TRUE=''
USE_WEBSOCKET_FALSE=''
USE_WEBSOCKET_TRUE=''
VERSION='2.7.0'
ac_ct_AR=''
ac_ct_CC=''
ac_ct_DUMPBIN=''
am__EXEEXT_FALSE=''
am__EXEEXT_TRUE=''
am__fastdepCC_FALSE=''
am__fastdepCC_TRUE='#'
am__include='include'
am__isrc=''
am__leading_dot='.'
am__nodep=''
am__quote=''
am__rm_f_notfound=''
am__tar='$${TAR-tar} chof - "$$tardir"'
am__untar='$${TAR-tar} xf -'
am__xargs_n='xargs -n'
bindir='${prefix}/sbin'
build='x86_64-pc-linux-gnu'
build_alias='x86_64-linux-gnu'
build_cpu='x86_64'
build_os='linux-gnu'
build_vendor='pc'
datadir='${datarootdir}'
datarootdir='${prefix}/share'
docdir='${datarootdir}/doc/${PACKAGE_TARNAME}'
dvidir='${docdir}'
exec_prefix='NONE'
host='mips64el-unknown-linux-gnuabi64'
host_alias='mips64el-linux-gnuabi64'
host_cpu='mips64el'
host_os='linux-gnuabi64'
host_vendor='unknown'
htmldir='${docdir}'
includedir='${prefix}/include'
infodir='${prefix}/share/info'
install_sh='${SHELL} /<<PKGBUILDDIR>>/install-sh'
libdir='${prefix}/lib/mips64el-linux-gnuabi64'
libexecdir='${exec_prefix}/libexec'
localedir='${datarootdir}/locale'
localstatedir='/var'
mandir='${prefix}/share/man'
mkdir_p='$(MKDIR_P)'
mysqlconfig=''
oldincludedir='/usr/include'
pdfdir='${docdir}'
pgconfig=''
prefix='/usr'
program_transform_name='s&^&jabberd2-&'
psdir='${docdir}'
runstatedir='/run'
sbindir='${exec_prefix}/sbin'
sharedstatedir='${prefix}/com'
sysconfdir='/etc/jabberd2'
target_alias=''

## ----------- ##
## confdefs.h. ##
## ----------- ##

/* confdefs.h */
#define PACKAGE_NAME "jabberd2"
#define PACKAGE_TARNAME "jabberd2"
#define PACKAGE_VERSION "2.7.0"
#define PACKAGE_STRING "jabberd2 2.7.0"
#define PACKAGE_BUGREPORT "jabberd2@lists.xiaoka.com"
#define PACKAGE_URL ""
#define PACKAGE "jabberd2"
#define VERSION "2.7.0"
#define HAVE_STDIO_H 1
#define HAVE_STDLIB_H 1
#define HAVE_STRING_H 1
#define HAVE_INTTYPES_H 1
#define HAVE_STDINT_H 1
#define HAVE_STRINGS_H 1
#define HAVE_SYS_STAT_H 1
#define HAVE_SYS_TYPES_H 1
#define HAVE_UNISTD_H 1
#define HAVE_SYS_TIME_H 1
#define HAVE_SYS_SELECT_H 1
#define HAVE_SYS_SOCKET_H 1
#define STDC_HEADERS 1
#define HAVE_DLFCN_H 1
#define LT_OBJDIR ".libs/"
#define HAVE_DIRENT_H 1
#define HAVE_SYS_TYPES_H 1
#define HAVE_NETINET_IN_H 1
#define HAVE_ARPA_NAMESER_H 1
#define HAVE_NETDB_H 1
#define HAVE_RESOLV_H 1
#define HAVE_SYS_WAIT_H 1
#define TIME_WITH_SYS_TIME 1
#define HAVE_ARPA_INET_H 1
#define HAVE_ARPA_NAMESER_H 1
#define HAVE_FCNTL_H 1
#define HAVE_NETINET_IN_H 1
#define HAVE_SIGNAL_H 1
#define HAVE_STDARG_H 1
#define HAVE_STDINT_H 1
#define HAVE_STDLIB_H 1
#define HAVE_STRING_H 1
#define HAVE_SYS_IOCTL_H 1
#define HAVE_SYS_SOCKET_H 1
#define HAVE_SYS_TIME_H 1
#define HAVE_SYS_TIMEB_H 1
#define HAVE_SYS_TYPES_H 1
#define HAVE_SYS_STAT_H 1
#define HAVE_SYS_UTSNAME_H 1
#define HAVE_SYSLOG_H 1
#define HAVE_UNISTD_H 1
#define HAVE_RESOLV_H 1
#define TIME_WITH_SYS_TIME 1
#define HAVE_STRUCT_TM_TM_ZONE 1
#define HAVE_TM_ZONE 1
#define HAVE_ALLOCA_H 1
#define HAVE_ALLOCA 1
#define HAVE_MBSTATE_T 1
#define HAVE_DECL_GETENV 1
#define HAVE_BTOWC 1
#define HAVE_MBSRTOWCS 1
#define HAVE_MEMPCPY 1
#define HAVE_WMEMPCPY 1
#define HAVE_FORK 1
#define HAVE_VFORK 1
#define HAVE_ALARM 1
#define HAVE_VPRINTF 1
#define fnmatch rpl_fnmatch
#define HAVE_WORKING_VFORK 1
#define HAVE_WORKING_FORK 1
#define SELECT_TYPE_ARG1 int
#define SELECT_TYPE_ARG234 (fd_set *)
#define SELECT_TYPE_ARG5 (struct timeval *)
#define RETSIGTYPE void
#define LSTAT_FOLLOWS_SLASHED_SYMLINK 1
#define HAVE_STAT_EMPTY_STRING_BUG 1
#define SELECT_TYPE_ARG1 int
#define SELECT_TYPE_ARG234 (fd_set *)
#define SELECT_TYPE_ARG5 (struct timeval *)
#define HAVE_CLOSE 1
#define HAVE_DUP2 1
#define HAVE_FCNTL 1
#define HAVE_GETHOSTNAME 1
#define HAVE_GETOPT 1
#define HAVE_GETPAGESIZE 1
#define HAVE_GETPID 1
#define HAVE_GETTIMEOFDAY 1
#define HAVE_INET_ATON 1
#define HAVE_INET_NTOA 1
#define HAVE_IOCTL 1
#define HAVE_ISASCII 1
#define HAVE_MEMCHR 1
#define HAVE_MEMMOVE 1
#define HAVE_MEMSET 1
#define HAVE_MKDIR 1
#define HAVE_MODF 1
#define HAVE_SELECT 1
#define HAVE_SETENV 1
#define HAVE_SLEEP 1
#define HAVE_SOCKET 1
#define HAVE_STRCASECMP 1
#define HAVE_STRCHR 1
#define HAVE_STRDUP 1
#define HAVE_STRERROR 1
#define HAVE_STRNCASECMP 1
#define HAVE_STRNDUP 1
#define HAVE_STRSTR 1
#define HAVE_TZSET 1
#define HAVE_UNAME 1
#define HAVE_LIBCRYPT 1
#define HAVE_CRYPT 1
#define HAVE_INET_NTOP 1
#define HAVE_INET_PTON 1
#define HAVE_RES_QUERY 1
#define HAVE_RES_QUERY 1
#define HAVE_SYSLOG 1
#define HAVE_VSYSLOG 1
#define HAVE_SNPRINTF 1
#define HAVE_VSNPRINTF 1

configure: exit 1
dh_auto_configure: error: ./configure --build=x86_64-linux-gnu --prefix=/usr --includedir=\${prefix}/include --mandir=\${prefix}/share/man --infodir=\${prefix}/share/info --sysconfdir=/etc --localstatedir=/var --disable-option-checking --disable-silent-rules --libdir=\${prefix}/lib/mips64el-linux-gnuabi64 --runstatedir=/run --disable-maintainer-mode --disable-dependency-tracking --host=mips64el-linux-gnuabi64 --prefix=/usr --bindir=\${prefix}/sbin --sysconfdir=/etc/jabberd2 --program-prefix=jabberd2- --enable-ssl --enable-mysql --enable-pgsql --enable-sqlite --enable-db --enable-ldap --enable-pam --enable-pipe --enable-anon --enable-fs --enable-websocket --without-subst returned exit code 1
make[1]: *** [debian/rules:12: override_dh_auto_configure] Error 25
make[1]: Leaving directory '/<<PKGBUILDDIR>>'
make: *** [debian/rules:9: binary-arch] Error 2
dpkg-buildpackage: error: debian/rules binary-arch subprocess returned exit status 2
--------------------------------------------------------------------------------
Build finished at 2025-02-28T21:53:06Z

+------------------------------------------------------------------------------+
| Finished Timed Build Commands                                                |
+------------------------------------------------------------------------------+


rm -Rf /<<PKGBUILDDIR>>/
---------------------------------------------


I: Finished running 'rm -Rf /<<PKGBUILDDIR>>/'.

Finished processing commands.
--------------------------------------------------------------------------------

Finished
--------


+------------------------------------------------------------------------------+
| Cleanup                                                                      |
+------------------------------------------------------------------------------+

Purging /<<BUILDDIR>>
Not cleaning session: cloned chroot in use
E: Build failure (dpkg-buildpackage died)

+------------------------------------------------------------------------------+
| Summary                                                                      |
+------------------------------------------------------------------------------+

Build Architecture: amd64
Build Profiles: cross nocheck
Build Type: any
Build-Space: n/a
Build-Time: 12
Distribution: unstable
Fail-Stage: build
Foreign Architectures: mips64el
Host Architecture: mips64el
Install-Time: 11
Job: jabberd2_2.7.0-7
Machine Architecture: amd64
Package: jabberd2
Package-Time: 37
Source-Version: 2.7.0-7
Space: n/a
Status: attempted
Version: 2.7.0-7
--------------------------------------------------------------------------------
Finished at 2025-02-28T21:53:06Z
Build needed 00:00:37, no disk space