sbuild (Debian sbuild) 0.85.0 (04 January 2023) on debian-ci-siliconvalley

+==============================================================================+
| kind 0.27.0-1 (s390x)                        Sun, 30 Mar 2025 07:35:14 +0000 |
+==============================================================================+

Package: kind
Version: 0.27.0-1
Source Version: 0.27.0-1
Distribution: unstable
Machine Architecture: amd64
Host Architecture: s390x
Build Architecture: amd64
Build Profiles: cross nocheck
Build Type: any

I: NOTICE: Log filtering will replace 'var/run/schroot/mount/sid-amd64-sbuild-273a5c88-4f4b-4b5f-9c7a-2b120ae94901' with '<<CHROOT>>'
I: NOTICE: Log filtering will replace 'build/kind-7u45xK/resolver-NFqVUR' with '<<RESOLVERDIR>>'

+------------------------------------------------------------------------------+
| Update chroot                                                                |
+------------------------------------------------------------------------------+

Get:1 http://localhost:3142/debian unstable InRelease [205 kB]
Get:2 http://localhost:3142/debian unstable/contrib Sources.diff/Index [63.3 kB]
Get:3 http://localhost:3142/debian unstable/main Sources.diff/Index [63.6 kB]
Get:4 http://localhost:3142/debian unstable/non-free Sources.diff/Index [63.3 kB]
Get:5 http://localhost:3142/debian unstable/main amd64 Packages.diff/Index [63.6 kB]
Get:6 http://localhost:3142/debian unstable/contrib Sources T-2025-03-30-0211.29-F-2025-03-29-2020.22.pdiff [338 B]
Get:7 http://localhost:3142/debian unstable/main Sources T-2025-03-30-0211.29-F-2025-03-29-2020.22.pdiff [78.4 kB]
Get:8 http://localhost:3142/debian unstable/non-free Sources T-2025-03-30-0211.29-F-2025-03-29-2020.22.pdiff [6785 B]
Get:6 http://localhost:3142/debian unstable/contrib Sources T-2025-03-30-0211.29-F-2025-03-29-2020.22.pdiff [338 B]
Get:8 http://localhost:3142/debian unstable/non-free Sources T-2025-03-30-0211.29-F-2025-03-29-2020.22.pdiff [6785 B]
Get:7 http://localhost:3142/debian unstable/main Sources T-2025-03-30-0211.29-F-2025-03-29-2020.22.pdiff [78.4 kB]
Get:9 http://localhost:3142/debian unstable/main amd64 Packages T-2025-03-30-0211.29-F-2025-03-29-2020.22.pdiff [88.4 kB]
Get:9 http://localhost:3142/debian unstable/main amd64 Packages T-2025-03-30-0211.29-F-2025-03-29-2020.22.pdiff [88.4 kB]
Get:10 http://localhost:3142/debian unstable/main s390x Packages [9702 kB]
Fetched 10.3 MB in 3s (3886 kB/s)
Reading package lists...
Reading package lists...
Building dependency tree...
Reading state information...
Calculating upgrade...
The following packages will be upgraded:
  libsystemd0 libudev1
2 upgraded, 0 newly installed, 0 to remove and 0 not upgraded.
Need to get 603 kB of archives.
After this operation, 0 B of additional disk space will be used.
Get:1 http://localhost:3142/debian unstable/main amd64 libsystemd0 amd64 257.4-7 [452 kB]
Get:2 http://localhost:3142/debian unstable/main amd64 libudev1 amd64 257.4-7 [151 kB]
Fetched 603 kB in 0s (10.8 MB/s)
(Reading database ... 
(Reading database ... 5%
(Reading database ... 10%
(Reading database ... 15%
(Reading database ... 20%
(Reading database ... 25%
(Reading database ... 30%
(Reading database ... 35%
(Reading database ... 40%
(Reading database ... 45%
(Reading database ... 50%
(Reading database ... 55%
(Reading database ... 60%
(Reading database ... 65%
(Reading database ... 70%
(Reading database ... 75%
(Reading database ... 80%
(Reading database ... 85%
(Reading database ... 90%
(Reading database ... 95%
(Reading database ... 100%
(Reading database ... 12837 files and directories currently installed.)
Preparing to unpack .../libsystemd0_257.4-7_amd64.deb ...
Unpacking libsystemd0:amd64 (257.4-7) over (257.4-6) ...
Setting up libsystemd0:amd64 (257.4-7) ...
(Reading database ... 
(Reading database ... 5%
(Reading database ... 10%
(Reading database ... 15%
(Reading database ... 20%
(Reading database ... 25%
(Reading database ... 30%
(Reading database ... 35%
(Reading database ... 40%
(Reading database ... 45%
(Reading database ... 50%
(Reading database ... 55%
(Reading database ... 60%
(Reading database ... 65%
(Reading database ... 70%
(Reading database ... 75%
(Reading database ... 80%
(Reading database ... 85%
(Reading database ... 90%
(Reading database ... 95%
(Reading database ... 100%
(Reading database ... 12837 files and directories currently installed.)
Preparing to unpack .../libudev1_257.4-7_amd64.deb ...
Unpacking libudev1:amd64 (257.4-7) over (257.4-6) ...
Setting up libudev1:amd64 (257.4-7) ...
Processing triggers for libc-bin (2.41-6) ...

+------------------------------------------------------------------------------+
| Fetch source files                                                           |
+------------------------------------------------------------------------------+


Check APT
---------

Checking available source versions...

Download source files with APT
------------------------------

Reading package lists...
NOTICE: 'kind' packaging is maintained in the 'Git' version control system at:
https://salsa.debian.org/kubernetes-team/packages/kind.git
Please use:
git clone https://salsa.debian.org/kubernetes-team/packages/kind.git
to retrieve the latest (possibly unreleased) updates to the package.
Need to get 1945 kB of source archives.
Get:1 http://localhost:3142/debian unstable/main kind 0.27.0-1 (dsc) [2424 B]
Get:2 http://localhost:3142/debian unstable/main kind 0.27.0-1 (tar) [1938 kB]
Get:3 http://localhost:3142/debian unstable/main kind 0.27.0-1 (diff) [4044 B]
Fetched 1945 kB in 0s (34.4 MB/s)
Download complete and in download only mode
I: NOTICE: Log filtering will replace 'build/kind-7u45xK/kind-0.27.0' with '<<PKGBUILDDIR>>'
I: NOTICE: Log filtering will replace 'build/kind-7u45xK' with '<<BUILDDIR>>'

+------------------------------------------------------------------------------+
| Install package build dependencies                                           |
+------------------------------------------------------------------------------+


Setup apt archive
-----------------

Merged Build-Depends: debhelper-compat (= 13), dh-sequence-golang, golang-any, golang-github-burntsushi-toml-dev, golang-github-alessio-shellescape-dev, golang-github-evanphx-json-patch-dev, golang-github-google-safetext-dev, golang-github-mattn-go-isatty-dev, golang-github-pelletier-go-toml-dev, golang-github-pkg-errors-dev, golang-github-spf13-cobra-dev, golang-github-spf13-pflag-dev, golang-gopkg-yaml.v3-dev, golang-k8s-sigs-yaml-dev, help2man, libc-dev, libstdc++-dev, build-essential:amd64, fakeroot:amd64, crossbuild-essential-s390x:amd64, libc-dev:s390x, libstdc++-dev:s390x
Filtered Build-Depends: debhelper-compat (= 13), dh-sequence-golang, golang-any, golang-github-burntsushi-toml-dev, golang-github-alessio-shellescape-dev, golang-github-evanphx-json-patch-dev, golang-github-google-safetext-dev, golang-github-mattn-go-isatty-dev, golang-github-pelletier-go-toml-dev, golang-github-pkg-errors-dev, golang-github-spf13-cobra-dev, golang-github-spf13-pflag-dev, golang-gopkg-yaml.v3-dev, golang-k8s-sigs-yaml-dev, help2man, libc-dev, libstdc++-dev, build-essential:amd64, fakeroot:amd64, crossbuild-essential-s390x:amd64, libc-dev:s390x, libstdc++-dev:s390x
dpkg-deb: warning: root directory /<<RESOLVERDIR>>/sbuild-build-depends-main-dummy has unusual owner or group 1000:119
dpkg-deb: hint: you might need to pass --root-owner-group, see <https://wiki.debian.org/Teams/Dpkg/RootlessBuilds> for further details
dpkg-deb: warning: ignoring 1 warning about the control file(s)
dpkg-deb: building package 'sbuild-build-depends-main-dummy' in '/<<RESOLVERDIR>>/apt_archive/sbuild-build-depends-main-dummy.deb'.
Ign:1 copy:/<<RESOLVERDIR>>/apt_archive ./ InRelease
Get:2 copy:/<<RESOLVERDIR>>/apt_archive ./ Release [615 B]
Ign:3 copy:/<<RESOLVERDIR>>/apt_archive ./ Release.gpg
Get:4 copy:/<<RESOLVERDIR>>/apt_archive ./ Sources [1128 B]
Get:5 copy:/<<RESOLVERDIR>>/apt_archive ./ Packages [1163 B]
Fetched 2906 B in 0s (0 B/s)
Reading package lists...
Reading package lists...

Install main build dependencies (apt-based resolver)
----------------------------------------------------

Installing build dependencies
Reading package lists...
Building dependency tree...
Reading state information...
Execute external solver...
The following additional packages will be installed:
  autoconf automake autopoint autotools-dev binutils-s390x-linux-gnu
  bsdextrautils cpp-14-s390x-linux-gnu cpp-s390x-linux-gnu
  crossbuild-essential-s390x debhelper dh-autoreconf dh-golang
  dh-strip-nondeterminism dwz fakeroot file g++-14-s390x-linux-gnu
  g++-s390x-linux-gnu gcc-14-base:s390x gcc-14-cross-base
  gcc-14-s390x-linux-gnu gcc-14-s390x-linux-gnu-base gcc-s390x-linux-gnu
  gettext gettext-base golang-1.24-go:s390x golang-1.24-src golang-any:s390x
  golang-github-alessio-shellescape-dev golang-github-burntsushi-toml-dev
  golang-github-cpuguy83-go-md2man-v2-dev golang-github-creack-pty-dev
  golang-github-davecgh-go-spew-dev golang-github-evanphx-json-patch-dev
  golang-github-fsnotify-fsnotify-dev golang-github-google-go-cmp-dev
  golang-github-google-safetext-dev golang-github-google-uuid-dev
  golang-github-hashicorp-hcl-dev golang-github-kr-fs-dev
  golang-github-kr-pretty-dev golang-github-kr-text-dev
  golang-github-magiconair-properties-dev golang-github-mattn-go-isatty-dev
  golang-github-mitchellh-mapstructure-dev golang-github-pborman-uuid-dev
  golang-github-pelletier-go-toml-dev golang-github-pelletier-go-toml.v2-dev
  golang-github-pkg-errors-dev golang-github-pkg-sftp-dev
  golang-github-pmezard-go-difflib-dev golang-github-rogpeppe-go-internal-dev
  golang-github-russross-blackfriday-v2-dev
  golang-github-shurcool-sanitized-anchor-name-dev
  golang-github-spf13-afero-dev golang-github-spf13-cast-dev
  golang-github-spf13-cobra-dev golang-github-spf13-jwalterweatherman-dev
  golang-github-spf13-pflag-dev golang-github-spf13-viper-dev
  golang-github-stretchr-objx-dev golang-github-stretchr-testify-dev
  golang-github-subosito-gotenv-dev golang-github-yuin-goldmark-dev
  golang-go:s390x golang-golang-x-crypto-dev golang-golang-x-mod-dev
  golang-golang-x-net-dev golang-golang-x-sync-dev golang-golang-x-sys-dev
  golang-golang-x-term-dev golang-golang-x-text-dev golang-golang-x-tools-dev
  golang-gopkg-check.v1-dev golang-gopkg-ini.v1-dev golang-gopkg-yaml.v2-dev
  golang-gopkg-yaml.v3-dev golang-k8s-sigs-yaml-dev golang-mvdan-sh-dev
  golang-src groff-base help2man intltool-debian libarchive-zip-perl
  libasan8:s390x libasan8-s390x-cross libatomic1:s390x libatomic1-s390x-cross
  libc6:s390x libc6-dev:s390x libc6-dev-s390x-cross libc6-s390x-cross
  libcrypt-dev:s390x libcrypt1:s390x libdebhelper-perl libelf1t64 libfakeroot
  libfile-stripnondeterminism-perl libgcc-14-dev:s390x
  libgcc-14-dev-s390x-cross libgcc-s1:s390x libgcc-s1-s390x-cross
  libgomp1:s390x libgomp1-s390x-cross libitm1:s390x libitm1-s390x-cross
  liblocale-gettext-perl libmagic-mgc libmagic1t64 libpipeline1
  libstdc++-14-dev:s390x libstdc++-14-dev-s390x-cross libstdc++6:s390x
  libstdc++6-s390x-cross libtool libubsan1:s390x libubsan1-s390x-cross
  libuchardet0 libunistring5 libxml2 linux-libc-dev-s390x-cross m4 man-db
  po-debconf sensible-utils tzdata-legacy
Suggested packages:
  autoconf-archive gnu-standards autoconf-doc binutils-doc gcc-14-locales
  cpp-14-doc cpp-doc dh-make gcc-14-doc manpages-dev flex bison
  gdb-s390x-linux-gnu gcc-doc gettext-doc libasprintf-dev libgettextpo-dev
  bzr:s390x | brz:s390x ca-certificates:s390x git:s390x mercurial:s390x
  subversion:s390x groff glibc-doc:s390x libc-l10n:s390x locales:s390x
  libnss-nis:s390x libnss-nisplus:s390x manpages-dev:s390x
  libstdc++-14-doc:s390x libtool-doc gfortran | fortran95-compiler gcj-jdk
  m4-doc apparmor less www-browser libmail-box-perl
Recommended packages:
  curl | wget | lynx g++:s390x gcc:s390x pkgconf:s390x libidn2-0:s390x
  libarchive-cpio-perl libltdl-dev libmail-sendmail-perl
The following NEW packages will be installed:
  autoconf automake autopoint autotools-dev binutils-s390x-linux-gnu
  bsdextrautils cpp-14-s390x-linux-gnu cpp-s390x-linux-gnu
  crossbuild-essential-s390x debhelper dh-autoreconf dh-golang
  dh-strip-nondeterminism dwz fakeroot file g++-14-s390x-linux-gnu
  g++-s390x-linux-gnu gcc-14-base:s390x gcc-14-cross-base
  gcc-14-s390x-linux-gnu gcc-14-s390x-linux-gnu-base gcc-s390x-linux-gnu
  gettext gettext-base golang-1.24-go:s390x golang-1.24-src golang-any:s390x
  golang-github-alessio-shellescape-dev golang-github-burntsushi-toml-dev
  golang-github-cpuguy83-go-md2man-v2-dev golang-github-creack-pty-dev
  golang-github-davecgh-go-spew-dev golang-github-evanphx-json-patch-dev
  golang-github-fsnotify-fsnotify-dev golang-github-google-go-cmp-dev
  golang-github-google-safetext-dev golang-github-google-uuid-dev
  golang-github-hashicorp-hcl-dev golang-github-kr-fs-dev
  golang-github-kr-pretty-dev golang-github-kr-text-dev
  golang-github-magiconair-properties-dev golang-github-mattn-go-isatty-dev
  golang-github-mitchellh-mapstructure-dev golang-github-pborman-uuid-dev
  golang-github-pelletier-go-toml-dev golang-github-pelletier-go-toml.v2-dev
  golang-github-pkg-errors-dev golang-github-pkg-sftp-dev
  golang-github-pmezard-go-difflib-dev golang-github-rogpeppe-go-internal-dev
  golang-github-russross-blackfriday-v2-dev
  golang-github-shurcool-sanitized-anchor-name-dev
  golang-github-spf13-afero-dev golang-github-spf13-cast-dev
  golang-github-spf13-cobra-dev golang-github-spf13-jwalterweatherman-dev
  golang-github-spf13-pflag-dev golang-github-spf13-viper-dev
  golang-github-stretchr-objx-dev golang-github-stretchr-testify-dev
  golang-github-subosito-gotenv-dev golang-github-yuin-goldmark-dev
  golang-go:s390x golang-golang-x-crypto-dev golang-golang-x-mod-dev
  golang-golang-x-net-dev golang-golang-x-sync-dev golang-golang-x-sys-dev
  golang-golang-x-term-dev golang-golang-x-text-dev golang-golang-x-tools-dev
  golang-gopkg-check.v1-dev golang-gopkg-ini.v1-dev golang-gopkg-yaml.v2-dev
  golang-gopkg-yaml.v3-dev golang-k8s-sigs-yaml-dev golang-mvdan-sh-dev
  golang-src groff-base help2man intltool-debian libarchive-zip-perl
  libasan8:s390x libasan8-s390x-cross libatomic1:s390x libatomic1-s390x-cross
  libc6:s390x libc6-dev:s390x libc6-dev-s390x-cross libc6-s390x-cross
  libcrypt-dev:s390x libcrypt1:s390x libdebhelper-perl libelf1t64 libfakeroot
  libfile-stripnondeterminism-perl libgcc-14-dev:s390x
  libgcc-14-dev-s390x-cross libgcc-s1:s390x libgcc-s1-s390x-cross
  libgomp1:s390x libgomp1-s390x-cross libitm1:s390x libitm1-s390x-cross
  liblocale-gettext-perl libmagic-mgc libmagic1t64 libpipeline1
  libstdc++-14-dev:s390x libstdc++-14-dev-s390x-cross libstdc++6:s390x
  libstdc++6-s390x-cross libtool libubsan1:s390x libubsan1-s390x-cross
  libuchardet0 libunistring5 libxml2 linux-libc-dev-s390x-cross m4 man-db
  po-debconf sbuild-build-depends-main-dummy:s390x sensible-utils
  tzdata-legacy
0 upgraded, 127 newly installed, 0 to remove and 0 not upgraded.
Need to get 134 MB of archives.
After this operation, 649 MB of additional disk space will be used.
Get:1 copy:/<<RESOLVERDIR>>/apt_archive ./ sbuild-build-depends-main-dummy 0.invalid.0 [1076 B]
Get:2 http://localhost:3142/debian unstable/main amd64 liblocale-gettext-perl amd64 1.07-7+b1 [15.3 kB]
Get:3 http://localhost:3142/debian unstable/main amd64 sensible-utils all 0.0.24 [24.8 kB]
Get:4 http://localhost:3142/debian unstable/main amd64 libmagic-mgc amd64 1:5.46-4 [337 kB]
Get:5 http://localhost:3142/debian unstable/main amd64 libmagic1t64 amd64 1:5.46-4 [109 kB]
Get:6 http://localhost:3142/debian unstable/main amd64 file amd64 1:5.46-4 [43.5 kB]
Get:7 http://localhost:3142/debian unstable/main amd64 gettext-base amd64 0.23.1-1 [243 kB]
Get:8 http://localhost:3142/debian unstable/main amd64 libuchardet0 amd64 0.0.8-1+b2 [68.9 kB]
Get:9 http://localhost:3142/debian unstable/main amd64 groff-base amd64 1.23.0-7 [1185 kB]
Get:10 http://localhost:3142/debian unstable/main amd64 bsdextrautils amd64 2.40.4-5 [92.4 kB]
Get:11 http://localhost:3142/debian unstable/main amd64 libpipeline1 amd64 1.5.8-1 [42.0 kB]
Get:12 http://localhost:3142/debian unstable/main amd64 man-db amd64 2.13.0-1 [1420 kB]
Get:13 http://localhost:3142/debian unstable/main amd64 m4 amd64 1.4.19-7 [294 kB]
Get:14 http://localhost:3142/debian unstable/main amd64 autoconf all 2.72-3 [493 kB]
Get:15 http://localhost:3142/debian unstable/main amd64 autotools-dev all 20240727.1 [60.2 kB]
Get:16 http://localhost:3142/debian unstable/main amd64 automake all 1:1.17-4 [862 kB]
Get:17 http://localhost:3142/debian unstable/main amd64 autopoint all 0.23.1-1 [770 kB]
Get:18 http://localhost:3142/debian unstable/main amd64 binutils-s390x-linux-gnu amd64 2.44-3 [1309 kB]
Get:19 http://localhost:3142/debian unstable/main amd64 gcc-14-s390x-linux-gnu-base amd64 14.2.0-19cross1 [49.6 kB]
Get:20 http://localhost:3142/debian unstable/main amd64 cpp-14-s390x-linux-gnu amd64 14.2.0-19cross1 [9411 kB]
Get:21 http://localhost:3142/debian unstable/main amd64 cpp-s390x-linux-gnu amd64 4:14.2.0-1 [4848 B]
Get:22 http://localhost:3142/debian unstable/main amd64 gcc-14-cross-base all 14.2.0-19cross1 [44.9 kB]
Get:23 http://localhost:3142/debian unstable/main amd64 libc6-s390x-cross all 2.41-6cross2 [1168 kB]
Get:24 http://localhost:3142/debian unstable/main amd64 libgcc-s1-s390x-cross all 14.2.0-19cross1 [31.9 kB]
Get:25 http://localhost:3142/debian unstable/main amd64 libgomp1-s390x-cross all 14.2.0-19cross1 [129 kB]
Get:26 http://localhost:3142/debian unstable/main amd64 libitm1-s390x-cross all 14.2.0-19cross1 [26.3 kB]
Get:27 http://localhost:3142/debian unstable/main amd64 libatomic1-s390x-cross all 14.2.0-19cross1 [8296 B]
Get:28 http://localhost:3142/debian unstable/main amd64 libasan8-s390x-cross all 14.2.0-19cross1 [2563 kB]
Get:29 http://localhost:3142/debian unstable/main amd64 libstdc++6-s390x-cross all 14.2.0-19cross1 [713 kB]
Get:30 http://localhost:3142/debian unstable/main amd64 libubsan1-s390x-cross all 14.2.0-19cross1 [1054 kB]
Get:31 http://localhost:3142/debian unstable/main amd64 libgcc-14-dev-s390x-cross all 14.2.0-19cross1 [876 kB]
Get:32 http://localhost:3142/debian unstable/main amd64 gcc-14-s390x-linux-gnu amd64 14.2.0-19cross1 [17.8 MB]
Get:33 http://localhost:3142/debian unstable/main amd64 gcc-s390x-linux-gnu amd64 4:14.2.0-1 [1448 B]
Get:34 http://localhost:3142/debian unstable/main amd64 linux-libc-dev-s390x-cross all 6.12.17-1cross2 [2364 kB]
Get:35 http://localhost:3142/debian unstable/main amd64 libc6-dev-s390x-cross all 2.41-6cross2 [1554 kB]
Get:36 http://localhost:3142/debian unstable/main amd64 libstdc++-14-dev-s390x-cross all 14.2.0-19cross1 [2387 kB]
Get:37 http://localhost:3142/debian unstable/main amd64 g++-14-s390x-linux-gnu amd64 14.2.0-19cross1 [10.4 MB]
Get:38 http://localhost:3142/debian unstable/main amd64 g++-s390x-linux-gnu amd64 4:14.2.0-1 [1200 B]
Get:39 http://localhost:3142/debian unstable/main amd64 crossbuild-essential-s390x all 12.12 [3548 B]
Get:40 http://localhost:3142/debian unstable/main amd64 libdebhelper-perl all 13.24.2 [90.9 kB]
Get:41 http://localhost:3142/debian unstable/main amd64 libtool all 2.5.4-4 [539 kB]
Get:42 http://localhost:3142/debian unstable/main amd64 dh-autoreconf all 20 [17.1 kB]
Get:43 http://localhost:3142/debian unstable/main amd64 libarchive-zip-perl all 1.68-1 [104 kB]
Get:44 http://localhost:3142/debian unstable/main amd64 libfile-stripnondeterminism-perl all 1.14.1-2 [19.7 kB]
Get:45 http://localhost:3142/debian unstable/main amd64 dh-strip-nondeterminism all 1.14.1-2 [8620 B]
Get:46 http://localhost:3142/debian unstable/main amd64 libelf1t64 amd64 0.192-4 [189 kB]
Get:47 http://localhost:3142/debian unstable/main amd64 dwz amd64 0.15-1+b1 [110 kB]
Get:48 http://localhost:3142/debian unstable/main amd64 libunistring5 amd64 1.3-2 [477 kB]
Get:49 http://localhost:3142/debian unstable/main amd64 libxml2 amd64 2.12.7+dfsg+really2.9.14-0.4 [698 kB]
Get:50 http://localhost:3142/debian unstable/main amd64 gettext amd64 0.23.1-1 [1680 kB]
Get:51 http://localhost:3142/debian unstable/main amd64 intltool-debian all 0.35.0+20060710.6 [22.9 kB]
Get:52 http://localhost:3142/debian unstable/main amd64 po-debconf all 1.0.21+nmu1 [248 kB]
Get:53 http://localhost:3142/debian unstable/main amd64 debhelper all 13.24.2 [919 kB]
Get:54 http://localhost:3142/debian unstable/main amd64 dh-golang all 1.63 [24.4 kB]
Get:55 http://localhost:3142/debian unstable/main amd64 libfakeroot amd64 1.37.1.1-1 [29.6 kB]
Get:56 http://localhost:3142/debian unstable/main amd64 fakeroot amd64 1.37.1.1-1 [76.0 kB]
Get:57 http://localhost:3142/debian unstable/main s390x gcc-14-base s390x 14.2.0-19 [49.4 kB]
Get:58 http://localhost:3142/debian unstable/main amd64 golang-1.24-src all 1.24.1-1 [21.2 MB]
Get:59 http://localhost:3142/debian unstable/main s390x golang-1.24-go s390x 1.24.1-1 [25.9 MB]
Get:60 http://localhost:3142/debian unstable/main amd64 golang-src all 2:1.24~2 [5136 B]
Get:61 http://localhost:3142/debian unstable/main s390x golang-go s390x 2:1.24~2 [44.3 kB]
Get:62 http://localhost:3142/debian unstable/main s390x golang-any s390x 2:1.24~2 [5216 B]
Get:63 http://localhost:3142/debian unstable/main amd64 golang-github-alessio-shellescape-dev all 1.4.2-1 [4908 B]
Get:64 http://localhost:3142/debian unstable/main amd64 golang-github-burntsushi-toml-dev all 1.4.0-1 [116 kB]
Get:65 http://localhost:3142/debian unstable/main amd64 golang-github-pmezard-go-difflib-dev all 1.0.0-3 [12.3 kB]
Get:66 http://localhost:3142/debian unstable/main amd64 golang-github-shurcool-sanitized-anchor-name-dev all 1.0.0-3 [3748 B]
Get:67 http://localhost:3142/debian unstable/main amd64 golang-github-russross-blackfriday-v2-dev all 2.1.0-1 [76.1 kB]
Get:68 http://localhost:3142/debian unstable/main amd64 golang-github-cpuguy83-go-md2man-v2-dev all 2.0.4-1 [10.8 kB]
Get:69 http://localhost:3142/debian unstable/main amd64 golang-github-creack-pty-dev all 1.1.21-1 [13.0 kB]
Get:70 http://localhost:3142/debian unstable/main amd64 golang-github-davecgh-go-spew-dev all 1.1.1-3 [30.1 kB]
Get:71 http://localhost:3142/debian unstable/main amd64 golang-github-pkg-errors-dev all 0.9.1-3 [12.9 kB]
Get:72 http://localhost:3142/debian unstable/main amd64 golang-github-evanphx-json-patch-dev all 5.7.0-1 [22.3 kB]
Get:73 http://localhost:3142/debian unstable/main amd64 golang-golang-x-sys-dev all 0.22.0-1 [431 kB]
Get:74 http://localhost:3142/debian unstable/main amd64 golang-github-fsnotify-fsnotify-dev all 1.8.0-3 [61.9 kB]
Get:75 http://localhost:3142/debian unstable/main amd64 golang-github-google-go-cmp-dev all 0.6.0-1 [86.6 kB]
Get:76 http://localhost:3142/debian unstable/main amd64 golang-github-google-uuid-dev all 1.6.0-1 [20.6 kB]
Get:77 http://localhost:3142/debian unstable/main amd64 golang-github-pborman-uuid-dev all 1.2.0-2 [12.2 kB]
Get:78 http://localhost:3142/debian unstable/main amd64 golang-gopkg-yaml.v3-dev all 3.0.1-3 [74.3 kB]
Get:79 http://localhost:3142/debian unstable/main amd64 golang-golang-x-sync-dev all 0.7.0-1 [19.0 kB]
Get:80 http://localhost:3142/debian unstable/main amd64 golang-golang-x-term-dev all 0.22.0-1 [14.8 kB]
Get:81 http://localhost:3142/debian unstable/main amd64 golang-mvdan-sh-dev all 3.8.0-1 [172 kB]
Get:82 http://localhost:3142/debian unstable/main amd64 golang-github-google-safetext-dev all 0.0~git20240104.7a7d9b3-1 [22.4 kB]
Get:83 http://localhost:3142/debian unstable/main amd64 golang-github-hashicorp-hcl-dev all 1.0.0-1.1 [58.8 kB]
Get:84 http://localhost:3142/debian unstable/main amd64 golang-github-kr-fs-dev all 0.1.0-2 [6412 B]
Get:85 http://localhost:3142/debian unstable/main amd64 golang-github-kr-text-dev all 0.2.0-2 [10.2 kB]
Get:86 http://localhost:3142/debian unstable/main amd64 golang-golang-x-mod-dev all 0.19.0-1 [104 kB]
Get:87 http://localhost:3142/debian unstable/main amd64 golang-github-yuin-goldmark-dev all 1.7.4-1 [113 kB]
Get:88 http://localhost:3142/debian unstable/main amd64 golang-golang-x-text-dev all 0.22.0-1 [3995 kB]
Get:89 http://localhost:3142/debian unstable/main amd64 golang-golang-x-crypto-dev all 1:0.25.0-1 [1682 kB]
Get:90 http://localhost:3142/debian unstable/main amd64 golang-golang-x-net-dev all 1:0.27.0-1 [898 kB]
Get:91 http://localhost:3142/debian unstable/main amd64 golang-golang-x-tools-dev all 1:0.25.0+ds-1 [1608 kB]
Get:92 http://localhost:3142/debian unstable/main amd64 golang-github-rogpeppe-go-internal-dev all 1.12.0-3 [103 kB]
Get:93 http://localhost:3142/debian unstable/main amd64 golang-github-kr-pretty-dev all 0.3.1-1 [11.9 kB]
Get:94 http://localhost:3142/debian unstable/main amd64 golang-github-magiconair-properties-dev all 1.8.7-1 [29.5 kB]
Get:95 http://localhost:3142/debian unstable/main amd64 golang-github-mattn-go-isatty-dev all 0.0.20-1 [6080 B]
Get:96 http://localhost:3142/debian unstable/main amd64 golang-github-mitchellh-mapstructure-dev all 1.5.0+git20231216.8508981-1 [29.3 kB]
Get:97 http://localhost:3142/debian unstable/main amd64 golang-gopkg-yaml.v2-dev all 2.4.0-5 [60.5 kB]
Get:98 http://localhost:3142/debian unstable/main amd64 golang-github-pelletier-go-toml-dev all 1.9.5-1 [77.6 kB]
Get:99 http://localhost:3142/debian unstable/main amd64 golang-github-pelletier-go-toml.v2-dev all 2.2.1-1 [876 kB]
Get:100 http://localhost:3142/debian unstable/main amd64 golang-github-pkg-sftp-dev all 1.13.6-1 [102 kB]
Get:101 http://localhost:3142/debian unstable/main amd64 golang-github-spf13-afero-dev all 1.11.0-1 [58.3 kB]
Get:102 http://localhost:3142/debian unstable/main amd64 tzdata-legacy all 2025b-1 [179 kB]
Get:103 http://localhost:3142/debian unstable/main amd64 golang-github-spf13-cast-dev all 1.6.0-2 [14.0 kB]
Get:104 http://localhost:3142/debian unstable/main amd64 golang-github-spf13-pflag-dev all 1.0.6~git20210604-d5e0c0615ace-1 [43.0 kB]
Get:105 http://localhost:3142/debian unstable/main amd64 golang-github-stretchr-objx-dev all 0.5.2-1 [25.5 kB]
Get:106 http://localhost:3142/debian unstable/main amd64 golang-github-stretchr-testify-dev all 1.10.0-1 [78.4 kB]
Get:107 http://localhost:3142/debian unstable/main amd64 golang-github-spf13-jwalterweatherman-dev all 1.1.0+really1.1.0-2 [8084 B]
Get:108 http://localhost:3142/debian unstable/main amd64 golang-github-subosito-gotenv-dev all 1.3.0-1 [9340 B]
Get:109 http://localhost:3142/debian unstable/main amd64 golang-gopkg-ini.v1-dev all 1.67.0-1 [39.9 kB]
Get:110 http://localhost:3142/debian unstable/main amd64 golang-github-spf13-viper-dev all 1.12.0-1 [68.9 kB]
Get:111 http://localhost:3142/debian unstable/main amd64 golang-github-spf13-cobra-dev all 1.8.1-1 [75.2 kB]
Get:112 http://localhost:3142/debian unstable/main amd64 golang-gopkg-check.v1-dev all 0.0+git20200902.038fdea-2 [31.2 kB]
Get:113 http://localhost:3142/debian unstable/main amd64 golang-k8s-sigs-yaml-dev all 1.4.0-2 [97.1 kB]
Get:114 http://localhost:3142/debian unstable/main amd64 help2man amd64 1.49.3 [198 kB]
Get:115 http://localhost:3142/debian unstable/main s390x libgcc-s1 s390x 14.2.0-19 [31.9 kB]
Get:116 http://localhost:3142/debian unstable/main s390x libc6 s390x 2.41-6 [2449 kB]
Get:117 http://localhost:3142/debian unstable/main s390x libasan8 s390x 14.2.0-19 [2570 kB]
Get:118 http://localhost:3142/debian unstable/main s390x libatomic1 s390x 14.2.0-19 [8588 B]
Get:119 http://localhost:3142/debian unstable/main s390x libcrypt1 s390x 1:4.4.38-1 [94.0 kB]
Get:120 http://localhost:3142/debian unstable/main s390x libcrypt-dev s390x 1:4.4.38-1 [123 kB]
Get:121 http://localhost:3142/debian unstable/main s390x libc6-dev s390x 2.41-6 [1557 kB]
Get:122 http://localhost:3142/debian unstable/main s390x libgomp1 s390x 14.2.0-19 [132 kB]
Get:123 http://localhost:3142/debian unstable/main s390x libitm1 s390x 14.2.0-19 [26.9 kB]
Get:124 http://localhost:3142/debian unstable/main s390x libstdc++6 s390x 14.2.0-19 [764 kB]
Get:125 http://localhost:3142/debian unstable/main s390x libubsan1 s390x 14.2.0-19 [1056 kB]
Get:126 http://localhost:3142/debian unstable/main s390x libgcc-14-dev s390x 14.2.0-19 [876 kB]
Get:127 http://localhost:3142/debian unstable/main s390x libstdc++-14-dev s390x 14.2.0-19 [2409 kB]
Preconfiguring packages ...
Fetched 134 MB in 1s (207 MB/s)
Selecting previously unselected package liblocale-gettext-perl.
(Reading database ... 12837 files and directories currently installed.)
Preparing to unpack .../000-liblocale-gettext-perl_1.07-7+b1_amd64.deb ...
Unpacking liblocale-gettext-perl (1.07-7+b1) ...
Selecting previously unselected package sensible-utils.
Preparing to unpack .../001-sensible-utils_0.0.24_all.deb ...
Unpacking sensible-utils (0.0.24) ...
Selecting previously unselected package libmagic-mgc.
Preparing to unpack .../002-libmagic-mgc_1%3a5.46-4_amd64.deb ...
Unpacking libmagic-mgc (1:5.46-4) ...
Selecting previously unselected package libmagic1t64:amd64.
Preparing to unpack .../003-libmagic1t64_1%3a5.46-4_amd64.deb ...
Unpacking libmagic1t64:amd64 (1:5.46-4) ...
Selecting previously unselected package file.
Preparing to unpack .../004-file_1%3a5.46-4_amd64.deb ...
Unpacking file (1:5.46-4) ...
Selecting previously unselected package gettext-base.
Preparing to unpack .../005-gettext-base_0.23.1-1_amd64.deb ...
Unpacking gettext-base (0.23.1-1) ...
Selecting previously unselected package libuchardet0:amd64.
Preparing to unpack .../006-libuchardet0_0.0.8-1+b2_amd64.deb ...
Unpacking libuchardet0:amd64 (0.0.8-1+b2) ...
Selecting previously unselected package groff-base.
Preparing to unpack .../007-groff-base_1.23.0-7_amd64.deb ...
Unpacking groff-base (1.23.0-7) ...
Selecting previously unselected package bsdextrautils.
Preparing to unpack .../008-bsdextrautils_2.40.4-5_amd64.deb ...
Unpacking bsdextrautils (2.40.4-5) ...
Selecting previously unselected package libpipeline1:amd64.
Preparing to unpack .../009-libpipeline1_1.5.8-1_amd64.deb ...
Unpacking libpipeline1:amd64 (1.5.8-1) ...
Selecting previously unselected package man-db.
Preparing to unpack .../010-man-db_2.13.0-1_amd64.deb ...
Unpacking man-db (2.13.0-1) ...
Selecting previously unselected package m4.
Preparing to unpack .../011-m4_1.4.19-7_amd64.deb ...
Unpacking m4 (1.4.19-7) ...
Selecting previously unselected package autoconf.
Preparing to unpack .../012-autoconf_2.72-3_all.deb ...
Unpacking autoconf (2.72-3) ...
Selecting previously unselected package autotools-dev.
Preparing to unpack .../013-autotools-dev_20240727.1_all.deb ...
Unpacking autotools-dev (20240727.1) ...
Selecting previously unselected package automake.
Preparing to unpack .../014-automake_1%3a1.17-4_all.deb ...
Unpacking automake (1:1.17-4) ...
Selecting previously unselected package autopoint.
Preparing to unpack .../015-autopoint_0.23.1-1_all.deb ...
Unpacking autopoint (0.23.1-1) ...
Selecting previously unselected package binutils-s390x-linux-gnu.
Preparing to unpack .../016-binutils-s390x-linux-gnu_2.44-3_amd64.deb ...
Unpacking binutils-s390x-linux-gnu (2.44-3) ...
Selecting previously unselected package gcc-14-s390x-linux-gnu-base:amd64.
Preparing to unpack .../017-gcc-14-s390x-linux-gnu-base_14.2.0-19cross1_amd64.deb ...
Unpacking gcc-14-s390x-linux-gnu-base:amd64 (14.2.0-19cross1) ...
Selecting previously unselected package cpp-14-s390x-linux-gnu.
Preparing to unpack .../018-cpp-14-s390x-linux-gnu_14.2.0-19cross1_amd64.deb ...
Unpacking cpp-14-s390x-linux-gnu (14.2.0-19cross1) ...
Selecting previously unselected package cpp-s390x-linux-gnu.
Preparing to unpack .../019-cpp-s390x-linux-gnu_4%3a14.2.0-1_amd64.deb ...
Unpacking cpp-s390x-linux-gnu (4:14.2.0-1) ...
Selecting previously unselected package gcc-14-cross-base.
Preparing to unpack .../020-gcc-14-cross-base_14.2.0-19cross1_all.deb ...
Unpacking gcc-14-cross-base (14.2.0-19cross1) ...
Selecting previously unselected package libc6-s390x-cross.
Preparing to unpack .../021-libc6-s390x-cross_2.41-6cross2_all.deb ...
Unpacking libc6-s390x-cross (2.41-6cross2) ...
Selecting previously unselected package libgcc-s1-s390x-cross.
Preparing to unpack .../022-libgcc-s1-s390x-cross_14.2.0-19cross1_all.deb ...
Unpacking libgcc-s1-s390x-cross (14.2.0-19cross1) ...
Selecting previously unselected package libgomp1-s390x-cross.
Preparing to unpack .../023-libgomp1-s390x-cross_14.2.0-19cross1_all.deb ...
Unpacking libgomp1-s390x-cross (14.2.0-19cross1) ...
Selecting previously unselected package libitm1-s390x-cross.
Preparing to unpack .../024-libitm1-s390x-cross_14.2.0-19cross1_all.deb ...
Unpacking libitm1-s390x-cross (14.2.0-19cross1) ...
Selecting previously unselected package libatomic1-s390x-cross.
Preparing to unpack .../025-libatomic1-s390x-cross_14.2.0-19cross1_all.deb ...
Unpacking libatomic1-s390x-cross (14.2.0-19cross1) ...
Selecting previously unselected package libasan8-s390x-cross.
Preparing to unpack .../026-libasan8-s390x-cross_14.2.0-19cross1_all.deb ...
Unpacking libasan8-s390x-cross (14.2.0-19cross1) ...
Selecting previously unselected package libstdc++6-s390x-cross.
Preparing to unpack .../027-libstdc++6-s390x-cross_14.2.0-19cross1_all.deb ...
Unpacking libstdc++6-s390x-cross (14.2.0-19cross1) ...
Selecting previously unselected package libubsan1-s390x-cross.
Preparing to unpack .../028-libubsan1-s390x-cross_14.2.0-19cross1_all.deb ...
Unpacking libubsan1-s390x-cross (14.2.0-19cross1) ...
Selecting previously unselected package libgcc-14-dev-s390x-cross.
Preparing to unpack .../029-libgcc-14-dev-s390x-cross_14.2.0-19cross1_all.deb ...
Unpacking libgcc-14-dev-s390x-cross (14.2.0-19cross1) ...
Selecting previously unselected package gcc-14-s390x-linux-gnu.
Preparing to unpack .../030-gcc-14-s390x-linux-gnu_14.2.0-19cross1_amd64.deb ...
Unpacking gcc-14-s390x-linux-gnu (14.2.0-19cross1) ...
Selecting previously unselected package gcc-s390x-linux-gnu.
Preparing to unpack .../031-gcc-s390x-linux-gnu_4%3a14.2.0-1_amd64.deb ...
Unpacking gcc-s390x-linux-gnu (4:14.2.0-1) ...
Selecting previously unselected package linux-libc-dev-s390x-cross.
Preparing to unpack .../032-linux-libc-dev-s390x-cross_6.12.17-1cross2_all.deb ...
Unpacking linux-libc-dev-s390x-cross (6.12.17-1cross2) ...
Selecting previously unselected package libc6-dev-s390x-cross.
Preparing to unpack .../033-libc6-dev-s390x-cross_2.41-6cross2_all.deb ...
Unpacking libc6-dev-s390x-cross (2.41-6cross2) ...
Selecting previously unselected package libstdc++-14-dev-s390x-cross.
Preparing to unpack .../034-libstdc++-14-dev-s390x-cross_14.2.0-19cross1_all.deb ...
Unpacking libstdc++-14-dev-s390x-cross (14.2.0-19cross1) ...
Selecting previously unselected package g++-14-s390x-linux-gnu.
Preparing to unpack .../035-g++-14-s390x-linux-gnu_14.2.0-19cross1_amd64.deb ...
Unpacking g++-14-s390x-linux-gnu (14.2.0-19cross1) ...
Selecting previously unselected package g++-s390x-linux-gnu.
Preparing to unpack .../036-g++-s390x-linux-gnu_4%3a14.2.0-1_amd64.deb ...
Unpacking g++-s390x-linux-gnu (4:14.2.0-1) ...
Selecting previously unselected package crossbuild-essential-s390x.
Preparing to unpack .../037-crossbuild-essential-s390x_12.12_all.deb ...
Unpacking crossbuild-essential-s390x (12.12) ...
Selecting previously unselected package libdebhelper-perl.
Preparing to unpack .../038-libdebhelper-perl_13.24.2_all.deb ...
Unpacking libdebhelper-perl (13.24.2) ...
Selecting previously unselected package libtool.
Preparing to unpack .../039-libtool_2.5.4-4_all.deb ...
Unpacking libtool (2.5.4-4) ...
Selecting previously unselected package dh-autoreconf.
Preparing to unpack .../040-dh-autoreconf_20_all.deb ...
Unpacking dh-autoreconf (20) ...
Selecting previously unselected package libarchive-zip-perl.
Preparing to unpack .../041-libarchive-zip-perl_1.68-1_all.deb ...
Unpacking libarchive-zip-perl (1.68-1) ...
Selecting previously unselected package libfile-stripnondeterminism-perl.
Preparing to unpack .../042-libfile-stripnondeterminism-perl_1.14.1-2_all.deb ...
Unpacking libfile-stripnondeterminism-perl (1.14.1-2) ...
Selecting previously unselected package dh-strip-nondeterminism.
Preparing to unpack .../043-dh-strip-nondeterminism_1.14.1-2_all.deb ...
Unpacking dh-strip-nondeterminism (1.14.1-2) ...
Selecting previously unselected package libelf1t64:amd64.
Preparing to unpack .../044-libelf1t64_0.192-4_amd64.deb ...
Unpacking libelf1t64:amd64 (0.192-4) ...
Selecting previously unselected package dwz.
Preparing to unpack .../045-dwz_0.15-1+b1_amd64.deb ...
Unpacking dwz (0.15-1+b1) ...
Selecting previously unselected package libunistring5:amd64.
Preparing to unpack .../046-libunistring5_1.3-2_amd64.deb ...
Unpacking libunistring5:amd64 (1.3-2) ...
Selecting previously unselected package libxml2:amd64.
Preparing to unpack .../047-libxml2_2.12.7+dfsg+really2.9.14-0.4_amd64.deb ...
Unpacking libxml2:amd64 (2.12.7+dfsg+really2.9.14-0.4) ...
Selecting previously unselected package gettext.
Preparing to unpack .../048-gettext_0.23.1-1_amd64.deb ...
Unpacking gettext (0.23.1-1) ...
Selecting previously unselected package intltool-debian.
Preparing to unpack .../049-intltool-debian_0.35.0+20060710.6_all.deb ...
Unpacking intltool-debian (0.35.0+20060710.6) ...
Selecting previously unselected package po-debconf.
Preparing to unpack .../050-po-debconf_1.0.21+nmu1_all.deb ...
Unpacking po-debconf (1.0.21+nmu1) ...
Selecting previously unselected package debhelper.
Preparing to unpack .../051-debhelper_13.24.2_all.deb ...
Unpacking debhelper (13.24.2) ...
Selecting previously unselected package dh-golang.
Preparing to unpack .../052-dh-golang_1.63_all.deb ...
Unpacking dh-golang (1.63) ...
Selecting previously unselected package libfakeroot:amd64.
Preparing to unpack .../053-libfakeroot_1.37.1.1-1_amd64.deb ...
Unpacking libfakeroot:amd64 (1.37.1.1-1) ...
Selecting previously unselected package fakeroot.
Preparing to unpack .../054-fakeroot_1.37.1.1-1_amd64.deb ...
Unpacking fakeroot (1.37.1.1-1) ...
Selecting previously unselected package gcc-14-base:s390x.
Preparing to unpack .../055-gcc-14-base_14.2.0-19_s390x.deb ...
Unpacking gcc-14-base:s390x (14.2.0-19) ...
Selecting previously unselected package golang-1.24-src.
Preparing to unpack .../056-golang-1.24-src_1.24.1-1_all.deb ...
Unpacking golang-1.24-src (1.24.1-1) ...
Selecting previously unselected package golang-1.24-go:s390x.
Preparing to unpack .../057-golang-1.24-go_1.24.1-1_s390x.deb ...
Unpacking golang-1.24-go:s390x (1.24.1-1) ...
Selecting previously unselected package golang-src.
Preparing to unpack .../058-golang-src_2%3a1.24~2_all.deb ...
Unpacking golang-src (2:1.24~2) ...
Selecting previously unselected package golang-go:s390x.
Preparing to unpack .../059-golang-go_2%3a1.24~2_s390x.deb ...
Unpacking golang-go:s390x (2:1.24~2) ...
Selecting previously unselected package golang-any:s390x.
Preparing to unpack .../060-golang-any_2%3a1.24~2_s390x.deb ...
Unpacking golang-any:s390x (2:1.24~2) ...
Selecting previously unselected package golang-github-alessio-shellescape-dev.
Preparing to unpack .../061-golang-github-alessio-shellescape-dev_1.4.2-1_all.deb ...
Unpacking golang-github-alessio-shellescape-dev (1.4.2-1) ...
Selecting previously unselected package golang-github-burntsushi-toml-dev.
Preparing to unpack .../062-golang-github-burntsushi-toml-dev_1.4.0-1_all.deb ...
Unpacking golang-github-burntsushi-toml-dev (1.4.0-1) ...
Selecting previously unselected package golang-github-pmezard-go-difflib-dev.
Preparing to unpack .../063-golang-github-pmezard-go-difflib-dev_1.0.0-3_all.deb ...
Unpacking golang-github-pmezard-go-difflib-dev (1.0.0-3) ...
Selecting previously unselected package golang-github-shurcool-sanitized-anchor-name-dev.
Preparing to unpack .../064-golang-github-shurcool-sanitized-anchor-name-dev_1.0.0-3_all.deb ...
Unpacking golang-github-shurcool-sanitized-anchor-name-dev (1.0.0-3) ...
Selecting previously unselected package golang-github-russross-blackfriday-v2-dev.
Preparing to unpack .../065-golang-github-russross-blackfriday-v2-dev_2.1.0-1_all.deb ...
Unpacking golang-github-russross-blackfriday-v2-dev (2.1.0-1) ...
Selecting previously unselected package golang-github-cpuguy83-go-md2man-v2-dev.
Preparing to unpack .../066-golang-github-cpuguy83-go-md2man-v2-dev_2.0.4-1_all.deb ...
Unpacking golang-github-cpuguy83-go-md2man-v2-dev (2.0.4-1) ...
Selecting previously unselected package golang-github-creack-pty-dev.
Preparing to unpack .../067-golang-github-creack-pty-dev_1.1.21-1_all.deb ...
Unpacking golang-github-creack-pty-dev (1.1.21-1) ...
Selecting previously unselected package golang-github-davecgh-go-spew-dev.
Preparing to unpack .../068-golang-github-davecgh-go-spew-dev_1.1.1-3_all.deb ...
Unpacking golang-github-davecgh-go-spew-dev (1.1.1-3) ...
Selecting previously unselected package golang-github-pkg-errors-dev.
Preparing to unpack .../069-golang-github-pkg-errors-dev_0.9.1-3_all.deb ...
Unpacking golang-github-pkg-errors-dev (0.9.1-3) ...
Selecting previously unselected package golang-github-evanphx-json-patch-dev.
Preparing to unpack .../070-golang-github-evanphx-json-patch-dev_5.7.0-1_all.deb ...
Unpacking golang-github-evanphx-json-patch-dev (5.7.0-1) ...
Selecting previously unselected package golang-golang-x-sys-dev.
Preparing to unpack .../071-golang-golang-x-sys-dev_0.22.0-1_all.deb ...
Unpacking golang-golang-x-sys-dev (0.22.0-1) ...
Selecting previously unselected package golang-github-fsnotify-fsnotify-dev.
Preparing to unpack .../072-golang-github-fsnotify-fsnotify-dev_1.8.0-3_all.deb ...
Unpacking golang-github-fsnotify-fsnotify-dev (1.8.0-3) ...
Selecting previously unselected package golang-github-google-go-cmp-dev.
Preparing to unpack .../073-golang-github-google-go-cmp-dev_0.6.0-1_all.deb ...
Unpacking golang-github-google-go-cmp-dev (0.6.0-1) ...
Selecting previously unselected package golang-github-google-uuid-dev.
Preparing to unpack .../074-golang-github-google-uuid-dev_1.6.0-1_all.deb ...
Unpacking golang-github-google-uuid-dev (1.6.0-1) ...
Selecting previously unselected package golang-github-pborman-uuid-dev.
Preparing to unpack .../075-golang-github-pborman-uuid-dev_1.2.0-2_all.deb ...
Unpacking golang-github-pborman-uuid-dev (1.2.0-2) ...
Selecting previously unselected package golang-gopkg-yaml.v3-dev.
Preparing to unpack .../076-golang-gopkg-yaml.v3-dev_3.0.1-3_all.deb ...
Unpacking golang-gopkg-yaml.v3-dev (3.0.1-3) ...
Selecting previously unselected package golang-golang-x-sync-dev.
Preparing to unpack .../077-golang-golang-x-sync-dev_0.7.0-1_all.deb ...
Unpacking golang-golang-x-sync-dev (0.7.0-1) ...
Selecting previously unselected package golang-golang-x-term-dev.
Preparing to unpack .../078-golang-golang-x-term-dev_0.22.0-1_all.deb ...
Unpacking golang-golang-x-term-dev (0.22.0-1) ...
Selecting previously unselected package golang-mvdan-sh-dev.
Preparing to unpack .../079-golang-mvdan-sh-dev_3.8.0-1_all.deb ...
Unpacking golang-mvdan-sh-dev (3.8.0-1) ...
Selecting previously unselected package golang-github-google-safetext-dev.
Preparing to unpack .../080-golang-github-google-safetext-dev_0.0~git20240104.7a7d9b3-1_all.deb ...
Unpacking golang-github-google-safetext-dev (0.0~git20240104.7a7d9b3-1) ...
Selecting previously unselected package golang-github-hashicorp-hcl-dev.
Preparing to unpack .../081-golang-github-hashicorp-hcl-dev_1.0.0-1.1_all.deb ...
Unpacking golang-github-hashicorp-hcl-dev (1.0.0-1.1) ...
Selecting previously unselected package golang-github-kr-fs-dev.
Preparing to unpack .../082-golang-github-kr-fs-dev_0.1.0-2_all.deb ...
Unpacking golang-github-kr-fs-dev (0.1.0-2) ...
Selecting previously unselected package golang-github-kr-text-dev.
Preparing to unpack .../083-golang-github-kr-text-dev_0.2.0-2_all.deb ...
Unpacking golang-github-kr-text-dev (0.2.0-2) ...
Selecting previously unselected package golang-golang-x-mod-dev.
Preparing to unpack .../084-golang-golang-x-mod-dev_0.19.0-1_all.deb ...
Unpacking golang-golang-x-mod-dev (0.19.0-1) ...
Selecting previously unselected package golang-github-yuin-goldmark-dev.
Preparing to unpack .../085-golang-github-yuin-goldmark-dev_1.7.4-1_all.deb ...
Unpacking golang-github-yuin-goldmark-dev (1.7.4-1) ...
Selecting previously unselected package golang-golang-x-text-dev.
Preparing to unpack .../086-golang-golang-x-text-dev_0.22.0-1_all.deb ...
Unpacking golang-golang-x-text-dev (0.22.0-1) ...
Selecting previously unselected package golang-golang-x-crypto-dev.
Preparing to unpack .../087-golang-golang-x-crypto-dev_1%3a0.25.0-1_all.deb ...
Unpacking golang-golang-x-crypto-dev (1:0.25.0-1) ...
Selecting previously unselected package golang-golang-x-net-dev.
Preparing to unpack .../088-golang-golang-x-net-dev_1%3a0.27.0-1_all.deb ...
Unpacking golang-golang-x-net-dev (1:0.27.0-1) ...
Selecting previously unselected package golang-golang-x-tools-dev.
Preparing to unpack .../089-golang-golang-x-tools-dev_1%3a0.25.0+ds-1_all.deb ...
Unpacking golang-golang-x-tools-dev (1:0.25.0+ds-1) ...
Selecting previously unselected package golang-github-rogpeppe-go-internal-dev.
Preparing to unpack .../090-golang-github-rogpeppe-go-internal-dev_1.12.0-3_all.deb ...
Unpacking golang-github-rogpeppe-go-internal-dev (1.12.0-3) ...
Selecting previously unselected package golang-github-kr-pretty-dev.
Preparing to unpack .../091-golang-github-kr-pretty-dev_0.3.1-1_all.deb ...
Unpacking golang-github-kr-pretty-dev (0.3.1-1) ...
Selecting previously unselected package golang-github-magiconair-properties-dev.
Preparing to unpack .../092-golang-github-magiconair-properties-dev_1.8.7-1_all.deb ...
Unpacking golang-github-magiconair-properties-dev (1.8.7-1) ...
Selecting previously unselected package golang-github-mattn-go-isatty-dev.
Preparing to unpack .../093-golang-github-mattn-go-isatty-dev_0.0.20-1_all.deb ...
Unpacking golang-github-mattn-go-isatty-dev (0.0.20-1) ...
Selecting previously unselected package golang-github-mitchellh-mapstructure-dev.
Preparing to unpack .../094-golang-github-mitchellh-mapstructure-dev_1.5.0+git20231216.8508981-1_all.deb ...
Unpacking golang-github-mitchellh-mapstructure-dev (1.5.0+git20231216.8508981-1) ...
Selecting previously unselected package golang-gopkg-yaml.v2-dev.
Preparing to unpack .../095-golang-gopkg-yaml.v2-dev_2.4.0-5_all.deb ...
Unpacking golang-gopkg-yaml.v2-dev (2.4.0-5) ...
Selecting previously unselected package golang-github-pelletier-go-toml-dev.
Preparing to unpack .../096-golang-github-pelletier-go-toml-dev_1.9.5-1_all.deb ...
Unpacking golang-github-pelletier-go-toml-dev (1.9.5-1) ...
Selecting previously unselected package golang-github-pelletier-go-toml.v2-dev.
Preparing to unpack .../097-golang-github-pelletier-go-toml.v2-dev_2.2.1-1_all.deb ...
Unpacking golang-github-pelletier-go-toml.v2-dev (2.2.1-1) ...
Selecting previously unselected package golang-github-pkg-sftp-dev.
Preparing to unpack .../098-golang-github-pkg-sftp-dev_1.13.6-1_all.deb ...
Unpacking golang-github-pkg-sftp-dev (1.13.6-1) ...
Selecting previously unselected package golang-github-spf13-afero-dev.
Preparing to unpack .../099-golang-github-spf13-afero-dev_1.11.0-1_all.deb ...
Unpacking golang-github-spf13-afero-dev (1.11.0-1) ...
Selecting previously unselected package tzdata-legacy.
Preparing to unpack .../100-tzdata-legacy_2025b-1_all.deb ...
Unpacking tzdata-legacy (2025b-1) ...
Selecting previously unselected package golang-github-spf13-cast-dev.
Preparing to unpack .../101-golang-github-spf13-cast-dev_1.6.0-2_all.deb ...
Unpacking golang-github-spf13-cast-dev (1.6.0-2) ...
Selecting previously unselected package golang-github-spf13-pflag-dev.
Preparing to unpack .../102-golang-github-spf13-pflag-dev_1.0.6~git20210604-d5e0c0615ace-1_all.deb ...
Unpacking golang-github-spf13-pflag-dev (1.0.6~git20210604-d5e0c0615ace-1) ...
Selecting previously unselected package golang-github-stretchr-objx-dev.
Preparing to unpack .../103-golang-github-stretchr-objx-dev_0.5.2-1_all.deb ...
Unpacking golang-github-stretchr-objx-dev (0.5.2-1) ...
Selecting previously unselected package golang-github-stretchr-testify-dev.
Preparing to unpack .../104-golang-github-stretchr-testify-dev_1.10.0-1_all.deb ...
Unpacking golang-github-stretchr-testify-dev (1.10.0-1) ...
Selecting previously unselected package golang-github-spf13-jwalterweatherman-dev.
Preparing to unpack .../105-golang-github-spf13-jwalterweatherman-dev_1.1.0+really1.1.0-2_all.deb ...
Unpacking golang-github-spf13-jwalterweatherman-dev (1.1.0+really1.1.0-2) ...
Selecting previously unselected package golang-github-subosito-gotenv-dev.
Preparing to unpack .../106-golang-github-subosito-gotenv-dev_1.3.0-1_all.deb ...
Unpacking golang-github-subosito-gotenv-dev (1.3.0-1) ...
Selecting previously unselected package golang-gopkg-ini.v1-dev.
Preparing to unpack .../107-golang-gopkg-ini.v1-dev_1.67.0-1_all.deb ...
Unpacking golang-gopkg-ini.v1-dev (1.67.0-1) ...
Selecting previously unselected package golang-github-spf13-viper-dev.
Preparing to unpack .../108-golang-github-spf13-viper-dev_1.12.0-1_all.deb ...
Unpacking golang-github-spf13-viper-dev (1.12.0-1) ...
Selecting previously unselected package golang-github-spf13-cobra-dev.
Preparing to unpack .../109-golang-github-spf13-cobra-dev_1.8.1-1_all.deb ...
Unpacking golang-github-spf13-cobra-dev (1.8.1-1) ...
Selecting previously unselected package golang-gopkg-check.v1-dev.
Preparing to unpack .../110-golang-gopkg-check.v1-dev_0.0+git20200902.038fdea-2_all.deb ...
Unpacking golang-gopkg-check.v1-dev (0.0+git20200902.038fdea-2) ...
Selecting previously unselected package golang-k8s-sigs-yaml-dev.
Preparing to unpack .../111-golang-k8s-sigs-yaml-dev_1.4.0-2_all.deb ...
Unpacking golang-k8s-sigs-yaml-dev (1.4.0-2) ...
Selecting previously unselected package help2man.
Preparing to unpack .../112-help2man_1.49.3_amd64.deb ...
Unpacking help2man (1.49.3) ...
Selecting previously unselected package libgcc-s1:s390x.
Preparing to unpack .../113-libgcc-s1_14.2.0-19_s390x.deb ...
Unpacking libgcc-s1:s390x (14.2.0-19) ...
Selecting previously unselected package libc6:s390x.
Preparing to unpack .../114-libc6_2.41-6_s390x.deb ...
Unpacking libc6:s390x (2.41-6) ...
Selecting previously unselected package libasan8:s390x.
Preparing to unpack .../115-libasan8_14.2.0-19_s390x.deb ...
Unpacking libasan8:s390x (14.2.0-19) ...
Selecting previously unselected package libatomic1:s390x.
Preparing to unpack .../116-libatomic1_14.2.0-19_s390x.deb ...
Unpacking libatomic1:s390x (14.2.0-19) ...
Selecting previously unselected package libcrypt1:s390x.
Preparing to unpack .../117-libcrypt1_1%3a4.4.38-1_s390x.deb ...
Unpacking libcrypt1:s390x (1:4.4.38-1) ...
Selecting previously unselected package libcrypt-dev:s390x.
Preparing to unpack .../118-libcrypt-dev_1%3a4.4.38-1_s390x.deb ...
Unpacking libcrypt-dev:s390x (1:4.4.38-1) ...
Selecting previously unselected package libc6-dev:s390x.
Preparing to unpack .../119-libc6-dev_2.41-6_s390x.deb ...
Unpacking libc6-dev:s390x (2.41-6) ...
Selecting previously unselected package libgomp1:s390x.
Preparing to unpack .../120-libgomp1_14.2.0-19_s390x.deb ...
Unpacking libgomp1:s390x (14.2.0-19) ...
Selecting previously unselected package libitm1:s390x.
Preparing to unpack .../121-libitm1_14.2.0-19_s390x.deb ...
Unpacking libitm1:s390x (14.2.0-19) ...
Selecting previously unselected package libstdc++6:s390x.
Preparing to unpack .../122-libstdc++6_14.2.0-19_s390x.deb ...
Unpacking libstdc++6:s390x (14.2.0-19) ...
Selecting previously unselected package libubsan1:s390x.
Preparing to unpack .../123-libubsan1_14.2.0-19_s390x.deb ...
Unpacking libubsan1:s390x (14.2.0-19) ...
Selecting previously unselected package libgcc-14-dev:s390x.
Preparing to unpack .../124-libgcc-14-dev_14.2.0-19_s390x.deb ...
Unpacking libgcc-14-dev:s390x (14.2.0-19) ...
Selecting previously unselected package libstdc++-14-dev:s390x.
Preparing to unpack .../125-libstdc++-14-dev_14.2.0-19_s390x.deb ...
Unpacking libstdc++-14-dev:s390x (14.2.0-19) ...
Selecting previously unselected package sbuild-build-depends-main-dummy:s390x.
Preparing to unpack .../126-sbuild-build-depends-main-dummy_0.invalid.0_s390x.deb ...
Unpacking sbuild-build-depends-main-dummy:s390x (0.invalid.0) ...
Setting up golang-1.24-src (1.24.1-1) ...
Setting up golang-github-pelletier-go-toml.v2-dev (2.2.1-1) ...
Setting up libpipeline1:amd64 (1.5.8-1) ...
Setting up golang-github-google-go-cmp-dev (0.6.0-1) ...
Setting up golang-gopkg-yaml.v2-dev (2.4.0-5) ...
Setting up binutils-s390x-linux-gnu (2.44-3) ...
Setting up gcc-14-s390x-linux-gnu-base:amd64 (14.2.0-19cross1) ...
Setting up golang-github-mitchellh-mapstructure-dev (1.5.0+git20231216.8508981-1) ...
Setting up bsdextrautils (2.40.4-5) ...
Setting up golang-github-creack-pty-dev (1.1.21-1) ...
Setting up golang-github-shurcool-sanitized-anchor-name-dev (1.0.0-3) ...
Setting up golang-github-stretchr-objx-dev (0.5.2-1) ...
Setting up libmagic-mgc (1:5.46-4) ...
Setting up gcc-14-base:s390x (14.2.0-19) ...
Setting up golang-github-pkg-errors-dev (0.9.1-3) ...
Setting up libarchive-zip-perl (1.68-1) ...
Setting up golang-gopkg-yaml.v3-dev (3.0.1-3) ...
Setting up libdebhelper-perl (13.24.2) ...
Setting up golang-github-burntsushi-toml-dev (1.4.0-1) ...
Setting up libc6-s390x-cross (2.41-6cross2) ...
Setting up golang-golang-x-sys-dev (0.22.0-1) ...
Setting up golang-github-kr-fs-dev (0.1.0-2) ...
Setting up libmagic1t64:amd64 (1:5.46-4) ...
Setting up golang-github-subosito-gotenv-dev (1.3.0-1) ...
Setting up golang-github-pmezard-go-difflib-dev (1.0.0-3) ...
Setting up gettext-base (0.23.1-1) ...
Setting up m4 (1.4.19-7) ...
Setting up golang-golang-x-term-dev (0.22.0-1) ...
Setting up gcc-14-cross-base (14.2.0-19cross1) ...
Setting up file (1:5.46-4) ...
Setting up tzdata-legacy (2025b-1) ...
Setting up libfakeroot:amd64 (1.37.1.1-1) ...
Setting up libelf1t64:amd64 (0.192-4) ...
Setting up fakeroot (1.37.1.1-1) ...
update-alternatives: using /usr/bin/fakeroot-sysv to provide /usr/bin/fakeroot (fakeroot) in auto mode
Setting up golang-github-spf13-pflag-dev (1.0.6~git20210604-d5e0c0615ace-1) ...
Setting up golang-github-davecgh-go-spew-dev (1.1.1-3) ...
Setting up autotools-dev (20240727.1) ...
Setting up linux-libc-dev-s390x-cross (6.12.17-1cross2) ...
Setting up golang-github-kr-text-dev (0.2.0-2) ...
Setting up golang-github-stretchr-testify-dev (1.10.0-1) ...
Setting up golang-github-yuin-goldmark-dev (1.7.4-1) ...
Setting up libunistring5:amd64 (1.3-2) ...
Setting up golang-gopkg-ini.v1-dev (1.67.0-1) ...
Setting up golang-golang-x-sync-dev (0.7.0-1) ...
Setting up golang-golang-x-mod-dev (0.19.0-1) ...
Setting up autopoint (0.23.1-1) ...
Setting up golang-github-magiconair-properties-dev (1.8.7-1) ...
Setting up golang-1.24-go:s390x (1.24.1-1) ...
Setting up libgcc-s1-s390x-cross (14.2.0-19cross1) ...
Setting up golang-github-hashicorp-hcl-dev (1.0.0-1.1) ...
Setting up cpp-14-s390x-linux-gnu (14.2.0-19cross1) ...
Setting up autoconf (2.72-3) ...
Setting up golang-mvdan-sh-dev (3.8.0-1) ...
Setting up libitm1-s390x-cross (14.2.0-19cross1) ...
Setting up dwz (0.15-1+b1) ...
Setting up sensible-utils (0.0.24) ...
Setting up golang-golang-x-text-dev (0.22.0-1) ...
Setting up libc6-dev-s390x-cross (2.41-6cross2) ...
Setting up golang-github-google-uuid-dev (1.6.0-1) ...
Setting up libuchardet0:amd64 (0.0.8-1+b2) ...
Setting up golang-github-spf13-cast-dev (1.6.0-2) ...
Setting up golang-github-fsnotify-fsnotify-dev (1.8.0-3) ...
Setting up golang-golang-x-crypto-dev (1:0.25.0-1) ...
Setting up golang-github-pelletier-go-toml-dev (1.9.5-1) ...
Setting up golang-github-spf13-jwalterweatherman-dev (1.1.0+really1.1.0-2) ...
Setting up golang-github-evanphx-json-patch-dev (5.7.0-1) ...
Setting up golang-src (2:1.24~2) ...
Setting up libgomp1-s390x-cross (14.2.0-19cross1) ...
Setting up libxml2:amd64 (2.12.7+dfsg+really2.9.14-0.4) ...
Setting up golang-github-alessio-shellescape-dev (1.4.2-1) ...
Setting up liblocale-gettext-perl (1.07-7+b1) ...
Setting up automake (1:1.17-4) ...
update-alternatives: using /usr/bin/automake-1.17 to provide /usr/bin/automake (automake) in auto mode
Setting up libfile-stripnondeterminism-perl (1.14.1-2) ...
Setting up golang-github-mattn-go-isatty-dev (0.0.20-1) ...
Setting up gettext (0.23.1-1) ...
Setting up golang-github-russross-blackfriday-v2-dev (2.1.0-1) ...
Setting up cpp-s390x-linux-gnu (4:14.2.0-1) ...
Setting up libtool (2.5.4-4) ...
Setting up golang-go:s390x (2:1.24~2) ...
Setting up libstdc++6-s390x-cross (14.2.0-19cross1) ...
Setting up libatomic1-s390x-cross (14.2.0-19cross1) ...
Setting up golang-github-pkg-sftp-dev (1.13.6-1) ...
Setting up libasan8-s390x-cross (14.2.0-19cross1) ...
Setting up golang-any:s390x (2:1.24~2) ...
Setting up intltool-debian (0.35.0+20060710.6) ...
Setting up help2man (1.49.3) ...
Setting up dh-autoreconf (20) ...
Setting up golang-github-pborman-uuid-dev (1.2.0-2) ...
Setting up golang-github-google-safetext-dev (0.0~git20240104.7a7d9b3-1) ...
Setting up golang-golang-x-net-dev (1:0.27.0-1) ...
Setting up dh-strip-nondeterminism (1.14.1-2) ...
Setting up groff-base (1.23.0-7) ...
Setting up golang-github-spf13-afero-dev (1.11.0-1) ...
Setting up libubsan1-s390x-cross (14.2.0-19cross1) ...
Setting up golang-github-cpuguy83-go-md2man-v2-dev (2.0.4-1) ...
Setting up po-debconf (1.0.21+nmu1) ...
Setting up golang-golang-x-tools-dev (1:0.25.0+ds-1) ...
Setting up man-db (2.13.0-1) ...
Not building database; man-db/auto-update is not 'true'.
Setting up libgcc-14-dev-s390x-cross (14.2.0-19cross1) ...
Setting up golang-github-spf13-viper-dev (1.12.0-1) ...
Setting up golang-github-rogpeppe-go-internal-dev (1.12.0-3) ...
Setting up golang-github-kr-pretty-dev (0.3.1-1) ...
Setting up debhelper (13.24.2) ...
Setting up golang-gopkg-check.v1-dev (0.0+git20200902.038fdea-2) ...
Setting up gcc-14-s390x-linux-gnu (14.2.0-19cross1) ...
Setting up gcc-s390x-linux-gnu (4:14.2.0-1) ...
Setting up libstdc++-14-dev-s390x-cross (14.2.0-19cross1) ...
Setting up golang-k8s-sigs-yaml-dev (1.4.0-2) ...
Setting up g++-14-s390x-linux-gnu (14.2.0-19cross1) ...
Setting up golang-github-spf13-cobra-dev (1.8.1-1) ...
Setting up dh-golang (1.63) ...
Setting up g++-s390x-linux-gnu (4:14.2.0-1) ...
Setting up crossbuild-essential-s390x (12.12) ...
Setting up libgcc-s1:s390x (14.2.0-19) ...
Setting up libc6:s390x (2.41-6) ...
Setting up libasan8:s390x (14.2.0-19) ...
Setting up libstdc++6:s390x (14.2.0-19) ...
Setting up libitm1:s390x (14.2.0-19) ...
Setting up libcrypt1:s390x (1:4.4.38-1) ...
Setting up libgomp1:s390x (14.2.0-19) ...
Setting up libatomic1:s390x (14.2.0-19) ...
Setting up libubsan1:s390x (14.2.0-19) ...
Setting up libcrypt-dev:s390x (1:4.4.38-1) ...
Setting up libc6-dev:s390x (2.41-6) ...
Setting up libgcc-14-dev:s390x (14.2.0-19) ...
Setting up libstdc++-14-dev:s390x (14.2.0-19) ...
Setting up sbuild-build-depends-main-dummy:s390x (0.invalid.0) ...
Processing triggers for libc-bin (2.41-6) ...

+------------------------------------------------------------------------------+
| Check architectures                                                          |
+------------------------------------------------------------------------------+

Arch check ok (s390x included in any)

+------------------------------------------------------------------------------+
| Build environment                                                            |
+------------------------------------------------------------------------------+

Kernel: Linux 6.1.0-31-amd64 #1 SMP PREEMPT_DYNAMIC Debian 6.1.128-1 (2025-02-07) amd64 (x86_64)
Toolchain package versions: binutils_2.44-3 dpkg-dev_1.22.18 g++-14_14.2.0-19 gcc-14_14.2.0-19 libc6-dev_2.41-6 libstdc++-14-dev_14.2.0-19 libstdc++-14-dev-s390x-cross_14.2.0-19cross1 libstdc++6_14.2.0-19 libstdc++6-s390x-cross_14.2.0-19cross1 linux-libc-dev_6.12.20-1
Package versions: apt_2.9.35 apt-utils_2.9.35 autoconf_2.72-3 automake_1:1.17-4 autopoint_0.23.1-1 autotools-dev_20240727.1 base-files_13.7 base-passwd_3.6.7 bash_5.2.37-1.1+b2 binutils_2.44-3 binutils-common_2.44-3 binutils-s390x-linux-gnu_2.44-3 binutils-x86-64-linux-gnu_2.44-3 bsdextrautils_2.40.4-5 bsdutils_1:2.40.4-5 build-essential_12.12 bzip2_1.0.8-6 coreutils_9.5-1+b1 cpp_4:14.2.0-1 cpp-14_14.2.0-19 cpp-14-s390x-linux-gnu_14.2.0-19cross1 cpp-14-x86-64-linux-gnu_14.2.0-19 cpp-s390x-linux-gnu_4:14.2.0-1 cpp-x86-64-linux-gnu_4:14.2.0-1 crossbuild-essential-s390x_12.12 dash_0.5.12-12 debconf_1.5.91 debhelper_13.24.2 debian-archive-keyring_2023.4 debianutils_5.21 dh-autoreconf_20 dh-golang_1.63 dh-strip-nondeterminism_1.14.1-2 diffutils_1:3.10-3 dpkg_1.22.18 dpkg-dev_1.22.18 dwz_0.15-1+b1 fakeroot_1.37.1.1-1 file_1:5.46-4 findutils_4.10.0-3 g++_4:14.2.0-1 g++-14_14.2.0-19 g++-14-s390x-linux-gnu_14.2.0-19cross1 g++-14-x86-64-linux-gnu_14.2.0-19 g++-s390x-linux-gnu_4:14.2.0-1 g++-x86-64-linux-gnu_4:14.2.0-1 gcc_4:14.2.0-1 gcc-14_14.2.0-19 gcc-14-base_14.2.0-19 gcc-14-cross-base_14.2.0-19cross1 gcc-14-s390x-linux-gnu_14.2.0-19cross1 gcc-14-s390x-linux-gnu-base_14.2.0-19cross1 gcc-14-x86-64-linux-gnu_14.2.0-19 gcc-s390x-linux-gnu_4:14.2.0-1 gcc-x86-64-linux-gnu_4:14.2.0-1 gettext_0.23.1-1 gettext-base_0.23.1-1 golang-1.24-go_1.24.1-1 golang-1.24-src_1.24.1-1 golang-any_2:1.24~2 golang-github-alessio-shellescape-dev_1.4.2-1 golang-github-burntsushi-toml-dev_1.4.0-1 golang-github-cpuguy83-go-md2man-v2-dev_2.0.4-1 golang-github-creack-pty-dev_1.1.21-1 golang-github-davecgh-go-spew-dev_1.1.1-3 golang-github-evanphx-json-patch-dev_5.7.0-1 golang-github-fsnotify-fsnotify-dev_1.8.0-3 golang-github-google-go-cmp-dev_0.6.0-1 golang-github-google-safetext-dev_0.0~git20240104.7a7d9b3-1 golang-github-google-uuid-dev_1.6.0-1 golang-github-hashicorp-hcl-dev_1.0.0-1.1 golang-github-kr-fs-dev_0.1.0-2 golang-github-kr-pretty-dev_0.3.1-1 golang-github-kr-text-dev_0.2.0-2 golang-github-magiconair-properties-dev_1.8.7-1 golang-github-mattn-go-isatty-dev_0.0.20-1 golang-github-mitchellh-mapstructure-dev_1.5.0+git20231216.8508981-1 golang-github-pborman-uuid-dev_1.2.0-2 golang-github-pelletier-go-toml-dev_1.9.5-1 golang-github-pelletier-go-toml.v2-dev_2.2.1-1 golang-github-pkg-errors-dev_0.9.1-3 golang-github-pkg-sftp-dev_1.13.6-1 golang-github-pmezard-go-difflib-dev_1.0.0-3 golang-github-rogpeppe-go-internal-dev_1.12.0-3 golang-github-russross-blackfriday-v2-dev_2.1.0-1 golang-github-shurcool-sanitized-anchor-name-dev_1.0.0-3 golang-github-spf13-afero-dev_1.11.0-1 golang-github-spf13-cast-dev_1.6.0-2 golang-github-spf13-cobra-dev_1.8.1-1 golang-github-spf13-jwalterweatherman-dev_1.1.0+really1.1.0-2 golang-github-spf13-pflag-dev_1.0.6~git20210604-d5e0c0615ace-1 golang-github-spf13-viper-dev_1.12.0-1 golang-github-stretchr-objx-dev_0.5.2-1 golang-github-stretchr-testify-dev_1.10.0-1 golang-github-subosito-gotenv-dev_1.3.0-1 golang-github-yuin-goldmark-dev_1.7.4-1 golang-go_2:1.24~2 golang-golang-x-crypto-dev_1:0.25.0-1 golang-golang-x-mod-dev_0.19.0-1 golang-golang-x-net-dev_1:0.27.0-1 golang-golang-x-sync-dev_0.7.0-1 golang-golang-x-sys-dev_0.22.0-1 golang-golang-x-term-dev_0.22.0-1 golang-golang-x-text-dev_0.22.0-1 golang-golang-x-tools-dev_1:0.25.0+ds-1 golang-gopkg-check.v1-dev_0.0+git20200902.038fdea-2 golang-gopkg-ini.v1-dev_1.67.0-1 golang-gopkg-yaml.v2-dev_2.4.0-5 golang-gopkg-yaml.v3-dev_3.0.1-3 golang-k8s-sigs-yaml-dev_1.4.0-2 golang-mvdan-sh-dev_3.8.0-1 golang-src_2:1.24~2 grep_3.11-4 groff-base_1.23.0-7 gzip_1.13-1 help2man_1.49.3 hostname_3.25 init-system-helpers_1.68 intltool-debian_0.35.0+20060710.6 libacl1_2.3.2-2+b1 libapt-pkg7.0_2.9.35 libarchive-zip-perl_1.68-1 libasan8_14.2.0-19 libasan8-s390x-cross_14.2.0-19cross1 libatomic1_14.2.0-19 libatomic1-s390x-cross_14.2.0-19cross1 libattr1_1:2.5.2-3 libaudit-common_1:4.0.2-2 libaudit1_1:4.0.2-2+b2 libbinutils_2.44-3 libblkid1_2.40.4-5 libbsd0_0.12.2-2 libbz2-1.0_1.0.8-6 libc-bin_2.41-6 libc-dev-bin_2.41-6 libc6_2.41-6 libc6-dev_2.41-6 libc6-dev-s390x-cross_2.41-6cross2 libc6-s390x-cross_2.41-6cross2 libcap-ng0_0.8.5-4+b1 libcap2_1:2.75-4 libcc1-0_14.2.0-19 libcrypt-dev_1:4.4.38-1 libcrypt1_1:4.4.38-1 libctf-nobfd0_2.44-3 libctf0_2.44-3 libdb5.3t64_5.3.28+dfsg2-9 libdebconfclient0_0.277 libdebhelper-perl_13.24.2 libdpkg-perl_1.22.18 libelf1t64_0.192-4 libfakeroot_1.37.1.1-1 libfile-stripnondeterminism-perl_1.14.1-2 libgcc-14-dev_14.2.0-19 libgcc-14-dev-s390x-cross_14.2.0-19cross1 libgcc-s1_14.2.0-19 libgcc-s1-s390x-cross_14.2.0-19cross1 libgdbm-compat4t64_1.24-2 libgdbm6t64_1.24-2 libgmp10_2:6.3.0+dfsg-3 libgomp1_14.2.0-19 libgomp1-s390x-cross_14.2.0-19cross1 libgprofng0_2.44-3 libhogweed6t64_3.10.1-1 libhwasan0_14.2.0-19 libisl23_0.27-1 libitm1_14.2.0-19 libitm1-s390x-cross_14.2.0-19cross1 libjansson4_2.14-2+b3 liblocale-gettext-perl_1.07-7+b1 liblsan0_14.2.0-19 liblz4-1_1.10.0-4 liblzma5_5.6.4-1 libmagic-mgc_1:5.46-4 libmagic1t64_1:5.46-4 libmd0_1.1.0-2+b1 libmount1_2.40.4-5 libmpc3_1.3.1-1+b3 libmpfr6_4.2.2-1 libnettle8t64_3.10.1-1 libpam-modules_1.7.0-3 libpam-modules-bin_1.7.0-3 libpam-runtime_1.7.0-3 libpam0g_1.7.0-3 libpcre2-8-0_10.45-1 libperl5.40_5.40.1-2 libpipeline1_1.5.8-1 libquadmath0_14.2.0-19 libseccomp2_2.6.0-2 libselinux1_3.8.1-1 libsemanage-common_3.8.1-1 libsemanage2_3.8.1-1 libsepol2_3.8.1-1 libsframe1_2.44-3 libsmartcols1_2.40.4-5 libssl3t64_3.4.1-1 libstdc++-14-dev_14.2.0-19 libstdc++-14-dev-s390x-cross_14.2.0-19cross1 libstdc++6_14.2.0-19 libstdc++6-s390x-cross_14.2.0-19cross1 libsystemd0_257.4-7 libtinfo6_6.5+20250216-2 libtool_2.5.4-4 libtsan2_14.2.0-19 libubsan1_14.2.0-19 libubsan1-s390x-cross_14.2.0-19cross1 libuchardet0_0.0.8-1+b2 libudev1_257.4-7 libunistring5_1.3-2 libuuid1_2.40.4-5 libxml2_2.12.7+dfsg+really2.9.14-0.4 libxxhash0_0.8.3-2 libzstd1_1.5.7+dfsg-1 linux-libc-dev_6.12.20-1 linux-libc-dev-s390x-cross_6.12.17-1cross2 login_1:4.16.0-2+really2.40.4-5 login.defs_1:4.17.3-3 m4_1.4.19-7 make_4.4.1-1 man-db_2.13.0-1 mawk_1.3.4.20250131-1 mount_2.40.4-5 ncurses-base_6.5+20250216-2 ncurses-bin_6.5+20250216-2 openssl-provider-legacy_3.4.1-1 passwd_1:4.17.3-3 patch_2.7.6-7 perl_5.40.1-2 perl-base_5.40.1-2 perl-modules-5.40_5.40.1-2 po-debconf_1.0.21+nmu1 rpcsvc-proto_1.4.3-1 sbuild-build-depends-main-dummy_0.invalid.0 sed_4.9-2 sensible-utils_0.0.24 sqv_1.2.1-6+b1 sysvinit-utils_3.14-4 tar_1.35+dfsg-3.1 tzdata_2025b-1 tzdata-legacy_2025b-1 util-linux_2.40.4-5 xz-utils_5.6.4-1 zlib1g_1:1.3.dfsg+really1.3.1-1+b1

+------------------------------------------------------------------------------+
| Build                                                                        |
+------------------------------------------------------------------------------+


Unpack source
-------------

-----BEGIN PGP SIGNED MESSAGE-----
Hash: SHA512

Format: 3.0 (quilt)
Source: kind
Binary: kind
Architecture: any
Version: 0.27.0-1
Maintainer: Debian Kubernetes Packaging Team <team+kubernetes@tracker.debian.org>
Uploaders: Arthur Diniz <arthurbdiniz@gmail.com>
Homepage: https://github.com/kubernetes-sigs/kind
Standards-Version: 4.7.2
Vcs-Browser: https://salsa.debian.org/kubernetes-team/packages/kind
Vcs-Git: https://salsa.debian.org/kubernetes-team/packages/kind.git
Testsuite: autopkgtest-pkg-go
Build-Depends: debhelper-compat (= 13), dh-sequence-golang, golang-any, golang-github-burntsushi-toml-dev, golang-github-alessio-shellescape-dev, golang-github-evanphx-json-patch-dev, golang-github-google-safetext-dev, golang-github-mattn-go-isatty-dev, golang-github-pelletier-go-toml-dev, golang-github-pkg-errors-dev, golang-github-spf13-cobra-dev, golang-github-spf13-pflag-dev, golang-gopkg-yaml.v3-dev, golang-k8s-sigs-yaml-dev, help2man <!nodoc>
Package-List:
 kind deb devel optional arch=any
Checksums-Sha1:
 01b17e777b56750d246876e8ca2193118c6f9788 1938237 kind_0.27.0.orig.tar.gz
 bf59c967d2b853a5dc5c4a721b331f69859bd1ec 4044 kind_0.27.0-1.debian.tar.xz
Checksums-Sha256:
 841dd2fdc5c194e1ea49f36204cce33a943285862303713a1baa5d2073cdb0d9 1938237 kind_0.27.0.orig.tar.gz
 7150a9ea8b07f8a3b28dcca5090ad551a9a50be401fef9501aef1851be8a6dd6 4044 kind_0.27.0-1.debian.tar.xz
Files:
 afd39c837cb6aa906c0728148d8d96c5 1938237 kind_0.27.0.orig.tar.gz
 6407678b8d2ce7b2862bf7bbfb6f8abd 4044 kind_0.27.0-1.debian.tar.xz
Go-Import-Path: sigs.k8s.io/kind

-----BEGIN PGP SIGNATURE-----

iQJLBAEBCgA1FiEECOt4p/pKieBdXIaey86ybZa5jLsFAmfitxEXHGFydGh1cmJk
aW5pekBnbWFpbC5jb20ACgkQy86ybZa5jLucXQ//U0vJGlcuqd7eiyu5OLIEd9Vs
lD4u4e9yMc0auFM4l7o+VjtNZ5Mb9BxsJ9mWSwvSGSe3oxzGujURzG+23qGtEq6s
t7gmUCw8qbKZDeBrWyUyNtKonMiXJCQFd9UGG4vHnFf7PriDq9P4PVzCvjpsaHzF
l0mBUV67OfSuvQvWjKMBg6zRC54y5TpRBxNWc0ptEG6W9xhYpzd6BBMYZrqYGqcn
t68dpLftGPYvA272v4mZyCrg+AXziGVxiDisItQpnAqjRDpkoUpSIC34BKrpYe9+
dChGi8/Hy5nzrco7+M+g8BUGR99S0EW/WYhQ/IXKcR0DRNN9vzRicsAKalybQM+L
100FyGXLKxLklco+L4rEm+sPC3L4Gue+2MhyNomHDvXV/Y/d91hEWxZKoHmRB9Ha
nAX4l4hp5LmoiUcXrmxjt+vjaUfBZa3cfNb9LFEjpWSH0Dvzit9K2aKUQqVCLmMp
hY6pF8tXkBgLL0XWn7DTCdaLRYpkuWUzhdgl7FhnYDr22VsiJ2h2i5y/DFO6lmcC
qa5VVhkkbl4FSMtAL4nqi21xKgY9gitiF+axA+x2jJc4O8f1jgO1NK/jfdY8KsNT
skej/CqTjjvNcBtiIQhemwJ77N861eki8XX+2wLIeOQULlvelNp7LGXiQp7Vt4sL
Q4rN9wOmr8Sa9SlXcqE=
=OuwN
-----END PGP SIGNATURE-----

dpkg-source: warning: cannot verify inline signature for ./kind_0.27.0-1.dsc: unsupported subcommand
dpkg-source: info: extracting kind in /<<PKGBUILDDIR>>
dpkg-source: info: unpacking kind_0.27.0.orig.tar.gz
dpkg-source: info: unpacking kind_0.27.0-1.debian.tar.xz
dpkg-source: info: using patch list from debian/patches/series
dpkg-source: info: applying 0001-Workaround-shellescape-package-name-change.patch

Check disk space
----------------

Sufficient free space for build

User Environment
----------------

APT_CONFIG=/var/lib/sbuild/apt.conf
CONFIG_SITE=/etc/dpkg-cross/cross-config.s390x
DEB_BUILD_OPTIONS=nocheck
HOME=/sbuild-nonexistent
LANG=en_US.UTF-8
LC_ALL=C.UTF-8
LOGNAME=crossqa
OLDPWD=/home/crossqa
PATH=/usr/local/sbin:/usr/local/bin:/usr/sbin:/usr/bin:/sbin:/bin:/usr/games
SBUILD_CONFIG=/tmp/tmp.6z2FUkLTn6/sbuild.conf
SCHROOT_ALIAS_NAME=unstable-amd64-sbuild
SCHROOT_CHROOT_NAME=sid-amd64-sbuild
SCHROOT_COMMAND=env
SCHROOT_GID=1000
SCHROOT_GROUP=crossqa
SCHROOT_SESSION_ID=sid-amd64-sbuild-273a5c88-4f4b-4b5f-9c7a-2b120ae94901
SCHROOT_UID=1000
SCHROOT_USER=crossqa
SHELL=/bin/sh
USER=crossqa
XDG_SESSION_CLASS=user

dpkg-buildpackage
-----------------

Command: dpkg-buildpackage --sanitize-env -as390x -Pcross,nocheck -us -uc -B -rfakeroot --jobs-try=1
dpkg-buildpackage: info: source package kind
dpkg-buildpackage: info: source version 0.27.0-1
dpkg-buildpackage: info: source distribution unstable
dpkg-buildpackage: info: source changed by Arthur Diniz <arthurbdiniz@gmail.com>
dpkg-architecture: warning: specified GNU system type s390x-linux-gnu does not match CC system type x86_64-linux-gnu, try setting a correct CC environment variable
 dpkg-source --before-build .
dpkg-buildpackage: info: host architecture s390x
 debian/rules clean
dh clean --builddirectory=_build --buildsystem=golang
   dh_auto_clean -O--builddirectory=_build -O--buildsystem=golang
   dh_autoreconf_clean -O--builddirectory=_build -O--buildsystem=golang
   dh_clean -O--builddirectory=_build -O--buildsystem=golang
 debian/rules binary-arch
dh binary-arch --builddirectory=_build --buildsystem=golang
   dh_update_autotools_config -a -O--builddirectory=_build -O--buildsystem=golang
   dh_autoreconf -a -O--builddirectory=_build -O--buildsystem=golang
   dh_auto_configure -a -O--builddirectory=_build -O--buildsystem=golang
   debian/rules override_dh_auto_build
make[1]: Entering directory '/<<PKGBUILDDIR>>'
dh_auto_build -O --buildsystem=golang -- -buildmode=pie -ldflags="-extldflags -Wl,-z,now,-z,relro"
/usr/bin/go: 1: ELF: not found
/usr/bin/go: 2: Syntax error: word unexpected (expecting ")")
/usr/bin/go: 1: ELF: not found
/usr/bin/go: 2: Syntax error: word unexpected (expecting ")")
Use of uninitialized value $_gcc_major in multiplication (*) at /usr/share/perl5/Debian/Debhelper/Buildsystem/golang.pm line 477.
/usr/bin/go: 1: ELF: not found
/usr/bin/go: 2: Syntax error: word unexpected (expecting ")")
/usr/bin/go: 1: ELF: not found
/usr/bin/go: 2: Syntax error: word unexpected (expecting ")")
/usr/bin/go: 1: ELF: not found
/usr/bin/go: 2: Syntax error: word unexpected (expecting ")")
Use of uninitialized value $_gcc_major in multiplication (*) at /usr/share/perl5/Debian/Debhelper/Buildsystem/golang.pm line 477.
/usr/bin/go: 1: ELF: not found
/usr/bin/go: 2: Syntax error: word unexpected (expecting ")")
/usr/bin/go: 1: ELF: not found
/usr/bin/go: 2: Syntax error: word unexpected (expecting ")")
Use of uninitialized value $_gcc_major in multiplication (*) at /usr/share/perl5/Debian/Debhelper/Buildsystem/golang.pm line 477.
	cd _build && go install -v -p 1 -buildmode=pie "-ldflags=-extldflags -Wl,-z,now,-z,relro"
/usr/bin/go: 1: ELF: not found
/usr/bin/go: 2: Syntax error: word unexpected (expecting ")")
dh_auto_build: error: cd _build && go install -v -p 1 -buildmode=pie "-ldflags=-extldflags -Wl,-z,now,-z,relro" returned exit code 2
make[1]: *** [debian/rules:17: override_dh_auto_build] Error 25
make[1]: Leaving directory '/<<PKGBUILDDIR>>'
make: *** [debian/rules:14: binary-arch] Error 2
dpkg-buildpackage: error: debian/rules binary-arch subprocess returned exit status 2
--------------------------------------------------------------------------------
Build finished at 2025-03-30T07:35:38Z

+------------------------------------------------------------------------------+
| Finished Timed Build Commands                                                |
+------------------------------------------------------------------------------+


rm -Rf /<<PKGBUILDDIR>>/
--------------------------------------


I: Finished running 'rm -Rf /<<PKGBUILDDIR>>/'.

Finished processing commands.
--------------------------------------------------------------------------------

Finished
--------


+------------------------------------------------------------------------------+
| Cleanup                                                                      |
+------------------------------------------------------------------------------+

Purging /<<BUILDDIR>>
Not cleaning session: cloned chroot in use
E: Build failure (dpkg-buildpackage died)

+------------------------------------------------------------------------------+
| Summary                                                                      |
+------------------------------------------------------------------------------+

Build Architecture: amd64
Build Profiles: cross nocheck
Build Type: any
Build-Space: n/a
Build-Time: 1
Distribution: unstable
Fail-Stage: build
Foreign Architectures: s390x
Host Architecture: s390x
Install-Time: 12
Job: kind_0.27.0-1
Machine Architecture: amd64
Package: kind
Package-Time: 24
Source-Version: 0.27.0-1
Space: n/a
Status: attempted
Version: 0.27.0-1
--------------------------------------------------------------------------------
Finished at 2025-03-30T07:35:38Z
Build needed 00:00:24, no disk space