sbuild (Debian sbuild) 0.85.0 (04 January 2023) on debian-ci-siliconvalley

+==============================================================================+
| krb5 1.21.3-5 (riscv64)                      Fri, 28 Mar 2025 16:04:31 +0000 |
+==============================================================================+

Package: krb5
Version: 1.21.3-5
Source Version: 1.21.3-5
Distribution: unstable
Machine Architecture: amd64
Host Architecture: riscv64
Build Architecture: amd64
Build Profiles: cross nocheck
Build Type: any

I: NOTICE: Log filtering will replace 'var/run/schroot/mount/sid-amd64-sbuild-831f0c17-8c56-4d43-abb7-2ffdce7227f2' with '<<CHROOT>>'
I: NOTICE: Log filtering will replace 'build/krb5-PCKSYZ/resolver-xrt55o' with '<<RESOLVERDIR>>'

+------------------------------------------------------------------------------+
| Update chroot                                                                |
+------------------------------------------------------------------------------+

Get:1 http://localhost:3142/debian unstable InRelease [205 kB]
Get:2 http://localhost:3142/debian unstable/main Sources.diff/Index [63.6 kB]
Get:3 http://localhost:3142/debian unstable/main amd64 Packages.diff/Index [63.6 kB]
Get:4 http://localhost:3142/debian unstable/main Sources T-2025-03-28-1405.20-F-2025-03-28-0206.07.pdiff [53.7 kB]
Get:5 http://localhost:3142/debian unstable/main amd64 Packages T-2025-03-28-1405.20-F-2025-03-28-0206.07.pdiff [59.1 kB]
Get:4 http://localhost:3142/debian unstable/main Sources T-2025-03-28-1405.20-F-2025-03-28-0206.07.pdiff [53.7 kB]
Get:5 http://localhost:3142/debian unstable/main amd64 Packages T-2025-03-28-1405.20-F-2025-03-28-0206.07.pdiff [59.1 kB]
Get:6 http://localhost:3142/debian unstable/main riscv64 Packages [9734 kB]
Fetched 10.2 MB in 3s (3652 kB/s)
Reading package lists...
Reading package lists...
Building dependency tree...
Reading state information...
Calculating upgrade...
The following packages will be upgraded:
  apt apt-utils libapt-pkg7.0 libsystemd0 libudev1 login.defs passwd
7 upgraded, 0 newly installed, 0 to remove and 0 not upgraded.
Need to get 4912 kB of archives.
After this operation, 2048 B of additional disk space will be used.
Get:1 http://localhost:3142/debian unstable/main amd64 libsystemd0 amd64 257.4-5 [452 kB]
Get:2 http://localhost:3142/debian unstable/main amd64 libudev1 amd64 257.4-5 [150 kB]
Get:3 http://localhost:3142/debian unstable/main amd64 libapt-pkg7.0 amd64 2.9.35 [1112 kB]
Get:4 http://localhost:3142/debian unstable/main amd64 apt amd64 2.9.35 [1449 kB]
Get:5 http://localhost:3142/debian unstable/main amd64 apt-utils amd64 2.9.35 [335 kB]
Get:6 http://localhost:3142/debian unstable/main amd64 login.defs all 1:4.17.3-3 [186 kB]
Get:7 http://localhost:3142/debian unstable/main amd64 passwd amd64 1:4.17.3-3 [1228 kB]
Fetched 4912 kB in 0s (156 MB/s)
(Reading database ... 
(Reading database ... 5%
(Reading database ... 10%
(Reading database ... 15%
(Reading database ... 20%
(Reading database ... 25%
(Reading database ... 30%
(Reading database ... 35%
(Reading database ... 40%
(Reading database ... 45%
(Reading database ... 50%
(Reading database ... 55%
(Reading database ... 60%
(Reading database ... 65%
(Reading database ... 70%
(Reading database ... 75%
(Reading database ... 80%
(Reading database ... 85%
(Reading database ... 90%
(Reading database ... 95%
(Reading database ... 100%
(Reading database ... 12837 files and directories currently installed.)
Preparing to unpack .../libsystemd0_257.4-5_amd64.deb ...
Unpacking libsystemd0:amd64 (257.4-5) over (257.4-3) ...
Setting up libsystemd0:amd64 (257.4-5) ...
(Reading database ... 
(Reading database ... 5%
(Reading database ... 10%
(Reading database ... 15%
(Reading database ... 20%
(Reading database ... 25%
(Reading database ... 30%
(Reading database ... 35%
(Reading database ... 40%
(Reading database ... 45%
(Reading database ... 50%
(Reading database ... 55%
(Reading database ... 60%
(Reading database ... 65%
(Reading database ... 70%
(Reading database ... 75%
(Reading database ... 80%
(Reading database ... 85%
(Reading database ... 90%
(Reading database ... 95%
(Reading database ... 100%
(Reading database ... 12837 files and directories currently installed.)
Preparing to unpack .../libudev1_257.4-5_amd64.deb ...
Unpacking libudev1:amd64 (257.4-5) over (257.4-3) ...
Setting up libudev1:amd64 (257.4-5) ...
(Reading database ... 
(Reading database ... 5%
(Reading database ... 10%
(Reading database ... 15%
(Reading database ... 20%
(Reading database ... 25%
(Reading database ... 30%
(Reading database ... 35%
(Reading database ... 40%
(Reading database ... 45%
(Reading database ... 50%
(Reading database ... 55%
(Reading database ... 60%
(Reading database ... 65%
(Reading database ... 70%
(Reading database ... 75%
(Reading database ... 80%
(Reading database ... 85%
(Reading database ... 90%
(Reading database ... 95%
(Reading database ... 100%
(Reading database ... 12837 files and directories currently installed.)
Preparing to unpack .../libapt-pkg7.0_2.9.35_amd64.deb ...
Unpacking libapt-pkg7.0:amd64 (2.9.35) over (2.9.34) ...
Setting up libapt-pkg7.0:amd64 (2.9.35) ...
(Reading database ... 
(Reading database ... 5%
(Reading database ... 10%
(Reading database ... 15%
(Reading database ... 20%
(Reading database ... 25%
(Reading database ... 30%
(Reading database ... 35%
(Reading database ... 40%
(Reading database ... 45%
(Reading database ... 50%
(Reading database ... 55%
(Reading database ... 60%
(Reading database ... 65%
(Reading database ... 70%
(Reading database ... 75%
(Reading database ... 80%
(Reading database ... 85%
(Reading database ... 90%
(Reading database ... 95%
(Reading database ... 100%
(Reading database ... 12837 files and directories currently installed.)
Preparing to unpack .../archives/apt_2.9.35_amd64.deb ...
Unpacking apt (2.9.35) over (2.9.34) ...
Setting up apt (2.9.35) ...
(Reading database ... 
(Reading database ... 5%
(Reading database ... 10%
(Reading database ... 15%
(Reading database ... 20%
(Reading database ... 25%
(Reading database ... 30%
(Reading database ... 35%
(Reading database ... 40%
(Reading database ... 45%
(Reading database ... 50%
(Reading database ... 55%
(Reading database ... 60%
(Reading database ... 65%
(Reading database ... 70%
(Reading database ... 75%
(Reading database ... 80%
(Reading database ... 85%
(Reading database ... 90%
(Reading database ... 95%
(Reading database ... 100%
(Reading database ... 12837 files and directories currently installed.)
Preparing to unpack .../apt-utils_2.9.35_amd64.deb ...
Unpacking apt-utils (2.9.35) over (2.9.34) ...
Preparing to unpack .../login.defs_1%3a4.17.3-3_all.deb ...
Unpacking login.defs (1:4.17.3-3) over (1:4.17.3-2) ...
Preparing to unpack .../passwd_1%3a4.17.3-3_amd64.deb ...
Unpacking passwd (1:4.17.3-3) over (1:4.17.3-2) ...
Setting up apt-utils (2.9.35) ...
Setting up login.defs (1:4.17.3-3) ...
Setting up passwd (1:4.17.3-3) ...
Processing triggers for libc-bin (2.41-6) ...

+------------------------------------------------------------------------------+
| Fetch source files                                                           |
+------------------------------------------------------------------------------+


Check APT
---------

Checking available source versions...

Download source files with APT
------------------------------

Reading package lists...
NOTICE: 'krb5' packaging is maintained in the 'Git' version control system at:
https://salsa.debian.org/debian/krb5
Please use:
git clone https://salsa.debian.org/debian/krb5
to retrieve the latest (possibly unreleased) updates to the package.
Need to get 9245 kB of source archives.
Get:1 http://localhost:3142/debian unstable/main krb5 1.21.3-5 (dsc) [3983 B]
Get:2 http://localhost:3142/debian unstable/main krb5 1.21.3-5 (tar) [9136 kB]
Get:3 http://localhost:3142/debian unstable/main krb5 1.21.3-5 (asc) [833 B]
Get:4 http://localhost:3142/debian unstable/main krb5 1.21.3-5 (diff) [104 kB]
Fetched 9245 kB in 0s (43.3 MB/s)
Download complete and in download only mode
I: NOTICE: Log filtering will replace 'build/krb5-PCKSYZ/krb5-1.21.3' with '<<PKGBUILDDIR>>'
I: NOTICE: Log filtering will replace 'build/krb5-PCKSYZ' with '<<BUILDDIR>>'

+------------------------------------------------------------------------------+
| Install package build dependencies                                           |
+------------------------------------------------------------------------------+


Setup apt archive
-----------------

Merged Build-Depends: byacc | bison, comerr-dev, debhelper-compat (= 13), docbook-to-man, dpkg-dev (>= 1.22.5), libkeyutils-dev, libldap2-dev, liblmdb-dev, libnss-myhostname, libsasl2-dev, libssl-dev, libverto-dev, pkgconf, ss-dev, libc-dev, libstdc++-dev, build-essential:amd64, fakeroot:amd64, crossbuild-essential-riscv64:amd64, libc-dev:riscv64, libstdc++-dev:riscv64, dpkg-dev (>= 1.22.5)
Filtered Build-Depends: byacc, comerr-dev, debhelper-compat (= 13), docbook-to-man, dpkg-dev (>= 1.22.5), libkeyutils-dev, libldap2-dev, liblmdb-dev, libnss-myhostname, libsasl2-dev, libssl-dev, libverto-dev, pkgconf, ss-dev, libc-dev, libstdc++-dev, build-essential:amd64, fakeroot:amd64, crossbuild-essential-riscv64:amd64, libc-dev:riscv64, libstdc++-dev:riscv64, dpkg-dev (>= 1.22.5)
dpkg-deb: warning: root directory /<<RESOLVERDIR>>/sbuild-build-depends-main-dummy has unusual owner or group 1000:119
dpkg-deb: hint: you might need to pass --root-owner-group, see <https://wiki.debian.org/Teams/Dpkg/RootlessBuilds> for further details
dpkg-deb: warning: ignoring 1 warning about the control file(s)
dpkg-deb: building package 'sbuild-build-depends-main-dummy' in '/<<RESOLVERDIR>>/apt_archive/sbuild-build-depends-main-dummy.deb'.
Ign:1 copy:/<<RESOLVERDIR>>/apt_archive ./ InRelease
Get:2 copy:/<<RESOLVERDIR>>/apt_archive ./ Release [612 B]
Ign:3 copy:/<<RESOLVERDIR>>/apt_archive ./ Release.gpg
Get:4 copy:/<<RESOLVERDIR>>/apt_archive ./ Sources [1092 B]
Get:5 copy:/<<RESOLVERDIR>>/apt_archive ./ Packages [965 B]
Fetched 2669 B in 0s (0 B/s)
Reading package lists...
Reading package lists...

Install main build dependencies (apt-based resolver)
----------------------------------------------------

Installing build dependencies
Reading package lists...
Building dependency tree...
Reading state information...
Execute external solver...
The following additional packages will be installed:
  autoconf automake autopoint autotools-dev binutils-riscv64-linux-gnu
  bsdextrautils byacc comerr-dev:riscv64 cpp-14-riscv64-linux-gnu
  cpp-riscv64-linux-gnu crossbuild-essential-riscv64 debhelper dh-autoreconf
  dh-strip-nondeterminism docbook docbook-to-man dwz fakeroot file
  g++-14-riscv64-linux-gnu g++-riscv64-linux-gnu gcc-14-base:riscv64
  gcc-14-cross-base gcc-14-riscv64-linux-gnu gcc-14-riscv64-linux-gnu-base
  gcc-riscv64-linux-gnu gettext gettext-base groff-base intltool-debian
  libarchive-zip-perl libasan8:riscv64 libasan8-riscv64-cross
  libatomic1:riscv64 libatomic1-riscv64-cross libblkid1:riscv64 libc6:riscv64
  libc6-dev:riscv64 libc6-dev-riscv64-cross libc6-riscv64-cross
  libcap2:riscv64 libcom-err2:riscv64 libcrypt-dev:riscv64 libcrypt1:riscv64
  libdb5.3t64:riscv64 libdebhelper-perl libelf1t64 libev4t64:riscv64
  libfakeroot libffi8:riscv64 libfile-stripnondeterminism-perl
  libgcc-14-dev:riscv64 libgcc-14-dev-riscv64-cross libgcc-s1:riscv64
  libgcc-s1-riscv64-cross libglib2.0-0t64:riscv64 libgomp1:riscv64
  libgomp1-riscv64-cross libitm1:riscv64 libitm1-riscv64-cross
  libkeyutils-dev:riscv64 libkeyutils1:riscv64 libldap-dev:riscv64
  libldap2:riscv64 liblmdb-dev:riscv64 liblmdb0:riscv64 liblsan0:riscv64
  liblsan0-riscv64-cross libmagic-mgc libmagic1t64 libmount1:riscv64
  libnss-myhostname:riscv64 libosp5 libpcre2-8-0:riscv64 libpipeline1
  libpkgconf3 libsasl2-2:riscv64 libsasl2-dev:riscv64
  libsasl2-modules-db:riscv64 libselinux1:riscv64 libss2:riscv64
  libssl-dev:riscv64 libssl3t64:riscv64 libstdc++-14-dev:riscv64
  libstdc++-14-dev-riscv64-cross libstdc++6:riscv64 libstdc++6-riscv64-cross
  libtool libtsan2:riscv64 libtsan2-riscv64-cross libubsan1:riscv64
  libubsan1-riscv64-cross libuchardet0 libunistring5 libverto-dev:riscv64
  libverto-glib1t64:riscv64 libverto-libev1t64:riscv64 libverto1t64:riscv64
  libxml2 libzstd1:riscv64 linux-libc-dev-riscv64-cross m4 man-db opensp
  pkgconf:riscv64 pkgconf-bin po-debconf sensible-utils sgml-base sgml-data
  ss-dev:riscv64 xml-core zlib1g:riscv64
Suggested packages:
  autoconf-archive gnu-standards autoconf-doc binutils-doc doc-base:riscv64
  gcc-14-locales cpp-14-doc cpp-doc dh-make docbook-defguide docbook-dsssl
  docbook-xml psgml gcc-14-doc manpages-dev flex bison gdb-riscv64-linux-gnu
  gcc-doc gettext-doc libasprintf-dev libgettextpo-dev groff glibc-doc:riscv64
  libc-l10n:riscv64 locales:riscv64 libnss-nis:riscv64 libnss-nisplus:riscv64
  manpages-dev:riscv64 low-memory-monitor:riscv64 cryptsetup-bin:riscv64
  libssl-doc:riscv64 libstdc++-14-doc:riscv64 libtool-doc gfortran
  | fortran95-compiler gcj-jdk m4-doc apparmor less www-browser doc-base
  libmail-box-perl sgml-base-doc perlsgml w3-recs libxml2-utils
Recommended packages:
  curl | wget | lynx libidn2-0:riscv64 libarchive-cpio-perl
  libglib2.0-data:riscv64 shared-mime-info:riscv64 xdg-user-dirs:riscv64
  libldap-common:riscv64 lmdb-doc:riscv64 libsasl2-modules:riscv64 libltdl-dev
  libmail-sendmail-perl
The following NEW packages will be installed:
  autoconf automake autopoint autotools-dev binutils-riscv64-linux-gnu
  bsdextrautils byacc comerr-dev:riscv64 cpp-14-riscv64-linux-gnu
  cpp-riscv64-linux-gnu crossbuild-essential-riscv64 debhelper dh-autoreconf
  dh-strip-nondeterminism docbook docbook-to-man dwz fakeroot file
  g++-14-riscv64-linux-gnu g++-riscv64-linux-gnu gcc-14-base:riscv64
  gcc-14-cross-base gcc-14-riscv64-linux-gnu gcc-14-riscv64-linux-gnu-base
  gcc-riscv64-linux-gnu gettext gettext-base groff-base intltool-debian
  libarchive-zip-perl libasan8:riscv64 libasan8-riscv64-cross
  libatomic1:riscv64 libatomic1-riscv64-cross libblkid1:riscv64 libc6:riscv64
  libc6-dev:riscv64 libc6-dev-riscv64-cross libc6-riscv64-cross
  libcap2:riscv64 libcom-err2:riscv64 libcrypt-dev:riscv64 libcrypt1:riscv64
  libdb5.3t64:riscv64 libdebhelper-perl libelf1t64 libev4t64:riscv64
  libfakeroot libffi8:riscv64 libfile-stripnondeterminism-perl
  libgcc-14-dev:riscv64 libgcc-14-dev-riscv64-cross libgcc-s1:riscv64
  libgcc-s1-riscv64-cross libglib2.0-0t64:riscv64 libgomp1:riscv64
  libgomp1-riscv64-cross libitm1:riscv64 libitm1-riscv64-cross
  libkeyutils-dev:riscv64 libkeyutils1:riscv64 libldap-dev:riscv64
  libldap2:riscv64 liblmdb-dev:riscv64 liblmdb0:riscv64 liblsan0:riscv64
  liblsan0-riscv64-cross libmagic-mgc libmagic1t64 libmount1:riscv64
  libnss-myhostname:riscv64 libosp5 libpcre2-8-0:riscv64 libpipeline1
  libpkgconf3 libsasl2-2:riscv64 libsasl2-dev:riscv64
  libsasl2-modules-db:riscv64 libselinux1:riscv64 libss2:riscv64
  libssl-dev:riscv64 libssl3t64:riscv64 libstdc++-14-dev:riscv64
  libstdc++-14-dev-riscv64-cross libstdc++6:riscv64 libstdc++6-riscv64-cross
  libtool libtsan2:riscv64 libtsan2-riscv64-cross libubsan1:riscv64
  libubsan1-riscv64-cross libuchardet0 libunistring5 libverto-dev:riscv64
  libverto-glib1t64:riscv64 libverto-libev1t64:riscv64 libverto1t64:riscv64
  libxml2 libzstd1:riscv64 linux-libc-dev-riscv64-cross m4 man-db opensp
  pkgconf:riscv64 pkgconf-bin po-debconf
  sbuild-build-depends-main-dummy:riscv64 sensible-utils sgml-base sgml-data
  ss-dev:riscv64 xml-core zlib1g:riscv64
0 upgraded, 114 newly installed, 0 to remove and 0 not upgraded.
Need to get 129 MB of archives.
After this operation, 701 MB of additional disk space will be used.
Get:1 copy:/<<RESOLVERDIR>>/apt_archive ./ sbuild-build-depends-main-dummy 0.invalid.0 [1012 B]
Get:2 http://localhost:3142/debian unstable/main amd64 sgml-base all 1.31 [15.4 kB]
Get:3 http://localhost:3142/debian unstable/main amd64 sensible-utils all 0.0.24 [24.8 kB]
Get:4 http://localhost:3142/debian unstable/main amd64 libmagic-mgc amd64 1:5.46-3 [337 kB]
Get:5 http://localhost:3142/debian unstable/main amd64 libmagic1t64 amd64 1:5.46-3 [109 kB]
Get:6 http://localhost:3142/debian unstable/main amd64 file amd64 1:5.46-3 [43.5 kB]
Get:7 http://localhost:3142/debian unstable/main amd64 gettext-base amd64 0.23.1-1 [243 kB]
Get:8 http://localhost:3142/debian unstable/main amd64 libuchardet0 amd64 0.0.8-1+b2 [68.9 kB]
Get:9 http://localhost:3142/debian unstable/main amd64 groff-base amd64 1.23.0-7 [1185 kB]
Get:10 http://localhost:3142/debian unstable/main amd64 bsdextrautils amd64 2.40.4-5 [92.4 kB]
Get:11 http://localhost:3142/debian unstable/main amd64 libpipeline1 amd64 1.5.8-1 [42.0 kB]
Get:12 http://localhost:3142/debian unstable/main amd64 man-db amd64 2.13.0-1 [1420 kB]
Get:13 http://localhost:3142/debian unstable/main amd64 m4 amd64 1.4.19-7 [294 kB]
Get:14 http://localhost:3142/debian unstable/main amd64 autoconf all 2.72-3 [493 kB]
Get:15 http://localhost:3142/debian unstable/main amd64 autotools-dev all 20240727.1 [60.2 kB]
Get:16 http://localhost:3142/debian unstable/main amd64 automake all 1:1.17-4 [862 kB]
Get:17 http://localhost:3142/debian unstable/main amd64 autopoint all 0.23.1-1 [770 kB]
Get:18 http://localhost:3142/debian unstable/main amd64 binutils-riscv64-linux-gnu amd64 2.44-3 [1428 kB]
Get:19 http://localhost:3142/debian unstable/main amd64 byacc amd64 1:2.0.20241231-1 [126 kB]
Get:20 http://localhost:3142/debian unstable/main riscv64 gcc-14-base riscv64 14.2.0-19 [49.4 kB]
Get:21 http://localhost:3142/debian unstable/main riscv64 libgcc-s1 riscv64 14.2.0-19 [56.8 kB]
Get:22 http://localhost:3142/debian unstable/main riscv64 libc6 riscv64 2.41-6 [2465 kB]
Get:23 http://localhost:3142/debian unstable/main riscv64 libcrypt1 riscv64 1:4.4.38-1 [106 kB]
Get:24 http://localhost:3142/debian unstable/main riscv64 libcrypt-dev riscv64 1:4.4.38-1 [221 kB]
Get:25 http://localhost:3142/debian unstable/main riscv64 libc6-dev riscv64 2.41-6 [3127 kB]
Get:26 http://localhost:3142/debian unstable/main riscv64 libcom-err2 riscv64 1.47.2-1+b1 [24.0 kB]
Get:27 http://localhost:3142/debian unstable/main riscv64 comerr-dev riscv64 2.1-1.47.2-1+b1 [59.4 kB]
Get:28 http://localhost:3142/debian unstable/main amd64 gcc-14-riscv64-linux-gnu-base amd64 14.2.0-19cross1 [49.6 kB]
Get:29 http://localhost:3142/debian unstable/main amd64 cpp-14-riscv64-linux-gnu amd64 14.2.0-19cross1 [13.3 MB]
Get:30 http://localhost:3142/debian unstable/main amd64 cpp-riscv64-linux-gnu amd64 4:14.2.0-1 [4848 B]
Get:31 http://localhost:3142/debian unstable/main amd64 gcc-14-cross-base all 14.2.0-19cross1 [44.9 kB]
Get:32 http://localhost:3142/debian unstable/main amd64 libc6-riscv64-cross all 2.41-6cross2 [1169 kB]
Get:33 http://localhost:3142/debian unstable/main amd64 libgcc-s1-riscv64-cross all 14.2.0-19cross1 [56.8 kB]
Get:34 http://localhost:3142/debian unstable/main amd64 libgomp1-riscv64-cross all 14.2.0-19cross1 [128 kB]
Get:35 http://localhost:3142/debian unstable/main amd64 libitm1-riscv64-cross all 14.2.0-19cross1 [25.2 kB]
Get:36 http://localhost:3142/debian unstable/main amd64 libatomic1-riscv64-cross all 14.2.0-19cross1 [8316 B]
Get:37 http://localhost:3142/debian unstable/main amd64 libasan8-riscv64-cross all 14.2.0-19cross1 [2354 kB]
Get:38 http://localhost:3142/debian unstable/main amd64 liblsan0-riscv64-cross all 14.2.0-19cross1 [1076 kB]
Get:39 http://localhost:3142/debian unstable/main amd64 libtsan2-riscv64-cross all 14.2.0-19cross1 [2230 kB]
Get:40 http://localhost:3142/debian unstable/main amd64 libstdc++6-riscv64-cross all 14.2.0-19cross1 [660 kB]
Get:41 http://localhost:3142/debian unstable/main amd64 libubsan1-riscv64-cross all 14.2.0-19cross1 [978 kB]
Get:42 http://localhost:3142/debian unstable/main amd64 libgcc-14-dev-riscv64-cross all 14.2.0-19cross1 [5178 kB]
Get:43 http://localhost:3142/debian unstable/main amd64 gcc-14-riscv64-linux-gnu amd64 14.2.0-19cross1 [25.7 MB]
Get:44 http://localhost:3142/debian unstable/main amd64 gcc-riscv64-linux-gnu amd64 4:14.2.0-1 [1444 B]
Get:45 http://localhost:3142/debian unstable/main amd64 linux-libc-dev-riscv64-cross all 6.12.17-1cross2 [2339 kB]
Get:46 http://localhost:3142/debian unstable/main amd64 libc6-dev-riscv64-cross all 2.41-6cross2 [3123 kB]
Get:47 http://localhost:3142/debian unstable/main amd64 libstdc++-14-dev-riscv64-cross all 14.2.0-19cross1 [4940 kB]
Get:48 http://localhost:3142/debian unstable/main amd64 g++-14-riscv64-linux-gnu amd64 14.2.0-19cross1 [14.3 MB]
Get:49 http://localhost:3142/debian unstable/main amd64 g++-riscv64-linux-gnu amd64 4:14.2.0-1 [1200 B]
Get:50 http://localhost:3142/debian unstable/main amd64 crossbuild-essential-riscv64 all 12.12 [3544 B]
Get:51 http://localhost:3142/debian unstable/main amd64 libdebhelper-perl all 13.24.1 [90.9 kB]
Get:52 http://localhost:3142/debian unstable/main amd64 libtool all 2.5.4-4 [539 kB]
Get:53 http://localhost:3142/debian unstable/main amd64 dh-autoreconf all 20 [17.1 kB]
Get:54 http://localhost:3142/debian unstable/main amd64 libarchive-zip-perl all 1.68-1 [104 kB]
Get:55 http://localhost:3142/debian unstable/main amd64 libfile-stripnondeterminism-perl all 1.14.1-2 [19.7 kB]
Get:56 http://localhost:3142/debian unstable/main amd64 dh-strip-nondeterminism all 1.14.1-2 [8620 B]
Get:57 http://localhost:3142/debian unstable/main amd64 libelf1t64 amd64 0.192-4 [189 kB]
Get:58 http://localhost:3142/debian unstable/main amd64 dwz amd64 0.15-1+b1 [110 kB]
Get:59 http://localhost:3142/debian unstable/main amd64 libunistring5 amd64 1.3-2 [477 kB]
Get:60 http://localhost:3142/debian unstable/main amd64 libxml2 amd64 2.12.7+dfsg+really2.9.14-0.4 [698 kB]
Get:61 http://localhost:3142/debian unstable/main amd64 gettext amd64 0.23.1-1 [1680 kB]
Get:62 http://localhost:3142/debian unstable/main amd64 intltool-debian all 0.35.0+20060710.6 [22.9 kB]
Get:63 http://localhost:3142/debian unstable/main amd64 po-debconf all 1.0.21+nmu1 [248 kB]
Get:64 http://localhost:3142/debian unstable/main amd64 debhelper all 13.24.1 [920 kB]
Get:65 http://localhost:3142/debian unstable/main amd64 xml-core all 0.19 [20.1 kB]
Get:66 http://localhost:3142/debian unstable/main amd64 sgml-data all 2.0.11+nmu1 [179 kB]
Get:67 http://localhost:3142/debian unstable/main amd64 docbook all 4.5-11 [126 kB]
Get:68 http://localhost:3142/debian unstable/main amd64 libosp5 amd64 1.5.2-15.2 [972 kB]
Get:69 http://localhost:3142/debian unstable/main amd64 opensp amd64 1.5.2-15.2 [448 kB]
Get:70 http://localhost:3142/debian unstable/main amd64 docbook-to-man amd64 1:2.0.0-48 [74.2 kB]
Get:71 http://localhost:3142/debian unstable/main amd64 libfakeroot amd64 1.37.1.1-1 [29.6 kB]
Get:72 http://localhost:3142/debian unstable/main amd64 fakeroot amd64 1.37.1.1-1 [76.0 kB]
Get:73 http://localhost:3142/debian unstable/main riscv64 libasan8 riscv64 14.2.0-19 [2365 kB]
Get:74 http://localhost:3142/debian unstable/main riscv64 libatomic1 riscv64 14.2.0-19 [8672 B]
Get:75 http://localhost:3142/debian unstable/main riscv64 libblkid1 riscv64 2.40.4-5 [191 kB]
Get:76 http://localhost:3142/debian unstable/main riscv64 libcap2 riscv64 1:2.75-4 [28.4 kB]
Get:77 http://localhost:3142/debian unstable/main riscv64 libdb5.3t64 riscv64 5.3.28+dfsg2-9 [716 kB]
Get:78 http://localhost:3142/debian unstable/main riscv64 libev4t64 riscv64 1:4.33-2.1+b1 [42.3 kB]
Get:79 http://localhost:3142/debian unstable/main riscv64 libffi8 riscv64 3.4.7-1 [21.6 kB]
Get:80 http://localhost:3142/debian unstable/main riscv64 libgomp1 riscv64 14.2.0-19 [130 kB]
Get:81 http://localhost:3142/debian unstable/main riscv64 libitm1 riscv64 14.2.0-19 [25.8 kB]
Get:82 http://localhost:3142/debian unstable/main riscv64 liblsan0 riscv64 14.2.0-19 [1078 kB]
Get:83 http://localhost:3142/debian unstable/main riscv64 libtsan2 riscv64 14.2.0-19 [2241 kB]
Get:84 http://localhost:3142/debian unstable/main riscv64 libstdc++6 riscv64 14.2.0-19 [707 kB]
Get:85 http://localhost:3142/debian unstable/main riscv64 libubsan1 riscv64 14.2.0-19 [979 kB]
Get:86 http://localhost:3142/debian unstable/main riscv64 libgcc-14-dev riscv64 14.2.0-19 [5190 kB]
Get:87 http://localhost:3142/debian unstable/main riscv64 libpcre2-8-0 riscv64 10.45-1 [300 kB]
Get:88 http://localhost:3142/debian unstable/main riscv64 libselinux1 riscv64 3.8.1-1 [88.1 kB]
Get:89 http://localhost:3142/debian unstable/main riscv64 libmount1 riscv64 2.40.4-5 [217 kB]
Get:90 http://localhost:3142/debian unstable/main riscv64 zlib1g riscv64 1:1.3.dfsg+really1.3.1-1+b1 [85.7 kB]
Get:91 http://localhost:3142/debian unstable/main riscv64 libglib2.0-0t64 riscv64 2.84.0-2 [1524 kB]
Get:92 http://localhost:3142/debian unstable/main riscv64 libkeyutils1 riscv64 1.6.3-4 [9124 B]
Get:93 http://localhost:3142/debian unstable/main riscv64 libkeyutils-dev riscv64 1.6.3-4 [54.0 kB]
Get:94 http://localhost:3142/debian unstable/main riscv64 libsasl2-modules-db riscv64 2.1.28+dfsg1-9 [20.5 kB]
Get:95 http://localhost:3142/debian unstable/main riscv64 libzstd1 riscv64 1.5.7+dfsg-1 [360 kB]
Get:96 http://localhost:3142/debian unstable/main riscv64 libssl3t64 riscv64 3.4.1-1 [2098 kB]
Get:97 http://localhost:3142/debian unstable/main riscv64 libsasl2-2 riscv64 2.1.28+dfsg1-9 [60.9 kB]
Get:98 http://localhost:3142/debian unstable/main riscv64 libldap2 riscv64 2.6.9+dfsg-2 [196 kB]
Get:99 http://localhost:3142/debian unstable/main riscv64 libldap-dev riscv64 2.6.9+dfsg-2 [581 kB]
Get:100 http://localhost:3142/debian unstable/main riscv64 liblmdb0 riscv64 0.9.31-1+b2 [48.9 kB]
Get:101 http://localhost:3142/debian unstable/main riscv64 liblmdb-dev riscv64 0.9.31-1+b2 [117 kB]
Get:102 http://localhost:3142/debian unstable/main riscv64 libnss-myhostname riscv64 257.4-3 [111 kB]
Get:103 http://localhost:3142/debian unstable/main amd64 libpkgconf3 amd64 1.8.1-4 [36.4 kB]
Get:104 http://localhost:3142/debian unstable/main riscv64 libssl-dev riscv64 3.4.1-1 [5399 kB]
Get:105 http://localhost:3142/debian unstable/main riscv64 libsasl2-dev riscv64 2.1.28+dfsg1-9 [416 kB]
Get:106 http://localhost:3142/debian unstable/main riscv64 libss2 riscv64 1.47.2-1+b1 [28.8 kB]
Get:107 http://localhost:3142/debian unstable/main riscv64 libstdc++-14-dev riscv64 14.2.0-19 [5276 kB]
Get:108 http://localhost:3142/debian unstable/main riscv64 libverto-libev1t64 riscv64 0.3.1-1.2+b2 [6552 B]
Get:109 http://localhost:3142/debian unstable/main riscv64 libverto-glib1t64 riscv64 0.3.1-1.2+b2 [6996 B]
Get:110 http://localhost:3142/debian unstable/main riscv64 libverto1t64 riscv64 0.3.1-1.2+b2 [12.0 kB]
Get:111 http://localhost:3142/debian unstable/main riscv64 libverto-dev riscv64 0.3.1-1.2+b2 [34.6 kB]
Get:112 http://localhost:3142/debian unstable/main amd64 pkgconf-bin amd64 1.8.1-4 [30.2 kB]
Get:113 http://localhost:3142/debian unstable/main riscv64 pkgconf riscv64 1.8.1-4 [26.1 kB]
Get:114 http://localhost:3142/debian unstable/main riscv64 ss-dev riscv64 2.0-1.47.2-1+b1 [45.0 kB]
Preconfiguring packages ...
Fetched 129 MB in 2s (58.7 MB/s)
Selecting previously unselected package sgml-base.
(Reading database ... 12837 files and directories currently installed.)
Preparing to unpack .../000-sgml-base_1.31_all.deb ...
Unpacking sgml-base (1.31) ...
Selecting previously unselected package sensible-utils.
Preparing to unpack .../001-sensible-utils_0.0.24_all.deb ...
Unpacking sensible-utils (0.0.24) ...
Selecting previously unselected package libmagic-mgc.
Preparing to unpack .../002-libmagic-mgc_1%3a5.46-3_amd64.deb ...
Unpacking libmagic-mgc (1:5.46-3) ...
Selecting previously unselected package libmagic1t64:amd64.
Preparing to unpack .../003-libmagic1t64_1%3a5.46-3_amd64.deb ...
Unpacking libmagic1t64:amd64 (1:5.46-3) ...
Selecting previously unselected package file.
Preparing to unpack .../004-file_1%3a5.46-3_amd64.deb ...
Unpacking file (1:5.46-3) ...
Selecting previously unselected package gettext-base.
Preparing to unpack .../005-gettext-base_0.23.1-1_amd64.deb ...
Unpacking gettext-base (0.23.1-1) ...
Selecting previously unselected package libuchardet0:amd64.
Preparing to unpack .../006-libuchardet0_0.0.8-1+b2_amd64.deb ...
Unpacking libuchardet0:amd64 (0.0.8-1+b2) ...
Selecting previously unselected package groff-base.
Preparing to unpack .../007-groff-base_1.23.0-7_amd64.deb ...
Unpacking groff-base (1.23.0-7) ...
Selecting previously unselected package bsdextrautils.
Preparing to unpack .../008-bsdextrautils_2.40.4-5_amd64.deb ...
Unpacking bsdextrautils (2.40.4-5) ...
Selecting previously unselected package libpipeline1:amd64.
Preparing to unpack .../009-libpipeline1_1.5.8-1_amd64.deb ...
Unpacking libpipeline1:amd64 (1.5.8-1) ...
Selecting previously unselected package man-db.
Preparing to unpack .../010-man-db_2.13.0-1_amd64.deb ...
Unpacking man-db (2.13.0-1) ...
Selecting previously unselected package m4.
Preparing to unpack .../011-m4_1.4.19-7_amd64.deb ...
Unpacking m4 (1.4.19-7) ...
Selecting previously unselected package autoconf.
Preparing to unpack .../012-autoconf_2.72-3_all.deb ...
Unpacking autoconf (2.72-3) ...
Selecting previously unselected package autotools-dev.
Preparing to unpack .../013-autotools-dev_20240727.1_all.deb ...
Unpacking autotools-dev (20240727.1) ...
Selecting previously unselected package automake.
Preparing to unpack .../014-automake_1%3a1.17-4_all.deb ...
Unpacking automake (1:1.17-4) ...
Selecting previously unselected package autopoint.
Preparing to unpack .../015-autopoint_0.23.1-1_all.deb ...
Unpacking autopoint (0.23.1-1) ...
Selecting previously unselected package binutils-riscv64-linux-gnu.
Preparing to unpack .../016-binutils-riscv64-linux-gnu_2.44-3_amd64.deb ...
Unpacking binutils-riscv64-linux-gnu (2.44-3) ...
Selecting previously unselected package byacc.
Preparing to unpack .../017-byacc_1%3a2.0.20241231-1_amd64.deb ...
Unpacking byacc (1:2.0.20241231-1) ...
Selecting previously unselected package gcc-14-base:riscv64.
Preparing to unpack .../018-gcc-14-base_14.2.0-19_riscv64.deb ...
Unpacking gcc-14-base:riscv64 (14.2.0-19) ...
Selecting previously unselected package libgcc-s1:riscv64.
Preparing to unpack .../019-libgcc-s1_14.2.0-19_riscv64.deb ...
Unpacking libgcc-s1:riscv64 (14.2.0-19) ...
Selecting previously unselected package libc6:riscv64.
Preparing to unpack .../020-libc6_2.41-6_riscv64.deb ...
Unpacking libc6:riscv64 (2.41-6) ...
Selecting previously unselected package libcrypt1:riscv64.
Preparing to unpack .../021-libcrypt1_1%3a4.4.38-1_riscv64.deb ...
Unpacking libcrypt1:riscv64 (1:4.4.38-1) ...
Selecting previously unselected package libcrypt-dev:riscv64.
Preparing to unpack .../022-libcrypt-dev_1%3a4.4.38-1_riscv64.deb ...
Unpacking libcrypt-dev:riscv64 (1:4.4.38-1) ...
Selecting previously unselected package libc6-dev:riscv64.
Preparing to unpack .../023-libc6-dev_2.41-6_riscv64.deb ...
Unpacking libc6-dev:riscv64 (2.41-6) ...
Selecting previously unselected package libcom-err2:riscv64.
Preparing to unpack .../024-libcom-err2_1.47.2-1+b1_riscv64.deb ...
Unpacking libcom-err2:riscv64 (1.47.2-1+b1) ...
Selecting previously unselected package comerr-dev:riscv64.
Preparing to unpack .../025-comerr-dev_2.1-1.47.2-1+b1_riscv64.deb ...
Unpacking comerr-dev:riscv64 (2.1-1.47.2-1+b1) ...
Selecting previously unselected package gcc-14-riscv64-linux-gnu-base:amd64.
Preparing to unpack .../026-gcc-14-riscv64-linux-gnu-base_14.2.0-19cross1_amd64.deb ...
Unpacking gcc-14-riscv64-linux-gnu-base:amd64 (14.2.0-19cross1) ...
Selecting previously unselected package cpp-14-riscv64-linux-gnu.
Preparing to unpack .../027-cpp-14-riscv64-linux-gnu_14.2.0-19cross1_amd64.deb ...
Unpacking cpp-14-riscv64-linux-gnu (14.2.0-19cross1) ...
Selecting previously unselected package cpp-riscv64-linux-gnu.
Preparing to unpack .../028-cpp-riscv64-linux-gnu_4%3a14.2.0-1_amd64.deb ...
Unpacking cpp-riscv64-linux-gnu (4:14.2.0-1) ...
Selecting previously unselected package gcc-14-cross-base.
Preparing to unpack .../029-gcc-14-cross-base_14.2.0-19cross1_all.deb ...
Unpacking gcc-14-cross-base (14.2.0-19cross1) ...
Selecting previously unselected package libc6-riscv64-cross.
Preparing to unpack .../030-libc6-riscv64-cross_2.41-6cross2_all.deb ...
Unpacking libc6-riscv64-cross (2.41-6cross2) ...
Selecting previously unselected package libgcc-s1-riscv64-cross.
Preparing to unpack .../031-libgcc-s1-riscv64-cross_14.2.0-19cross1_all.deb ...
Unpacking libgcc-s1-riscv64-cross (14.2.0-19cross1) ...
Selecting previously unselected package libgomp1-riscv64-cross.
Preparing to unpack .../032-libgomp1-riscv64-cross_14.2.0-19cross1_all.deb ...
Unpacking libgomp1-riscv64-cross (14.2.0-19cross1) ...
Selecting previously unselected package libitm1-riscv64-cross.
Preparing to unpack .../033-libitm1-riscv64-cross_14.2.0-19cross1_all.deb ...
Unpacking libitm1-riscv64-cross (14.2.0-19cross1) ...
Selecting previously unselected package libatomic1-riscv64-cross.
Preparing to unpack .../034-libatomic1-riscv64-cross_14.2.0-19cross1_all.deb ...
Unpacking libatomic1-riscv64-cross (14.2.0-19cross1) ...
Selecting previously unselected package libasan8-riscv64-cross.
Preparing to unpack .../035-libasan8-riscv64-cross_14.2.0-19cross1_all.deb ...
Unpacking libasan8-riscv64-cross (14.2.0-19cross1) ...
Selecting previously unselected package liblsan0-riscv64-cross.
Preparing to unpack .../036-liblsan0-riscv64-cross_14.2.0-19cross1_all.deb ...
Unpacking liblsan0-riscv64-cross (14.2.0-19cross1) ...
Selecting previously unselected package libtsan2-riscv64-cross.
Preparing to unpack .../037-libtsan2-riscv64-cross_14.2.0-19cross1_all.deb ...
Unpacking libtsan2-riscv64-cross (14.2.0-19cross1) ...
Selecting previously unselected package libstdc++6-riscv64-cross.
Preparing to unpack .../038-libstdc++6-riscv64-cross_14.2.0-19cross1_all.deb ...
Unpacking libstdc++6-riscv64-cross (14.2.0-19cross1) ...
Selecting previously unselected package libubsan1-riscv64-cross.
Preparing to unpack .../039-libubsan1-riscv64-cross_14.2.0-19cross1_all.deb ...
Unpacking libubsan1-riscv64-cross (14.2.0-19cross1) ...
Selecting previously unselected package libgcc-14-dev-riscv64-cross.
Preparing to unpack .../040-libgcc-14-dev-riscv64-cross_14.2.0-19cross1_all.deb ...
Unpacking libgcc-14-dev-riscv64-cross (14.2.0-19cross1) ...
Selecting previously unselected package gcc-14-riscv64-linux-gnu.
Preparing to unpack .../041-gcc-14-riscv64-linux-gnu_14.2.0-19cross1_amd64.deb ...
Unpacking gcc-14-riscv64-linux-gnu (14.2.0-19cross1) ...
Selecting previously unselected package gcc-riscv64-linux-gnu.
Preparing to unpack .../042-gcc-riscv64-linux-gnu_4%3a14.2.0-1_amd64.deb ...
Unpacking gcc-riscv64-linux-gnu (4:14.2.0-1) ...
Selecting previously unselected package linux-libc-dev-riscv64-cross.
Preparing to unpack .../043-linux-libc-dev-riscv64-cross_6.12.17-1cross2_all.deb ...
Unpacking linux-libc-dev-riscv64-cross (6.12.17-1cross2) ...
Selecting previously unselected package libc6-dev-riscv64-cross.
Preparing to unpack .../044-libc6-dev-riscv64-cross_2.41-6cross2_all.deb ...
Unpacking libc6-dev-riscv64-cross (2.41-6cross2) ...
Selecting previously unselected package libstdc++-14-dev-riscv64-cross.
Preparing to unpack .../045-libstdc++-14-dev-riscv64-cross_14.2.0-19cross1_all.deb ...
Unpacking libstdc++-14-dev-riscv64-cross (14.2.0-19cross1) ...
Selecting previously unselected package g++-14-riscv64-linux-gnu.
Preparing to unpack .../046-g++-14-riscv64-linux-gnu_14.2.0-19cross1_amd64.deb ...
Unpacking g++-14-riscv64-linux-gnu (14.2.0-19cross1) ...
Selecting previously unselected package g++-riscv64-linux-gnu.
Preparing to unpack .../047-g++-riscv64-linux-gnu_4%3a14.2.0-1_amd64.deb ...
Unpacking g++-riscv64-linux-gnu (4:14.2.0-1) ...
Selecting previously unselected package crossbuild-essential-riscv64.
Preparing to unpack .../048-crossbuild-essential-riscv64_12.12_all.deb ...
Unpacking crossbuild-essential-riscv64 (12.12) ...
Selecting previously unselected package libdebhelper-perl.
Preparing to unpack .../049-libdebhelper-perl_13.24.1_all.deb ...
Unpacking libdebhelper-perl (13.24.1) ...
Selecting previously unselected package libtool.
Preparing to unpack .../050-libtool_2.5.4-4_all.deb ...
Unpacking libtool (2.5.4-4) ...
Selecting previously unselected package dh-autoreconf.
Preparing to unpack .../051-dh-autoreconf_20_all.deb ...
Unpacking dh-autoreconf (20) ...
Selecting previously unselected package libarchive-zip-perl.
Preparing to unpack .../052-libarchive-zip-perl_1.68-1_all.deb ...
Unpacking libarchive-zip-perl (1.68-1) ...
Selecting previously unselected package libfile-stripnondeterminism-perl.
Preparing to unpack .../053-libfile-stripnondeterminism-perl_1.14.1-2_all.deb ...
Unpacking libfile-stripnondeterminism-perl (1.14.1-2) ...
Selecting previously unselected package dh-strip-nondeterminism.
Preparing to unpack .../054-dh-strip-nondeterminism_1.14.1-2_all.deb ...
Unpacking dh-strip-nondeterminism (1.14.1-2) ...
Selecting previously unselected package libelf1t64:amd64.
Preparing to unpack .../055-libelf1t64_0.192-4_amd64.deb ...
Unpacking libelf1t64:amd64 (0.192-4) ...
Selecting previously unselected package dwz.
Preparing to unpack .../056-dwz_0.15-1+b1_amd64.deb ...
Unpacking dwz (0.15-1+b1) ...
Selecting previously unselected package libunistring5:amd64.
Preparing to unpack .../057-libunistring5_1.3-2_amd64.deb ...
Unpacking libunistring5:amd64 (1.3-2) ...
Selecting previously unselected package libxml2:amd64.
Preparing to unpack .../058-libxml2_2.12.7+dfsg+really2.9.14-0.4_amd64.deb ...
Unpacking libxml2:amd64 (2.12.7+dfsg+really2.9.14-0.4) ...
Selecting previously unselected package gettext.
Preparing to unpack .../059-gettext_0.23.1-1_amd64.deb ...
Unpacking gettext (0.23.1-1) ...
Selecting previously unselected package intltool-debian.
Preparing to unpack .../060-intltool-debian_0.35.0+20060710.6_all.deb ...
Unpacking intltool-debian (0.35.0+20060710.6) ...
Selecting previously unselected package po-debconf.
Preparing to unpack .../061-po-debconf_1.0.21+nmu1_all.deb ...
Unpacking po-debconf (1.0.21+nmu1) ...
Selecting previously unselected package debhelper.
Preparing to unpack .../062-debhelper_13.24.1_all.deb ...
Unpacking debhelper (13.24.1) ...
Selecting previously unselected package xml-core.
Preparing to unpack .../063-xml-core_0.19_all.deb ...
Unpacking xml-core (0.19) ...
Selecting previously unselected package sgml-data.
Preparing to unpack .../064-sgml-data_2.0.11+nmu1_all.deb ...
Unpacking sgml-data (2.0.11+nmu1) ...
Selecting previously unselected package docbook.
Preparing to unpack .../065-docbook_4.5-11_all.deb ...
Unpacking docbook (4.5-11) ...
Selecting previously unselected package libosp5.
Preparing to unpack .../066-libosp5_1.5.2-15.2_amd64.deb ...
Unpacking libosp5 (1.5.2-15.2) ...
Selecting previously unselected package opensp.
Preparing to unpack .../067-opensp_1.5.2-15.2_amd64.deb ...
Unpacking opensp (1.5.2-15.2) ...
Selecting previously unselected package docbook-to-man.
Preparing to unpack .../068-docbook-to-man_1%3a2.0.0-48_amd64.deb ...
Unpacking docbook-to-man (1:2.0.0-48) ...
Selecting previously unselected package libfakeroot:amd64.
Preparing to unpack .../069-libfakeroot_1.37.1.1-1_amd64.deb ...
Unpacking libfakeroot:amd64 (1.37.1.1-1) ...
Selecting previously unselected package fakeroot.
Preparing to unpack .../070-fakeroot_1.37.1.1-1_amd64.deb ...
Unpacking fakeroot (1.37.1.1-1) ...
Selecting previously unselected package libasan8:riscv64.
Preparing to unpack .../071-libasan8_14.2.0-19_riscv64.deb ...
Unpacking libasan8:riscv64 (14.2.0-19) ...
Selecting previously unselected package libatomic1:riscv64.
Preparing to unpack .../072-libatomic1_14.2.0-19_riscv64.deb ...
Unpacking libatomic1:riscv64 (14.2.0-19) ...
Selecting previously unselected package libblkid1:riscv64.
Preparing to unpack .../073-libblkid1_2.40.4-5_riscv64.deb ...
Unpacking libblkid1:riscv64 (2.40.4-5) ...
Selecting previously unselected package libcap2:riscv64.
Preparing to unpack .../074-libcap2_1%3a2.75-4_riscv64.deb ...
Unpacking libcap2:riscv64 (1:2.75-4) ...
Selecting previously unselected package libdb5.3t64:riscv64.
Preparing to unpack .../075-libdb5.3t64_5.3.28+dfsg2-9_riscv64.deb ...
Unpacking libdb5.3t64:riscv64 (5.3.28+dfsg2-9) ...
Selecting previously unselected package libev4t64:riscv64.
Preparing to unpack .../076-libev4t64_1%3a4.33-2.1+b1_riscv64.deb ...
Unpacking libev4t64:riscv64 (1:4.33-2.1+b1) ...
Selecting previously unselected package libffi8:riscv64.
Preparing to unpack .../077-libffi8_3.4.7-1_riscv64.deb ...
Unpacking libffi8:riscv64 (3.4.7-1) ...
Selecting previously unselected package libgomp1:riscv64.
Preparing to unpack .../078-libgomp1_14.2.0-19_riscv64.deb ...
Unpacking libgomp1:riscv64 (14.2.0-19) ...
Selecting previously unselected package libitm1:riscv64.
Preparing to unpack .../079-libitm1_14.2.0-19_riscv64.deb ...
Unpacking libitm1:riscv64 (14.2.0-19) ...
Selecting previously unselected package liblsan0:riscv64.
Preparing to unpack .../080-liblsan0_14.2.0-19_riscv64.deb ...
Unpacking liblsan0:riscv64 (14.2.0-19) ...
Selecting previously unselected package libtsan2:riscv64.
Preparing to unpack .../081-libtsan2_14.2.0-19_riscv64.deb ...
Unpacking libtsan2:riscv64 (14.2.0-19) ...
Selecting previously unselected package libstdc++6:riscv64.
Preparing to unpack .../082-libstdc++6_14.2.0-19_riscv64.deb ...
Unpacking libstdc++6:riscv64 (14.2.0-19) ...
Selecting previously unselected package libubsan1:riscv64.
Preparing to unpack .../083-libubsan1_14.2.0-19_riscv64.deb ...
Unpacking libubsan1:riscv64 (14.2.0-19) ...
Selecting previously unselected package libgcc-14-dev:riscv64.
Preparing to unpack .../084-libgcc-14-dev_14.2.0-19_riscv64.deb ...
Unpacking libgcc-14-dev:riscv64 (14.2.0-19) ...
Selecting previously unselected package libpcre2-8-0:riscv64.
Preparing to unpack .../085-libpcre2-8-0_10.45-1_riscv64.deb ...
Unpacking libpcre2-8-0:riscv64 (10.45-1) ...
Selecting previously unselected package libselinux1:riscv64.
Preparing to unpack .../086-libselinux1_3.8.1-1_riscv64.deb ...
Unpacking libselinux1:riscv64 (3.8.1-1) ...
Selecting previously unselected package libmount1:riscv64.
Preparing to unpack .../087-libmount1_2.40.4-5_riscv64.deb ...
Unpacking libmount1:riscv64 (2.40.4-5) ...
Selecting previously unselected package zlib1g:riscv64.
Preparing to unpack .../088-zlib1g_1%3a1.3.dfsg+really1.3.1-1+b1_riscv64.deb ...
Unpacking zlib1g:riscv64 (1:1.3.dfsg+really1.3.1-1+b1) ...
Selecting previously unselected package libglib2.0-0t64:riscv64.
Preparing to unpack .../089-libglib2.0-0t64_2.84.0-2_riscv64.deb ...
Unpacking libglib2.0-0t64:riscv64 (2.84.0-2) ...
Selecting previously unselected package libkeyutils1:riscv64.
Preparing to unpack .../090-libkeyutils1_1.6.3-4_riscv64.deb ...
Unpacking libkeyutils1:riscv64 (1.6.3-4) ...
Selecting previously unselected package libkeyutils-dev:riscv64.
Preparing to unpack .../091-libkeyutils-dev_1.6.3-4_riscv64.deb ...
Unpacking libkeyutils-dev:riscv64 (1.6.3-4) ...
Selecting previously unselected package libsasl2-modules-db:riscv64.
Preparing to unpack .../092-libsasl2-modules-db_2.1.28+dfsg1-9_riscv64.deb ...
Unpacking libsasl2-modules-db:riscv64 (2.1.28+dfsg1-9) ...
Selecting previously unselected package libzstd1:riscv64.
Preparing to unpack .../093-libzstd1_1.5.7+dfsg-1_riscv64.deb ...
Unpacking libzstd1:riscv64 (1.5.7+dfsg-1) ...
Selecting previously unselected package libssl3t64:riscv64.
Preparing to unpack .../094-libssl3t64_3.4.1-1_riscv64.deb ...
Unpacking libssl3t64:riscv64 (3.4.1-1) ...
Selecting previously unselected package libsasl2-2:riscv64.
Preparing to unpack .../095-libsasl2-2_2.1.28+dfsg1-9_riscv64.deb ...
Unpacking libsasl2-2:riscv64 (2.1.28+dfsg1-9) ...
Selecting previously unselected package libldap2:riscv64.
Preparing to unpack .../096-libldap2_2.6.9+dfsg-2_riscv64.deb ...
Unpacking libldap2:riscv64 (2.6.9+dfsg-2) ...
Selecting previously unselected package libldap-dev:riscv64.
Preparing to unpack .../097-libldap-dev_2.6.9+dfsg-2_riscv64.deb ...
Unpacking libldap-dev:riscv64 (2.6.9+dfsg-2) ...
Selecting previously unselected package liblmdb0:riscv64.
Preparing to unpack .../098-liblmdb0_0.9.31-1+b2_riscv64.deb ...
Unpacking liblmdb0:riscv64 (0.9.31-1+b2) ...
Selecting previously unselected package liblmdb-dev:riscv64.
Preparing to unpack .../099-liblmdb-dev_0.9.31-1+b2_riscv64.deb ...
Unpacking liblmdb-dev:riscv64 (0.9.31-1+b2) ...
Selecting previously unselected package libnss-myhostname:riscv64.
Preparing to unpack .../100-libnss-myhostname_257.4-3_riscv64.deb ...
Unpacking libnss-myhostname:riscv64 (257.4-3) ...
Selecting previously unselected package libpkgconf3:amd64.
Preparing to unpack .../101-libpkgconf3_1.8.1-4_amd64.deb ...
Unpacking libpkgconf3:amd64 (1.8.1-4) ...
Selecting previously unselected package libssl-dev:riscv64.
Preparing to unpack .../102-libssl-dev_3.4.1-1_riscv64.deb ...
Unpacking libssl-dev:riscv64 (3.4.1-1) ...
Selecting previously unselected package libsasl2-dev:riscv64.
Preparing to unpack .../103-libsasl2-dev_2.1.28+dfsg1-9_riscv64.deb ...
Unpacking libsasl2-dev:riscv64 (2.1.28+dfsg1-9) ...
Selecting previously unselected package libss2:riscv64.
Preparing to unpack .../104-libss2_1.47.2-1+b1_riscv64.deb ...
Unpacking libss2:riscv64 (1.47.2-1+b1) ...
Selecting previously unselected package libstdc++-14-dev:riscv64.
Preparing to unpack .../105-libstdc++-14-dev_14.2.0-19_riscv64.deb ...
Unpacking libstdc++-14-dev:riscv64 (14.2.0-19) ...
Selecting previously unselected package libverto-libev1t64:riscv64.
Preparing to unpack .../106-libverto-libev1t64_0.3.1-1.2+b2_riscv64.deb ...
Unpacking libverto-libev1t64:riscv64 (0.3.1-1.2+b2) ...
Selecting previously unselected package libverto-glib1t64:riscv64.
Preparing to unpack .../107-libverto-glib1t64_0.3.1-1.2+b2_riscv64.deb ...
Unpacking libverto-glib1t64:riscv64 (0.3.1-1.2+b2) ...
Selecting previously unselected package libverto1t64:riscv64.
Preparing to unpack .../108-libverto1t64_0.3.1-1.2+b2_riscv64.deb ...
Unpacking libverto1t64:riscv64 (0.3.1-1.2+b2) ...
Selecting previously unselected package libverto-dev:riscv64.
Preparing to unpack .../109-libverto-dev_0.3.1-1.2+b2_riscv64.deb ...
Unpacking libverto-dev:riscv64 (0.3.1-1.2+b2) ...
Selecting previously unselected package pkgconf-bin.
Preparing to unpack .../110-pkgconf-bin_1.8.1-4_amd64.deb ...
Unpacking pkgconf-bin (1.8.1-4) ...
Selecting previously unselected package pkgconf:riscv64.
Preparing to unpack .../111-pkgconf_1.8.1-4_riscv64.deb ...
Unpacking pkgconf:riscv64 (1.8.1-4) ...
Selecting previously unselected package ss-dev:riscv64.
Preparing to unpack .../112-ss-dev_2.0-1.47.2-1+b1_riscv64.deb ...
Unpacking ss-dev:riscv64 (2.0-1.47.2-1+b1) ...
Selecting previously unselected package sbuild-build-depends-main-dummy:riscv64.
Preparing to unpack .../113-sbuild-build-depends-main-dummy_0.invalid.0_riscv64.deb ...
Unpacking sbuild-build-depends-main-dummy:riscv64 (0.invalid.0) ...
Setting up libpipeline1:amd64 (1.5.8-1) ...
Setting up bsdextrautils (2.40.4-5) ...
Setting up libmagic-mgc (1:5.46-3) ...
Setting up gcc-14-base:riscv64 (14.2.0-19) ...
Setting up libarchive-zip-perl (1.68-1) ...
Setting up libdebhelper-perl (13.24.1) ...
Setting up libmagic1t64:amd64 (1:5.46-3) ...
Setting up gettext-base (0.23.1-1) ...
Setting up binutils-riscv64-linux-gnu (2.44-3) ...
Setting up m4 (1.4.19-7) ...
Setting up gcc-14-cross-base (14.2.0-19cross1) ...
Setting up file (1:5.46-3) ...
Setting up libfakeroot:amd64 (1.37.1.1-1) ...
Setting up libelf1t64:amd64 (0.192-4) ...
Setting up libosp5 (1.5.2-15.2) ...
Setting up fakeroot (1.37.1.1-1) ...
update-alternatives: using /usr/bin/fakeroot-sysv to provide /usr/bin/fakeroot (fakeroot) in auto mode
Setting up autotools-dev (20240727.1) ...
Setting up byacc (1:2.0.20241231-1) ...
update-alternatives: using /usr/bin/byacc to provide /usr/bin/yacc (yacc) in auto mode
Setting up libpkgconf3:amd64 (1.8.1-4) ...
Setting up gcc-14-riscv64-linux-gnu-base:amd64 (14.2.0-19cross1) ...
Setting up libunistring5:amd64 (1.3-2) ...
Setting up autopoint (0.23.1-1) ...
Setting up pkgconf-bin (1.8.1-4) ...
Setting up autoconf (2.72-3) ...
Setting up dwz (0.15-1+b1) ...
Setting up sensible-utils (0.0.24) ...
Setting up libuchardet0:amd64 (0.0.8-1+b2) ...
Setting up linux-libc-dev-riscv64-cross (6.12.17-1cross2) ...
Setting up libc6-riscv64-cross (2.41-6cross2) ...
Setting up sgml-base (1.31) ...
Setting up libgomp1-riscv64-cross (14.2.0-19cross1) ...
Setting up libatomic1-riscv64-cross (14.2.0-19cross1) ...
Setting up libxml2:amd64 (2.12.7+dfsg+really2.9.14-0.4) ...
Setting up automake (1:1.17-4) ...
update-alternatives: using /usr/bin/automake-1.17 to provide /usr/bin/automake (automake) in auto mode
Setting up libfile-stripnondeterminism-perl (1.14.1-2) ...
Setting up gettext (0.23.1-1) ...
Setting up libtool (2.5.4-4) ...
Setting up libitm1-riscv64-cross (14.2.0-19cross1) ...
Setting up cpp-14-riscv64-linux-gnu (14.2.0-19cross1) ...
Setting up opensp (1.5.2-15.2) ...
Setting up pkgconf:riscv64 (1.8.1-4) ...
Setting up intltool-debian (0.35.0+20060710.6) ...
Setting up dh-autoreconf (20) ...
Setting up libgcc-s1-riscv64-cross (14.2.0-19cross1) ...
Setting up dh-strip-nondeterminism (1.14.1-2) ...
Setting up groff-base (1.23.0-7) ...
Setting up libc6-dev-riscv64-cross (2.41-6cross2) ...
Setting up xml-core (0.19) ...
Setting up libasan8-riscv64-cross (14.2.0-19cross1) ...
Setting up cpp-riscv64-linux-gnu (4:14.2.0-1) ...
Setting up libstdc++6-riscv64-cross (14.2.0-19cross1) ...
Setting up libubsan1-riscv64-cross (14.2.0-19cross1) ...
Setting up po-debconf (1.0.21+nmu1) ...
Setting up liblsan0-riscv64-cross (14.2.0-19cross1) ...
Setting up libtsan2-riscv64-cross (14.2.0-19cross1) ...
Setting up man-db (2.13.0-1) ...
Not building database; man-db/auto-update is not 'true'.
Setting up libgcc-14-dev-riscv64-cross (14.2.0-19cross1) ...
Setting up libstdc++-14-dev-riscv64-cross (14.2.0-19cross1) ...
Setting up debhelper (13.24.1) ...
Setting up gcc-14-riscv64-linux-gnu (14.2.0-19cross1) ...
Setting up g++-14-riscv64-linux-gnu (14.2.0-19cross1) ...
Setting up gcc-riscv64-linux-gnu (4:14.2.0-1) ...
Setting up g++-riscv64-linux-gnu (4:14.2.0-1) ...
Setting up crossbuild-essential-riscv64 (12.12) ...
Setting up libgcc-s1:riscv64 (14.2.0-19) ...
Setting up libc6:riscv64 (2.41-6) ...
Setting up libdb5.3t64:riscv64 (5.3.28+dfsg2-9) ...
Setting up libffi8:riscv64 (3.4.7-1) ...
Setting up libasan8:riscv64 (14.2.0-19) ...
Setting up libtsan2:riscv64 (14.2.0-19) ...
Setting up libblkid1:riscv64 (2.40.4-5) ...
Setting up libstdc++6:riscv64 (14.2.0-19) ...
Setting up liblsan0:riscv64 (14.2.0-19) ...
Setting up libitm1:riscv64 (14.2.0-19) ...
Setting up liblmdb0:riscv64 (0.9.31-1+b2) ...
Setting up libev4t64:riscv64 (1:4.33-2.1+b1) ...
Setting up libzstd1:riscv64 (1.5.7+dfsg-1) ...
Setting up libkeyutils1:riscv64 (1.6.3-4) ...
Setting up zlib1g:riscv64 (1:1.3.dfsg+really1.3.1-1+b1) ...
Setting up libcrypt1:riscv64 (1:4.4.38-1) ...
Setting up libcom-err2:riscv64 (1.47.2-1+b1) ...
Setting up libgomp1:riscv64 (14.2.0-19) ...
Setting up libcap2:riscv64 (1:2.75-4) ...
Setting up libsasl2-modules-db:riscv64 (2.1.28+dfsg1-9) ...
Setting up libverto1t64:riscv64 (0.3.1-1.2+b2) ...
Setting up libatomic1:riscv64 (14.2.0-19) ...
Setting up libss2:riscv64 (1.47.2-1+b1) ...
Setting up libnss-myhostname:riscv64 (257.4-3) ...
Setting up libpcre2-8-0:riscv64 (10.45-1) ...
Setting up liblmdb-dev:riscv64 (0.9.31-1+b2) ...
Setting up libubsan1:riscv64 (14.2.0-19) ...
Setting up libkeyutils-dev:riscv64 (1.6.3-4) ...
Setting up libcrypt-dev:riscv64 (1:4.4.38-1) ...
Setting up libverto-libev1t64:riscv64 (0.3.1-1.2+b2) ...
Setting up libc6-dev:riscv64 (2.41-6) ...
Setting up libgcc-14-dev:riscv64 (14.2.0-19) ...
Setting up libstdc++-14-dev:riscv64 (14.2.0-19) ...
Setting up libssl3t64:riscv64 (3.4.1-1) ...
Setting up libselinux1:riscv64 (3.8.1-1) ...
Setting up comerr-dev:riscv64 (2.1-1.47.2-1+b1) ...
Setting up libssl-dev:riscv64 (3.4.1-1) ...
Setting up libsasl2-2:riscv64 (2.1.28+dfsg1-9) ...
Setting up libmount1:riscv64 (2.40.4-5) ...
Setting up libldap2:riscv64 (2.6.9+dfsg-2) ...
Setting up libglib2.0-0t64:riscv64 (2.84.0-2) ...
/var/lib/dpkg/info/libglib2.0-0t64:riscv64.postinst: 37: /usr/lib/riscv64-linux-gnu/glib-2.0/glib-compile-schemas: Exec format error
/var/lib/dpkg/info/libglib2.0-0t64:riscv64.postinst: 38: /usr/lib/riscv64-linux-gnu/glib-2.0/gio-querymodules: Exec format error
Setting up libsasl2-dev:riscv64 (2.1.28+dfsg1-9) ...
Setting up ss-dev:riscv64 (2.0-1.47.2-1+b1) ...
Setting up libldap-dev:riscv64 (2.6.9+dfsg-2) ...
Setting up libverto-glib1t64:riscv64 (0.3.1-1.2+b2) ...
Setting up libverto-dev:riscv64 (0.3.1-1.2+b2) ...
Processing triggers for libc-bin (2.41-6) ...
Processing triggers for sgml-base (1.31) ...
Setting up sgml-data (2.0.11+nmu1) ...
Processing triggers for sgml-base (1.31) ...
Setting up docbook (4.5-11) ...
Processing triggers for sgml-base (1.31) ...
Setting up docbook-to-man (1:2.0.0-48) ...
Setting up sbuild-build-depends-main-dummy:riscv64 (0.invalid.0) ...

+------------------------------------------------------------------------------+
| Check architectures                                                          |
+------------------------------------------------------------------------------+

Arch check ok (riscv64 included in any all)

+------------------------------------------------------------------------------+
| Build environment                                                            |
+------------------------------------------------------------------------------+

Kernel: Linux 6.1.0-31-amd64 #1 SMP PREEMPT_DYNAMIC Debian 6.1.128-1 (2025-02-07) amd64 (x86_64)
Toolchain package versions: binutils_2.44-3 dpkg-dev_1.22.18 g++-14_14.2.0-19 gcc-14_14.2.0-19 libc6-dev_2.41-6 libstdc++-14-dev_14.2.0-19 libstdc++-14-dev-riscv64-cross_14.2.0-19cross1 libstdc++6_14.2.0-19 libstdc++6-riscv64-cross_14.2.0-19cross1 linux-libc-dev_6.12.20-1
Package versions: apt_2.9.35 apt-utils_2.9.35 autoconf_2.72-3 automake_1:1.17-4 autopoint_0.23.1-1 autotools-dev_20240727.1 base-files_13.7 base-passwd_3.6.7 bash_5.2.37-1.1+b1 binutils_2.44-3 binutils-common_2.44-3 binutils-riscv64-linux-gnu_2.44-3 binutils-x86-64-linux-gnu_2.44-3 bsdextrautils_2.40.4-5 bsdutils_1:2.40.4-5 build-essential_12.12 byacc_1:2.0.20241231-1 bzip2_1.0.8-6 comerr-dev_2.1-1.47.2-1+b1 coreutils_9.5-1+b1 cpp_4:14.2.0-1 cpp-14_14.2.0-19 cpp-14-riscv64-linux-gnu_14.2.0-19cross1 cpp-14-x86-64-linux-gnu_14.2.0-19 cpp-riscv64-linux-gnu_4:14.2.0-1 cpp-x86-64-linux-gnu_4:14.2.0-1 crossbuild-essential-riscv64_12.12 dash_0.5.12-12 debconf_1.5.91 debhelper_13.24.1 debian-archive-keyring_2023.4 debianutils_5.21 dh-autoreconf_20 dh-strip-nondeterminism_1.14.1-2 diffutils_1:3.10-3 docbook_4.5-11 docbook-to-man_1:2.0.0-48 dpkg_1.22.18 dpkg-dev_1.22.18 dwz_0.15-1+b1 fakeroot_1.37.1.1-1 file_1:5.46-3 findutils_4.10.0-3 g++_4:14.2.0-1 g++-14_14.2.0-19 g++-14-riscv64-linux-gnu_14.2.0-19cross1 g++-14-x86-64-linux-gnu_14.2.0-19 g++-riscv64-linux-gnu_4:14.2.0-1 g++-x86-64-linux-gnu_4:14.2.0-1 gcc_4:14.2.0-1 gcc-14_14.2.0-19 gcc-14-base_14.2.0-19 gcc-14-cross-base_14.2.0-19cross1 gcc-14-riscv64-linux-gnu_14.2.0-19cross1 gcc-14-riscv64-linux-gnu-base_14.2.0-19cross1 gcc-14-x86-64-linux-gnu_14.2.0-19 gcc-riscv64-linux-gnu_4:14.2.0-1 gcc-x86-64-linux-gnu_4:14.2.0-1 gettext_0.23.1-1 gettext-base_0.23.1-1 grep_3.11-4 groff-base_1.23.0-7 gzip_1.13-1 hostname_3.25 init-system-helpers_1.68 intltool-debian_0.35.0+20060710.6 libacl1_2.3.2-2+b1 libapt-pkg7.0_2.9.35 libarchive-zip-perl_1.68-1 libasan8_14.2.0-19 libasan8-riscv64-cross_14.2.0-19cross1 libatomic1_14.2.0-19 libatomic1-riscv64-cross_14.2.0-19cross1 libattr1_1:2.5.2-3 libaudit-common_1:4.0.2-2 libaudit1_1:4.0.2-2+b2 libbinutils_2.44-3 libblkid1_2.40.4-5 libbsd0_0.12.2-2 libbz2-1.0_1.0.8-6 libc-bin_2.41-6 libc-dev-bin_2.41-6 libc6_2.41-6 libc6-dev_2.41-6 libc6-dev-riscv64-cross_2.41-6cross2 libc6-riscv64-cross_2.41-6cross2 libcap-ng0_0.8.5-4+b1 libcap2_1:2.75-4 libcc1-0_14.2.0-19 libcom-err2_1.47.2-1+b1 libcrypt-dev_1:4.4.38-1 libcrypt1_1:4.4.38-1 libctf-nobfd0_2.44-3 libctf0_2.44-3 libdb5.3t64_5.3.28+dfsg2-9 libdebconfclient0_0.277 libdebhelper-perl_13.24.1 libdpkg-perl_1.22.18 libelf1t64_0.192-4 libev4t64_1:4.33-2.1+b1 libfakeroot_1.37.1.1-1 libffi8_3.4.7-1 libfile-stripnondeterminism-perl_1.14.1-2 libgcc-14-dev_14.2.0-19 libgcc-14-dev-riscv64-cross_14.2.0-19cross1 libgcc-s1_14.2.0-19 libgcc-s1-riscv64-cross_14.2.0-19cross1 libgdbm-compat4t64_1.24-2 libgdbm6t64_1.24-2 libglib2.0-0t64_2.84.0-2 libgmp10_2:6.3.0+dfsg-3 libgomp1_14.2.0-19 libgomp1-riscv64-cross_14.2.0-19cross1 libgprofng0_2.44-3 libhogweed6t64_3.10.1-1 libhwasan0_14.2.0-19 libisl23_0.27-1 libitm1_14.2.0-19 libitm1-riscv64-cross_14.2.0-19cross1 libjansson4_2.14-2+b3 libkeyutils-dev_1.6.3-4 libkeyutils1_1.6.3-4 libldap-dev_2.6.9+dfsg-2 libldap2_2.6.9+dfsg-2 liblmdb-dev_0.9.31-1+b2 liblmdb0_0.9.31-1+b2 liblsan0_14.2.0-19 liblsan0-riscv64-cross_14.2.0-19cross1 liblz4-1_1.10.0-4 liblzma5_5.6.4-1 libmagic-mgc_1:5.46-3 libmagic1t64_1:5.46-3 libmd0_1.1.0-2+b1 libmount1_2.40.4-5 libmpc3_1.3.1-1+b3 libmpfr6_4.2.2-1 libnettle8t64_3.10.1-1 libnss-myhostname_257.4-3 libosp5_1.5.2-15.2 libpam-modules_1.7.0-3 libpam-modules-bin_1.7.0-3 libpam-runtime_1.7.0-3 libpam0g_1.7.0-3 libpcre2-8-0_10.45-1 libperl5.40_5.40.1-2 libpipeline1_1.5.8-1 libpkgconf3_1.8.1-4 libquadmath0_14.2.0-19 libsasl2-2_2.1.28+dfsg1-9 libsasl2-dev_2.1.28+dfsg1-9 libsasl2-modules-db_2.1.28+dfsg1-9 libseccomp2_2.6.0-2 libselinux1_3.8.1-1 libsemanage-common_3.8.1-1 libsemanage2_3.8.1-1 libsepol2_3.8.1-1 libsframe1_2.44-3 libsmartcols1_2.40.4-5 libss2_1.47.2-1+b1 libssl-dev_3.4.1-1 libssl3t64_3.4.1-1 libstdc++-14-dev_14.2.0-19 libstdc++-14-dev-riscv64-cross_14.2.0-19cross1 libstdc++6_14.2.0-19 libstdc++6-riscv64-cross_14.2.0-19cross1 libsystemd0_257.4-5 libtinfo6_6.5+20250216-2 libtool_2.5.4-4 libtsan2_14.2.0-19 libtsan2-riscv64-cross_14.2.0-19cross1 libubsan1_14.2.0-19 libubsan1-riscv64-cross_14.2.0-19cross1 libuchardet0_0.0.8-1+b2 libudev1_257.4-5 libunistring5_1.3-2 libuuid1_2.40.4-5 libverto-dev_0.3.1-1.2+b2 libverto-glib1t64_0.3.1-1.2+b2 libverto-libev1t64_0.3.1-1.2+b2 libverto1t64_0.3.1-1.2+b2 libxml2_2.12.7+dfsg+really2.9.14-0.4 libxxhash0_0.8.3-2 libzstd1_1.5.7+dfsg-1 linux-libc-dev_6.12.20-1 linux-libc-dev-riscv64-cross_6.12.17-1cross2 login_1:4.16.0-2+really2.40.4-5 login.defs_1:4.17.3-3 m4_1.4.19-7 make_4.4.1-1 man-db_2.13.0-1 mawk_1.3.4.20250131-1 mount_2.40.4-5 ncurses-base_6.5+20250216-2 ncurses-bin_6.5+20250216-2 opensp_1.5.2-15.2 openssl-provider-legacy_3.4.1-1 passwd_1:4.17.3-3 patch_2.7.6-7 perl_5.40.1-2 perl-base_5.40.1-2 perl-modules-5.40_5.40.1-2 pkgconf_1.8.1-4 pkgconf-bin_1.8.1-4 po-debconf_1.0.21+nmu1 rpcsvc-proto_1.4.3-1 sbuild-build-depends-main-dummy_0.invalid.0 sed_4.9-2 sensible-utils_0.0.24 sgml-base_1.31 sgml-data_2.0.11+nmu1 sqv_1.2.1-6+b1 ss-dev_2.0-1.47.2-1+b1 sysvinit-utils_3.14-4 tar_1.35+dfsg-3.1 tzdata_2025b-1 util-linux_2.40.4-5 xml-core_0.19 xz-utils_5.6.4-1 zlib1g_1:1.3.dfsg+really1.3.1-1+b1

+------------------------------------------------------------------------------+
| Build                                                                        |
+------------------------------------------------------------------------------+


Unpack source
-------------

-----BEGIN PGP SIGNED MESSAGE-----
Hash: SHA512

Format: 3.0 (quilt)
Source: krb5
Binary: krb5-user, krb5-kdc, krb5-kdc-ldap, krb5-admin-server, krb5-kpropd, krb5-multidev, libkrb5-dev, libkrb5-dbg, krb5-pkinit, krb5-otp, krb5-k5tls, krb5-doc, libkrb5-3, libgssapi-krb5-2, libgssrpc4t64, libkadm5srv-mit12, libkadm5clnt-mit12, libk5crypto3, libkdb5-10t64, libkrb5support0, libkrad0, krb5-gss-samples, krb5-locales, libkrad-dev
Architecture: any all
Version: 1.21.3-5
Maintainer: Sam Hartman <hartmans@debian.org>
Uploaders: Russ Allbery <rra@debian.org>, Benjamin Kaduk <kaduk@mit.edu>
Homepage: https://web.mit.edu/kerberos/
Standards-Version: 4.7.0
Vcs-Browser: https://salsa.debian.org/debian/krb5
Vcs-Git: https://salsa.debian.org/debian/krb5
Testsuite: autopkgtest
Testsuite-Triggers: ldap-utils, libsasl2-modules-gssapi-mit, slapd
Build-Depends: byacc | bison, comerr-dev, debhelper-compat (= 13), docbook-to-man, dpkg-dev (>= 1.22.5), libkeyutils-dev [linux-any], libldap2-dev <!stage1>, liblmdb-dev, libnss-myhostname, libsasl2-dev <!stage1>, libssl-dev, libverto-dev, pkgconf, ss-dev
Build-Depends-Arch: dpkg-dev (>= 1.22.5), keyutils [linux-any] <!nocheck>, libcmocka-dev <!nocheck>, python3-kdcproxy <!nocheck>, python3-pyrad <!nocheck>
Build-Depends-Indep: doxygen, doxygen-latex, python3, python3-cheetah, python3-lxml, python3-sphinx, tex-gyre
Package-List:
 krb5-admin-server deb net optional arch=any
 krb5-doc deb doc optional arch=all
 krb5-gss-samples deb net optional arch=any
 krb5-k5tls deb net optional arch=any
 krb5-kdc deb net optional arch=any
 krb5-kdc-ldap deb net optional arch=any profile=!stage1
 krb5-kpropd deb net optional arch=any
 krb5-locales deb localization optional arch=all
 krb5-multidev deb libdevel optional arch=any
 krb5-otp deb net optional arch=any
 krb5-pkinit deb net optional arch=any
 krb5-user deb net optional arch=any
 libgssapi-krb5-2 deb libs optional arch=any
 libgssrpc4t64 deb libs optional arch=any
 libk5crypto3 deb libs optional arch=any
 libkadm5clnt-mit12 deb libs optional arch=any
 libkadm5srv-mit12 deb libs optional arch=any
 libkdb5-10t64 deb libs optional arch=any
 libkrad-dev deb libdevel optional arch=any
 libkrad0 deb libs optional arch=any
 libkrb5-3 deb libs optional arch=any
 libkrb5-dbg deb debug optional arch=any
 libkrb5-dev deb libdevel optional arch=any
 libkrb5support0 deb libs optional arch=any
Checksums-Sha1:
 3e383bbe88cbed56bdad4ba655c40abf0e961cf7 9136145 krb5_1.21.3.orig.tar.gz
 bba46878ffc67fcd96821cd7b8f451b5b1b2f475 833 krb5_1.21.3.orig.tar.gz.asc
 6796cf7d9aa28564b70b6066e158a9d52f736fde 104424 krb5_1.21.3-5.debian.tar.xz
Checksums-Sha256:
 b7a4cd5ead67fb08b980b21abd150ff7217e85ea320c9ed0c6dadd304840ad35 9136145 krb5_1.21.3.orig.tar.gz
 85047c935fe949ef2e275885451b168557b923dd13a5aab0ef8fe6acd27b94d7 833 krb5_1.21.3.orig.tar.gz.asc
 521fdfaf5cda93a64cc70afd357dc31ea6f4128ff5a489b036b58887eceddd46 104424 krb5_1.21.3-5.debian.tar.xz
Files:
 beb34d1dfc72ba0571ce72bed03e06eb 9136145 krb5_1.21.3.orig.tar.gz
 cc604e5e51a7c3c314751c68c0cd5a09 833 krb5_1.21.3.orig.tar.gz.asc
 231bd73a512fd69958e248b04071c7bc 104424 krb5_1.21.3-5.debian.tar.xz

-----BEGIN PGP SIGNATURE-----

iQIzBAEBCgAdFiEEXQGHuUCiRbrXsPVqADoaLapBCF8FAmfSJfsACgkQADoaLapB
CF9E1A/9HsQDQEV0ncb4iCxplti4DKy4T9tq9Hei0QXjyo+FGn/zVKY+m06vVvPB
GGYwE0Uy7ERhW4VyIN/p+5s7BMNjcI4SIOgVuwpFOWGkNUh8Z6Eo+zJlabglLQ2B
z2yb7FmRQiQg66aDqSBUeM5zzpEilIo5FFFYmk/AHDp9r4Q5jn7iSABMUQbEcTld
ucYRXoU3zOTmdiIrsWLS/WwTQx+Pv0kp4/4q9X4uml0KXJHxMflnmK0rl2Ae7LgW
GGYcKUi5GXQxKX9Rht7tSNCtPGLrfuS2VHsPMUgkH9lZDOQhhmLbkQRElIBMR2G+
fOcBmV/7o1OvjuM1tRT0pYAHrEsKv9k+6GZa8T8Gr8Y2uDrZSbEuhkvmFxa8U+ey
maFlookWA/05TleX5udirhO9dNMKs31o5Ph3+zBTJcrSQDAvlieLN0Qv/MupaT98
842VYPxtedPHJhuOzPJQjLOqEwD+HijaSJXeHL2Gs4K1aCNZfYIn/HplfRZ7Ik8W
WTKCCwxq+T3r9+xHXSSivKcQKhSnEUVB6N1UjFvVq99UaKkp/880kF45LMqfr1Ne
7TAQWxDMPp3WvhQqvOeWCqoIFBgT93r9hGETbCn4CqIdMeygGZlWe/ltWuCr/04h
0+zzr2Vj3FF/Fn9/DnGjpjr430IWrCI0E9y7icslLH+0qL/gRkw=
=JPA4
-----END PGP SIGNATURE-----

dpkg-source: warning: cannot verify inline signature for ./krb5_1.21.3-5.dsc: unsupported subcommand
dpkg-source: info: extracting krb5 in /<<PKGBUILDDIR>>
dpkg-source: info: unpacking krb5_1.21.3.orig.tar.gz
dpkg-source: info: unpacking krb5_1.21.3-5.debian.tar.xz
dpkg-source: info: using patch list from debian/patches/series
dpkg-source: info: applying debian-local/0001-Debian-HURD-compatibility.patch
dpkg-source: info: applying debian-local/0002-debian-Handle-multi-arch-paths-in-krb5-config.patch
dpkg-source: info: applying debian-local/0003-debian-osconf.hin-path-changes.patch
dpkg-source: info: applying debian-local/0004-debian-install-ldap-library-in-subdirectory.patch
dpkg-source: info: applying debian-local/0005-gssapi-never-unload-mechanisms.patch
dpkg-source: info: applying debian-local/0006-Add-substpdf-target.patch
dpkg-source: info: applying debian-local/0007-Fix-pkg-config-library-include-paths.patch
dpkg-source: info: applying debian-local/0008-Use-isystem-for-include-paths.patch
dpkg-source: info: applying 0009-Add-.gitignore.patch
dpkg-source: info: applying 0011-Allow-kpropd-to-bind-even-if-only-loopback-is-config.patch
dpkg-source: info: applying 0012-Skip-keyring-tests-if-keyring-blocked-by-seccomp.patch
dpkg-source: info: applying 0012-Replace-ssl.wrap_socket-for-tests.patch
dpkg-source: info: applying CVE-2025-24528.patch

Check disk space
----------------

Sufficient free space for build

User Environment
----------------

APT_CONFIG=/var/lib/sbuild/apt.conf
CONFIG_SITE=/etc/dpkg-cross/cross-config.riscv64
DEB_BUILD_OPTIONS=nocheck
HOME=/sbuild-nonexistent
LANG=en_US.UTF-8
LC_ALL=C.UTF-8
LOGNAME=crossqa
OLDPWD=/home/crossqa
PATH=/usr/local/sbin:/usr/local/bin:/usr/sbin:/usr/bin:/sbin:/bin:/usr/games
SBUILD_CONFIG=/tmp/tmp.7uluTFvJcM/sbuild.conf
SCHROOT_ALIAS_NAME=unstable-amd64-sbuild
SCHROOT_CHROOT_NAME=sid-amd64-sbuild
SCHROOT_COMMAND=env
SCHROOT_GID=1000
SCHROOT_GROUP=crossqa
SCHROOT_SESSION_ID=sid-amd64-sbuild-831f0c17-8c56-4d43-abb7-2ffdce7227f2
SCHROOT_UID=1000
SCHROOT_USER=crossqa
SHELL=/bin/sh
USER=crossqa
XDG_SESSION_CLASS=user

dpkg-buildpackage
-----------------

Command: dpkg-buildpackage --sanitize-env -ariscv64 -Pcross,nocheck -us -uc -B -rfakeroot --jobs-try=1
dpkg-buildpackage: info: source package krb5
dpkg-buildpackage: info: source version 1.21.3-5
dpkg-buildpackage: info: source distribution unstable
dpkg-buildpackage: info: source changed by Bastien Roucariès <rouca@debian.org>
dpkg-architecture: warning: specified GNU system type riscv64-linux-gnu does not match CC system type x86_64-linux-gnu, try setting a correct CC environment variable
 dpkg-source --before-build .
dpkg-buildpackage: info: host architecture riscv64
 debian/rules clean
dh_testdir
rm -rf  build doc/tools/*.pyc doc/version.py
dh_clean build-indep-stamp
 debian/rules binary-arch
dh binary-arch
   dh_update_autotools_config -a
   dh_autoreconf -a
   debian/rules override_dh_auto_configure
make[1]: Entering directory '/<<PKGBUILDDIR>>'
dh_auto_configure --sourcedir=src --builddir=build -- --with-system-et --with-system-ss --disable-rpath  \
	--enable-shared --with-ldap --without-tcl \
--with-system-verto \
--with-lmdb \
	--sysconfdir=/etc  \
	--localstatedir=/etc
	cd build && ../src/configure --build=x86_64-linux-gnu --prefix=/usr --includedir=\${prefix}/include --mandir=\${prefix}/share/man --infodir=\${prefix}/share/info --sysconfdir=/etc --localstatedir=/var --disable-option-checking --disable-silent-rules --libdir=\${prefix}/lib/riscv64-linux-gnu --runstatedir=/run --disable-maintainer-mode --disable-dependency-tracking --host=riscv64-linux-gnu --with-system-et --with-system-ss --disable-rpath --enable-shared --with-ldap --without-tcl --with-system-verto --with-lmdb --sysconfdir=/etc --localstatedir=/etc
checking for riscv64-linux-gnu-gcc... riscv64-linux-gnu-gcc
checking whether the C compiler works... yes
checking for C compiler default output file name... a.out
checking for suffix of executables... 
checking whether we are cross compiling... yes
checking for suffix of object files... o
checking whether the compiler supports GNU C... yes
checking whether riscv64-linux-gnu-gcc accepts -g... yes
checking for riscv64-linux-gnu-gcc option to enable C11 features... none needed
checking for riscv64-linux-gnu-g++... riscv64-linux-gnu-g++
checking whether the compiler supports GNU C++... yes
checking whether riscv64-linux-gnu-g++ accepts -g... yes
checking for riscv64-linux-gnu-g++ option to enable C++11 features... none needed
checking if C compiler supports -Werror=unknown-warning-option... no
checking how to run the C preprocessor... riscv64-linux-gnu-gcc -E
checking for riscv64-linux-gnu-pkg-config... /usr/bin/riscv64-linux-gnu-pkg-config
checking pkg-config is at least version 0.9.0... yes
checking build system type... x86_64-pc-linux-gnu
checking host system type... riscv64-unknown-linux-gnu
checking for a sed that does not truncate output... /usr/bin/sed
checking for grep that handles long lines and -e... /usr/bin/grep
checking for egrep... /usr/bin/grep -E
checking for GNU linker... yes
configure: adding extra warning flags for gcc
configure: skipping pedantic warnings on Linux
configure: adding extra warning flags for g++
checking if C compiler supports -Wno-format-zero-length... yes
checking if C compiler supports -Woverflow... yes
checking if C compiler supports -Wstrict-overflow... yes
checking if C compiler supports -Wmissing-format-attribute... yes
checking if C compiler supports -Wmissing-prototypes... yes
checking if C compiler supports -Wreturn-type... yes
checking if C compiler supports -Wmissing-braces... yes
checking if C compiler supports -Wparentheses... yes
checking if C compiler supports -Wswitch... yes
checking if C compiler supports -Wunused-function... yes
checking if C compiler supports -Wunused-label... yes
checking if C compiler supports -Wunused-variable... yes
checking if C compiler supports -Wunused-value... yes
checking if C compiler supports -Wunknown-pragmas... yes
checking if C compiler supports -Wsign-compare... yes
checking if C compiler supports -Wnewline-eof... no
checking if C compiler supports -Werror=uninitialized... yes
checking if C compiler supports -Wno-maybe-uninitialized... yes
checking if C compiler supports -Werror=pointer-arith... yes
checking if C compiler supports -Werror=int-conversion... yes
checking if C compiler supports -Werror=incompatible-pointer-types... yes
checking if C compiler supports -Werror=discarded-qualifiers... yes
checking if C compiler supports -Werror=implicit-int... yes
checking if C compiler supports -Werror=declaration-after-statement... yes
checking if C compiler supports -Werror-implicit-function-declaration... yes
checking which version of com_err to use... system
checking for com_err... yes
checking for add_error_table in -lcom_err... yes
checking for remove_error_table in -lcom_err... yes
checking for compile_et... compile_et
checking whether compile_et is useful... yes
checking whether compile_et supports --textdomain... no
checking which version of subsystem package to use... system
checking whether system ss package works... assumed
checking if ss_execute_command needs a prototype provided... yes
checking for an ANSI C-conforming const... yes
checking for gethostbyname... yes
checking for socket... yes
checking for main in -lresolv... yes
checking for res_ninit... yes
checking for res_nclose... yes
checking for res_ndestroy... no
checking for res_nsearch... yes
checking for ns_initparse... yes
checking for ns_name_uncompress... yes
checking for dn_skipname... yes
checking for res_search... yes
checking whether pragma weak references are supported... yes
configure: enabling OpenLDAP database backend module support
checking for constructor/destructor attribute support... configure: error: Cannot test for constructor/destructor support when cross compiling
	cd build && tail -v -n \+0 config.log
==> config.log <==
This file contains any messages produced by compilers while
running configure, to aid debugging if configure makes a mistake.

It was created by Kerberos 5 configure 1.21.3, which was
generated by GNU Autoconf 2.71.  Invocation command line was

  $ ../src/configure --build=x86_64-linux-gnu --prefix=/usr '--includedir=${prefix}/include' '--mandir=${prefix}/share/man' '--infodir=${prefix}/share/info' --sysconfdir=/etc --localstatedir=/var --disable-option-checking --disable-silent-rules '--libdir=${prefix}/lib/riscv64-linux-gnu' --runstatedir=/run --disable-maintainer-mode --disable-dependency-tracking --host=riscv64-linux-gnu --with-system-et --with-system-ss --disable-rpath --enable-shared --with-ldap --without-tcl --with-system-verto --with-lmdb --sysconfdir=/etc --localstatedir=/etc

## --------- ##
## Platform. ##
## --------- ##

hostname = debian-ci-siliconvalley
uname -m = x86_64
uname -r = 6.1.0-31-amd64
uname -s = Linux
uname -v = #1 SMP PREEMPT_DYNAMIC Debian 6.1.128-1 (2025-02-07)

/usr/bin/uname -p = unknown
/bin/uname -X     = unknown

/bin/arch              = x86_64
/usr/bin/arch -k       = unknown
/usr/convex/getsysinfo = unknown
/usr/bin/hostinfo      = unknown
/bin/machine           = unknown
/usr/bin/oslevel       = unknown
/bin/universe          = unknown

PATH: /usr/local/sbin/
PATH: /usr/local/bin/
PATH: /usr/sbin/
PATH: /usr/bin/
PATH: /sbin/
PATH: /bin/
PATH: /usr/games/


## ----------- ##
## Core tests. ##
## ----------- ##

configure:3257: looking for aux files: install-sh config.guess config.sub
configure:3270:  trying ../src/./config/
configure:3281:   ../src/./config/install-sh found
configure:3299:   ../src/./config/config.guess found
configure:3299:   ../src/./config/config.sub found
configure:3462: checking for riscv64-linux-gnu-gcc
configure:3483: found /usr/bin/riscv64-linux-gnu-gcc
configure:3494: result: riscv64-linux-gnu-gcc
configure:3892: checking for C compiler version
configure:3901: riscv64-linux-gnu-gcc --version >&5
riscv64-linux-gnu-gcc (Debian 14.2.0-19) 14.2.0
Copyright (C) 2024 Free Software Foundation, Inc.
This is free software; see the source for copying conditions.  There is NO
warranty; not even for MERCHANTABILITY or FITNESS FOR A PARTICULAR PURPOSE.

configure:3912: $? = 0
configure:3901: riscv64-linux-gnu-gcc -v >&5
Using built-in specs.
COLLECT_GCC=riscv64-linux-gnu-gcc
COLLECT_LTO_WRAPPER=/usr/libexec/gcc-cross/riscv64-linux-gnu/14/lto-wrapper
Target: riscv64-linux-gnu
Configured with: ../src/configure -v --with-pkgversion='Debian 14.2.0-19' --with-bugurl=file:///usr/share/doc/gcc-14/README.Bugs --enable-languages=c,ada,c++,go,d,fortran,objc,obj-c++,m2 --prefix=/usr --with-gcc-major-version-only --program-suffix=-14 --enable-shared --enable-linker-build-id --libexecdir=/usr/libexec --without-included-gettext --enable-threads=posix --libdir=/usr/lib --enable-nls --with-sysroot=/ --enable-clocale=gnu --enable-libstdcxx-debug --enable-libstdcxx-time=yes --with-default-libstdcxx-abi=new --enable-libstdcxx-backtrace --enable-gnu-unique-object --disable-libquadmath --disable-libquadmath-support --enable-plugin --enable-default-pie --with-system-zlib --enable-libphobos-checking=release --without-target-system-zlib --enable-multiarch --disable-werror --disable-multilib --with-arch=rv64gc --with-abi=lp64d --enable-checking=release --build=x86_64-linux-gnu --host=x86_64-linux-gnu --target=riscv64-linux-gnu --program-prefix=riscv64-linux-gnu- --includedir=/usr/riscv64-linux-gnu/include --with-build-config=bootstrap-lto-lean --enable-link-serialization=3
Thread model: posix
Supported LTO compression algorithms: zlib zstd
gcc version 14.2.0 (Debian 14.2.0-19) 
configure:3912: $? = 0
configure:3901: riscv64-linux-gnu-gcc -V >&5
riscv64-linux-gnu-gcc: error: unrecognized command-line option '-V'
riscv64-linux-gnu-gcc: fatal error: no input files
compilation terminated.
configure:3912: $? = 1
configure:3901: riscv64-linux-gnu-gcc -qversion >&5
riscv64-linux-gnu-gcc: error: unrecognized command-line option '-qversion'; did you mean '--version'?
riscv64-linux-gnu-gcc: fatal error: no input files
compilation terminated.
configure:3912: $? = 1
configure:3901: riscv64-linux-gnu-gcc -version >&5
riscv64-linux-gnu-gcc: error: unrecognized command-line option '-version'
riscv64-linux-gnu-gcc: fatal error: no input files
compilation terminated.
configure:3912: $? = 1
configure:3932: checking whether the C compiler works
configure:3954: riscv64-linux-gnu-gcc -g -O2 -Werror=implicit-function-declaration -ffile-prefix-map=/<<PKGBUILDDIR>>=. -fstack-protector-strong -Wformat -Werror=format-security -Wdate-time -D_FORTIFY_SOURCE=2 -Wl,-z,relro conftest.c  >&5
configure:3958: $? = 0
configure:4008: result: yes
configure:4011: checking for C compiler default output file name
configure:4013: result: a.out
configure:4019: checking for suffix of executables
configure:4026: riscv64-linux-gnu-gcc -o conftest -g -O2 -Werror=implicit-function-declaration -ffile-prefix-map=/<<PKGBUILDDIR>>=. -fstack-protector-strong -Wformat -Werror=format-security -Wdate-time -D_FORTIFY_SOURCE=2 -Wl,-z,relro conftest.c  >&5
configure:4030: $? = 0
configure:4053: result: 
configure:4075: checking whether we are cross compiling
configure:4113: result: yes
configure:4118: checking for suffix of object files
configure:4141: riscv64-linux-gnu-gcc -c -g -O2 -Werror=implicit-function-declaration -ffile-prefix-map=/<<PKGBUILDDIR>>=. -fstack-protector-strong -Wformat -Werror=format-security -Wdate-time -D_FORTIFY_SOURCE=2 conftest.c >&5
configure:4145: $? = 0
configure:4167: result: o
configure:4171: checking whether the compiler supports GNU C
configure:4191: riscv64-linux-gnu-gcc -c -g -O2 -Werror=implicit-function-declaration -ffile-prefix-map=/<<PKGBUILDDIR>>=. -fstack-protector-strong -Wformat -Werror=format-security -Wdate-time -D_FORTIFY_SOURCE=2 conftest.c >&5
configure:4191: $? = 0
configure:4201: result: yes
configure:4212: checking whether riscv64-linux-gnu-gcc accepts -g
configure:4233: riscv64-linux-gnu-gcc -c -g -Wdate-time -D_FORTIFY_SOURCE=2 conftest.c >&5
configure:4233: $? = 0
configure:4277: result: yes
configure:4297: checking for riscv64-linux-gnu-gcc option to enable C11 features
configure:4312: riscv64-linux-gnu-gcc  -c -g -O2 -Werror=implicit-function-declaration -ffile-prefix-map=/<<PKGBUILDDIR>>=. -fstack-protector-strong -Wformat -Werror=format-security -Wdate-time -D_FORTIFY_SOURCE=2 conftest.c >&5
configure:4312: $? = 0
configure:4330: result: none needed
configure:4460: checking for riscv64-linux-gnu-g++
configure:4481: found /usr/bin/riscv64-linux-gnu-g++
configure:4492: result: riscv64-linux-gnu-g++
configure:4568: checking for C++ compiler version
configure:4577: riscv64-linux-gnu-g++ --version >&5
riscv64-linux-gnu-g++ (Debian 14.2.0-19) 14.2.0
Copyright (C) 2024 Free Software Foundation, Inc.
This is free software; see the source for copying conditions.  There is NO
warranty; not even for MERCHANTABILITY or FITNESS FOR A PARTICULAR PURPOSE.

configure:4588: $? = 0
configure:4577: riscv64-linux-gnu-g++ -v >&5
Using built-in specs.
COLLECT_GCC=riscv64-linux-gnu-g++
COLLECT_LTO_WRAPPER=/usr/libexec/gcc-cross/riscv64-linux-gnu/14/lto-wrapper
Target: riscv64-linux-gnu
Configured with: ../src/configure -v --with-pkgversion='Debian 14.2.0-19' --with-bugurl=file:///usr/share/doc/gcc-14/README.Bugs --enable-languages=c,ada,c++,go,d,fortran,objc,obj-c++,m2 --prefix=/usr --with-gcc-major-version-only --program-suffix=-14 --enable-shared --enable-linker-build-id --libexecdir=/usr/libexec --without-included-gettext --enable-threads=posix --libdir=/usr/lib --enable-nls --with-sysroot=/ --enable-clocale=gnu --enable-libstdcxx-debug --enable-libstdcxx-time=yes --with-default-libstdcxx-abi=new --enable-libstdcxx-backtrace --enable-gnu-unique-object --disable-libquadmath --disable-libquadmath-support --enable-plugin --enable-default-pie --with-system-zlib --enable-libphobos-checking=release --without-target-system-zlib --enable-multiarch --disable-werror --disable-multilib --with-arch=rv64gc --with-abi=lp64d --enable-checking=release --build=x86_64-linux-gnu --host=x86_64-linux-gnu --target=riscv64-linux-gnu --program-prefix=riscv64-linux-gnu- --includedir=/usr/riscv64-linux-gnu/include --with-build-config=bootstrap-lto-lean --enable-link-serialization=3
Thread model: posix
Supported LTO compression algorithms: zlib zstd
gcc version 14.2.0 (Debian 14.2.0-19) 
configure:4588: $? = 0
configure:4577: riscv64-linux-gnu-g++ -V >&5
riscv64-linux-gnu-g++: error: unrecognized command-line option '-V'
riscv64-linux-gnu-g++: fatal error: no input files
compilation terminated.
configure:4588: $? = 1
configure:4577: riscv64-linux-gnu-g++ -qversion >&5
riscv64-linux-gnu-g++: error: unrecognized command-line option '-qversion'; did you mean '--version'?
riscv64-linux-gnu-g++: fatal error: no input files
compilation terminated.
configure:4588: $? = 1
configure:4592: checking whether the compiler supports GNU C++
configure:4612: riscv64-linux-gnu-g++ -c -g -O2 -ffile-prefix-map=/<<PKGBUILDDIR>>=. -fstack-protector-strong -Wformat -Werror=format-security -Wdate-time -D_FORTIFY_SOURCE=2 conftest.cpp >&5
configure:4612: $? = 0
configure:4622: result: yes
configure:4633: checking whether riscv64-linux-gnu-g++ accepts -g
configure:4654: riscv64-linux-gnu-g++ -c -g -Wdate-time -D_FORTIFY_SOURCE=2 conftest.cpp >&5
configure:4654: $? = 0
configure:4698: result: yes
configure:4718: checking for riscv64-linux-gnu-g++ option to enable C++11 features
configure:4733: riscv64-linux-gnu-g++  -c -g -O2 -ffile-prefix-map=/<<PKGBUILDDIR>>=. -fstack-protector-strong -Wformat -Werror=format-security -Wdate-time -D_FORTIFY_SOURCE=2 conftest.cpp >&5
conftest.cpp: In function 'int main(int, char**)':
conftest.cpp:175:25: warning: empty parentheses were disambiguated as a function declaration [-Wvexing-parse]
  175 |   cxx11test::delegate d2();
      |                         ^~
conftest.cpp:175:25: note: remove parentheses to default-initialize a variable
  175 |   cxx11test::delegate d2();
      |                         ^~
      |                         --
conftest.cpp:175:25: note: or replace parentheses with braces to value-initialize a variable
configure:4733: $? = 0
configure:4751: result: none needed
configure:4818: checking if C compiler supports -Werror=unknown-warning-option
configure:4836: riscv64-linux-gnu-gcc -c -g -O2 -Werror=implicit-function-declaration -ffile-prefix-map=/<<PKGBUILDDIR>>=. -fstack-protector-strong -Wformat -Werror=format-security -Wdate-time -D_FORTIFY_SOURCE=2 conftest.c >&5
configure:4836: $? = 0
configure:4851: riscv64-linux-gnu-gcc -c -g -O2 -Werror=implicit-function-declaration -ffile-prefix-map=/<<PKGBUILDDIR>>=. -fstack-protector-strong -Wformat -Werror=format-security  -Werror=unknown-warning-option -Wdate-time -D_FORTIFY_SOURCE=2 conftest.c >&5
cc1: error: '-Werror=unknown-warning-option': no option '-Wunknown-warning-option'
configure:4851: $? = 1
configure: failed program was:
| /* confdefs.h */
| #define PACKAGE_NAME "Kerberos 5"
| #define PACKAGE_TARNAME "krb5"
| #define PACKAGE_VERSION "1.21.3"
| #define PACKAGE_STRING "Kerberos 5 1.21.3"
| #define PACKAGE_BUGREPORT "krb5-bugs@mit.edu"
| #define PACKAGE_URL ""
| /* end confdefs.h.  */
| 
| int
| main (void)
| {
| 1;
|   ;
|   return 0;
| }
configure:4865: result: no
configure:4881: checking how to run the C preprocessor
configure:4907: riscv64-linux-gnu-gcc -E -Wdate-time -D_FORTIFY_SOURCE=2 conftest.c
configure:4907: $? = 0
configure:4922: riscv64-linux-gnu-gcc -E -Wdate-time -D_FORTIFY_SOURCE=2 conftest.c
conftest.c:9:10: fatal error: ac_nonexistent.h: No such file or directory
    9 | #include <ac_nonexistent.h>
      |          ^~~~~~~~~~~~~~~~~~
compilation terminated.
configure:4922: $? = 1
configure: failed program was:
| /* confdefs.h */
| #define PACKAGE_NAME "Kerberos 5"
| #define PACKAGE_TARNAME "krb5"
| #define PACKAGE_VERSION "1.21.3"
| #define PACKAGE_STRING "Kerberos 5 1.21.3"
| #define PACKAGE_BUGREPORT "krb5-bugs@mit.edu"
| #define PACKAGE_URL ""
| /* end confdefs.h.  */
| #include <ac_nonexistent.h>
configure:4949: result: riscv64-linux-gnu-gcc -E
configure:4963: riscv64-linux-gnu-gcc -E -Wdate-time -D_FORTIFY_SOURCE=2 conftest.c
configure:4963: $? = 0
configure:4978: riscv64-linux-gnu-gcc -E -Wdate-time -D_FORTIFY_SOURCE=2 conftest.c
conftest.c:9:10: fatal error: ac_nonexistent.h: No such file or directory
    9 | #include <ac_nonexistent.h>
      |          ^~~~~~~~~~~~~~~~~~
compilation terminated.
configure:4978: $? = 1
configure: failed program was:
| /* confdefs.h */
| #define PACKAGE_NAME "Kerberos 5"
| #define PACKAGE_TARNAME "krb5"
| #define PACKAGE_VERSION "1.21.3"
| #define PACKAGE_STRING "Kerberos 5 1.21.3"
| #define PACKAGE_BUGREPORT "krb5-bugs@mit.edu"
| #define PACKAGE_URL ""
| /* end confdefs.h.  */
| #include <ac_nonexistent.h>
configure:5020: checking for riscv64-linux-gnu-pkg-config
configure:5043: found /usr/bin/riscv64-linux-gnu-pkg-config
configure:5055: result: /usr/bin/riscv64-linux-gnu-pkg-config
configure:5128: checking pkg-config is at least version 0.9.0
configure:5131: result: yes
configure:5156: checking build system type
configure:5171: result: x86_64-pc-linux-gnu
configure:5191: checking host system type
configure:5205: result: riscv64-unknown-linux-gnu
configure:5225: checking for a sed that does not truncate output
configure:5295: result: /usr/bin/sed
configure:5300: checking for grep that handles long lines and -e
configure:5364: result: /usr/bin/grep
configure:5369: checking for egrep
configure:5437: result: /usr/bin/grep -E
configure:5456: checking for GNU linker
configure:5465: riscv64-linux-gnu-gcc -Wl,-v 2>&1 			| grep GNU ld > /dev/null
configure:5468: $? = 0
configure:5474: result: yes
configure:5508: adding extra warning flags for gcc
configure:5515: skipping pedantic warnings on Linux
configure:5525: adding extra warning flags for g++
configure:5532: checking if C compiler supports -Wno-format-zero-length
configure:5550: riscv64-linux-gnu-gcc -c -g -O2 -Werror=implicit-function-declaration -ffile-prefix-map=/<<PKGBUILDDIR>>=. -fstack-protector-strong -Wformat -Werror=format-security -Wdate-time -D_FORTIFY_SOURCE=2 conftest.c >&5
configure:5550: $? = 0
configure:5565: riscv64-linux-gnu-gcc -c -g -O2 -Werror=implicit-function-declaration -ffile-prefix-map=/<<PKGBUILDDIR>>=. -fstack-protector-strong -Wformat -Werror=format-security  -Wno-format-zero-length -Wdate-time -D_FORTIFY_SOURCE=2 conftest.c >&5
configure:5565: $? = 0
configure:5579: result: yes
configure:5590: checking if C compiler supports -Woverflow
configure:5608: riscv64-linux-gnu-gcc -c -g -O2 -Werror=implicit-function-declaration -ffile-prefix-map=/<<PKGBUILDDIR>>=. -fstack-protector-strong -Wformat -Werror=format-security -Wdate-time -D_FORTIFY_SOURCE=2 conftest.c >&5
configure:5608: $? = 0
configure:5623: riscv64-linux-gnu-gcc -c -g -O2 -Werror=implicit-function-declaration -ffile-prefix-map=/<<PKGBUILDDIR>>=. -fstack-protector-strong -Wformat -Werror=format-security  -Woverflow -Wdate-time -D_FORTIFY_SOURCE=2 conftest.c >&5
configure:5623: $? = 0
configure:5637: result: yes
configure:5590: checking if C compiler supports -Wstrict-overflow
configure:5608: riscv64-linux-gnu-gcc -c -g -O2 -Werror=implicit-function-declaration -ffile-prefix-map=/<<PKGBUILDDIR>>=. -fstack-protector-strong -Wformat -Werror=format-security -Wdate-time -D_FORTIFY_SOURCE=2 conftest.c >&5
configure:5608: $? = 0
configure:5623: riscv64-linux-gnu-gcc -c -g -O2 -Werror=implicit-function-declaration -ffile-prefix-map=/<<PKGBUILDDIR>>=. -fstack-protector-strong -Wformat -Werror=format-security  -Wstrict-overflow -Wdate-time -D_FORTIFY_SOURCE=2 conftest.c >&5
configure:5623: $? = 0
configure:5637: result: yes
configure:5590: checking if C compiler supports -Wmissing-format-attribute
configure:5608: riscv64-linux-gnu-gcc -c -g -O2 -Werror=implicit-function-declaration -ffile-prefix-map=/<<PKGBUILDDIR>>=. -fstack-protector-strong -Wformat -Werror=format-security -Wdate-time -D_FORTIFY_SOURCE=2 conftest.c >&5
configure:5608: $? = 0
configure:5623: riscv64-linux-gnu-gcc -c -g -O2 -Werror=implicit-function-declaration -ffile-prefix-map=/<<PKGBUILDDIR>>=. -fstack-protector-strong -Wformat -Werror=format-security  -Wmissing-format-attribute -Wdate-time -D_FORTIFY_SOURCE=2 conftest.c >&5
configure:5623: $? = 0
configure:5637: result: yes
configure:5590: checking if C compiler supports -Wmissing-prototypes
configure:5608: riscv64-linux-gnu-gcc -c -g -O2 -Werror=implicit-function-declaration -ffile-prefix-map=/<<PKGBUILDDIR>>=. -fstack-protector-strong -Wformat -Werror=format-security -Wdate-time -D_FORTIFY_SOURCE=2 conftest.c >&5
configure:5608: $? = 0
configure:5623: riscv64-linux-gnu-gcc -c -g -O2 -Werror=implicit-function-declaration -ffile-prefix-map=/<<PKGBUILDDIR>>=. -fstack-protector-strong -Wformat -Werror=format-security  -Wmissing-prototypes -Wdate-time -D_FORTIFY_SOURCE=2 conftest.c >&5
configure:5623: $? = 0
configure:5637: result: yes
configure:5590: checking if C compiler supports -Wreturn-type
configure:5608: riscv64-linux-gnu-gcc -c -g -O2 -Werror=implicit-function-declaration -ffile-prefix-map=/<<PKGBUILDDIR>>=. -fstack-protector-strong -Wformat -Werror=format-security -Wdate-time -D_FORTIFY_SOURCE=2 conftest.c >&5
configure:5608: $? = 0
configure:5623: riscv64-linux-gnu-gcc -c -g -O2 -Werror=implicit-function-declaration -ffile-prefix-map=/<<PKGBUILDDIR>>=. -fstack-protector-strong -Wformat -Werror=format-security  -Wreturn-type -Wdate-time -D_FORTIFY_SOURCE=2 conftest.c >&5
configure:5623: $? = 0
configure:5637: result: yes
configure:5590: checking if C compiler supports -Wmissing-braces
configure:5608: riscv64-linux-gnu-gcc -c -g -O2 -Werror=implicit-function-declaration -ffile-prefix-map=/<<PKGBUILDDIR>>=. -fstack-protector-strong -Wformat -Werror=format-security -Wdate-time -D_FORTIFY_SOURCE=2 conftest.c >&5
configure:5608: $? = 0
configure:5623: riscv64-linux-gnu-gcc -c -g -O2 -Werror=implicit-function-declaration -ffile-prefix-map=/<<PKGBUILDDIR>>=. -fstack-protector-strong -Wformat -Werror=format-security  -Wmissing-braces -Wdate-time -D_FORTIFY_SOURCE=2 conftest.c >&5
configure:5623: $? = 0
configure:5637: result: yes
configure:5590: checking if C compiler supports -Wparentheses
configure:5608: riscv64-linux-gnu-gcc -c -g -O2 -Werror=implicit-function-declaration -ffile-prefix-map=/<<PKGBUILDDIR>>=. -fstack-protector-strong -Wformat -Werror=format-security -Wdate-time -D_FORTIFY_SOURCE=2 conftest.c >&5
configure:5608: $? = 0
configure:5623: riscv64-linux-gnu-gcc -c -g -O2 -Werror=implicit-function-declaration -ffile-prefix-map=/<<PKGBUILDDIR>>=. -fstack-protector-strong -Wformat -Werror=format-security  -Wparentheses -Wdate-time -D_FORTIFY_SOURCE=2 conftest.c >&5
configure:5623: $? = 0
configure:5637: result: yes
configure:5590: checking if C compiler supports -Wswitch
configure:5608: riscv64-linux-gnu-gcc -c -g -O2 -Werror=implicit-function-declaration -ffile-prefix-map=/<<PKGBUILDDIR>>=. -fstack-protector-strong -Wformat -Werror=format-security -Wdate-time -D_FORTIFY_SOURCE=2 conftest.c >&5
configure:5608: $? = 0
configure:5623: riscv64-linux-gnu-gcc -c -g -O2 -Werror=implicit-function-declaration -ffile-prefix-map=/<<PKGBUILDDIR>>=. -fstack-protector-strong -Wformat -Werror=format-security  -Wswitch -Wdate-time -D_FORTIFY_SOURCE=2 conftest.c >&5
configure:5623: $? = 0
configure:5637: result: yes
configure:5590: checking if C compiler supports -Wunused-function
configure:5608: riscv64-linux-gnu-gcc -c -g -O2 -Werror=implicit-function-declaration -ffile-prefix-map=/<<PKGBUILDDIR>>=. -fstack-protector-strong -Wformat -Werror=format-security -Wdate-time -D_FORTIFY_SOURCE=2 conftest.c >&5
configure:5608: $? = 0
configure:5623: riscv64-linux-gnu-gcc -c -g -O2 -Werror=implicit-function-declaration -ffile-prefix-map=/<<PKGBUILDDIR>>=. -fstack-protector-strong -Wformat -Werror=format-security  -Wunused-function -Wdate-time -D_FORTIFY_SOURCE=2 conftest.c >&5
configure:5623: $? = 0
configure:5637: result: yes
configure:5590: checking if C compiler supports -Wunused-label
configure:5608: riscv64-linux-gnu-gcc -c -g -O2 -Werror=implicit-function-declaration -ffile-prefix-map=/<<PKGBUILDDIR>>=. -fstack-protector-strong -Wformat -Werror=format-security -Wdate-time -D_FORTIFY_SOURCE=2 conftest.c >&5
configure:5608: $? = 0
configure:5623: riscv64-linux-gnu-gcc -c -g -O2 -Werror=implicit-function-declaration -ffile-prefix-map=/<<PKGBUILDDIR>>=. -fstack-protector-strong -Wformat -Werror=format-security  -Wunused-label -Wdate-time -D_FORTIFY_SOURCE=2 conftest.c >&5
configure:5623: $? = 0
configure:5637: result: yes
configure:5590: checking if C compiler supports -Wunused-variable
configure:5608: riscv64-linux-gnu-gcc -c -g -O2 -Werror=implicit-function-declaration -ffile-prefix-map=/<<PKGBUILDDIR>>=. -fstack-protector-strong -Wformat -Werror=format-security -Wdate-time -D_FORTIFY_SOURCE=2 conftest.c >&5
configure:5608: $? = 0
configure:5623: riscv64-linux-gnu-gcc -c -g -O2 -Werror=implicit-function-declaration -ffile-prefix-map=/<<PKGBUILDDIR>>=. -fstack-protector-strong -Wformat -Werror=format-security  -Wunused-variable -Wdate-time -D_FORTIFY_SOURCE=2 conftest.c >&5
configure:5623: $? = 0
configure:5637: result: yes
configure:5590: checking if C compiler supports -Wunused-value
configure:5608: riscv64-linux-gnu-gcc -c -g -O2 -Werror=implicit-function-declaration -ffile-prefix-map=/<<PKGBUILDDIR>>=. -fstack-protector-strong -Wformat -Werror=format-security -Wdate-time -D_FORTIFY_SOURCE=2 conftest.c >&5
configure:5608: $? = 0
configure:5623: riscv64-linux-gnu-gcc -c -g -O2 -Werror=implicit-function-declaration -ffile-prefix-map=/<<PKGBUILDDIR>>=. -fstack-protector-strong -Wformat -Werror=format-security  -Wunused-value -Wdate-time -D_FORTIFY_SOURCE=2 conftest.c >&5
conftest.c: In function 'main':
conftest.c:15:1: warning: statement with no effect [-Wunused-value]
   15 | 1;
      | ^
configure:5623: $? = 0
configure:5637: result: yes
configure:5590: checking if C compiler supports -Wunknown-pragmas
configure:5608: riscv64-linux-gnu-gcc -c -g -O2 -Werror=implicit-function-declaration -ffile-prefix-map=/<<PKGBUILDDIR>>=. -fstack-protector-strong -Wformat -Werror=format-security -Wdate-time -D_FORTIFY_SOURCE=2 conftest.c >&5
configure:5608: $? = 0
configure:5623: riscv64-linux-gnu-gcc -c -g -O2 -Werror=implicit-function-declaration -ffile-prefix-map=/<<PKGBUILDDIR>>=. -fstack-protector-strong -Wformat -Werror=format-security  -Wunknown-pragmas -Wdate-time -D_FORTIFY_SOURCE=2 conftest.c >&5
configure:5623: $? = 0
configure:5637: result: yes
configure:5590: checking if C compiler supports -Wsign-compare
configure:5608: riscv64-linux-gnu-gcc -c -g -O2 -Werror=implicit-function-declaration -ffile-prefix-map=/<<PKGBUILDDIR>>=. -fstack-protector-strong -Wformat -Werror=format-security -Wdate-time -D_FORTIFY_SOURCE=2 conftest.c >&5
configure:5608: $? = 0
configure:5623: riscv64-linux-gnu-gcc -c -g -O2 -Werror=implicit-function-declaration -ffile-prefix-map=/<<PKGBUILDDIR>>=. -fstack-protector-strong -Wformat -Werror=format-security  -Wsign-compare -Wdate-time -D_FORTIFY_SOURCE=2 conftest.c >&5
configure:5623: $? = 0
configure:5637: result: yes
configure:5590: checking if C compiler supports -Wnewline-eof
configure:5608: riscv64-linux-gnu-gcc -c -g -O2 -Werror=implicit-function-declaration -ffile-prefix-map=/<<PKGBUILDDIR>>=. -fstack-protector-strong -Wformat -Werror=format-security -Wdate-time -D_FORTIFY_SOURCE=2 conftest.c >&5
configure:5608: $? = 0
configure:5623: riscv64-linux-gnu-gcc -c -g -O2 -Werror=implicit-function-declaration -ffile-prefix-map=/<<PKGBUILDDIR>>=. -fstack-protector-strong -Wformat -Werror=format-security  -Wnewline-eof -Wdate-time -D_FORTIFY_SOURCE=2 conftest.c >&5
riscv64-linux-gnu-gcc: error: unrecognized command-line option '-Wnewline-eof'
configure:5623: $? = 1
configure: failed program was:
| /* confdefs.h */
| #define PACKAGE_NAME "Kerberos 5"
| #define PACKAGE_TARNAME "krb5"
| #define PACKAGE_VERSION "1.21.3"
| #define PACKAGE_STRING "Kerberos 5 1.21.3"
| #define PACKAGE_BUGREPORT "krb5-bugs@mit.edu"
| #define PACKAGE_URL ""
| #define _GNU_SOURCE 1
| #define __STDC_WANT_LIB_EXT1__ 1
| /* end confdefs.h.  */
| 
| int
| main (void)
| {
| 1;
|   ;
|   return 0;
| }
configure:5637: result: no
configure:5590: checking if C compiler supports -Werror=uninitialized
configure:5608: riscv64-linux-gnu-gcc -c -g -O2 -Werror=implicit-function-declaration -ffile-prefix-map=/<<PKGBUILDDIR>>=. -fstack-protector-strong -Wformat -Werror=format-security -Wdate-time -D_FORTIFY_SOURCE=2 conftest.c >&5
configure:5608: $? = 0
configure:5623: riscv64-linux-gnu-gcc -c -g -O2 -Werror=implicit-function-declaration -ffile-prefix-map=/<<PKGBUILDDIR>>=. -fstack-protector-strong -Wformat -Werror=format-security  -Werror=uninitialized -Wdate-time -D_FORTIFY_SOURCE=2 conftest.c >&5
configure:5623: $? = 0
configure:5637: result: yes
configure:5590: checking if C compiler supports -Wno-maybe-uninitialized
configure:5608: riscv64-linux-gnu-gcc -c -g -O2 -Werror=implicit-function-declaration -ffile-prefix-map=/<<PKGBUILDDIR>>=. -fstack-protector-strong -Wformat -Werror=format-security -Wdate-time -D_FORTIFY_SOURCE=2 conftest.c >&5
configure:5608: $? = 0
configure:5623: riscv64-linux-gnu-gcc -c -g -O2 -Werror=implicit-function-declaration -ffile-prefix-map=/<<PKGBUILDDIR>>=. -fstack-protector-strong -Wformat -Werror=format-security  -Wno-maybe-uninitialized -Wdate-time -D_FORTIFY_SOURCE=2 conftest.c >&5
configure:5623: $? = 0
configure:5637: result: yes
configure:5590: checking if C compiler supports -Werror=pointer-arith
configure:5608: riscv64-linux-gnu-gcc -c -g -O2 -Werror=implicit-function-declaration -ffile-prefix-map=/<<PKGBUILDDIR>>=. -fstack-protector-strong -Wformat -Werror=format-security -Wdate-time -D_FORTIFY_SOURCE=2 conftest.c >&5
configure:5608: $? = 0
configure:5623: riscv64-linux-gnu-gcc -c -g -O2 -Werror=implicit-function-declaration -ffile-prefix-map=/<<PKGBUILDDIR>>=. -fstack-protector-strong -Wformat -Werror=format-security  -Werror=pointer-arith -Wdate-time -D_FORTIFY_SOURCE=2 conftest.c >&5
configure:5623: $? = 0
configure:5637: result: yes
configure:5590: checking if C compiler supports -Werror=int-conversion
configure:5608: riscv64-linux-gnu-gcc -c -g -O2 -Werror=implicit-function-declaration -ffile-prefix-map=/<<PKGBUILDDIR>>=. -fstack-protector-strong -Wformat -Werror=format-security -Wdate-time -D_FORTIFY_SOURCE=2 conftest.c >&5
configure:5608: $? = 0
configure:5623: riscv64-linux-gnu-gcc -c -g -O2 -Werror=implicit-function-declaration -ffile-prefix-map=/<<PKGBUILDDIR>>=. -fstack-protector-strong -Wformat -Werror=format-security  -Werror=int-conversion -Wdate-time -D_FORTIFY_SOURCE=2 conftest.c >&5
configure:5623: $? = 0
configure:5637: result: yes
configure:5590: checking if C compiler supports -Werror=incompatible-pointer-types
configure:5608: riscv64-linux-gnu-gcc -c -g -O2 -Werror=implicit-function-declaration -ffile-prefix-map=/<<PKGBUILDDIR>>=. -fstack-protector-strong -Wformat -Werror=format-security -Wdate-time -D_FORTIFY_SOURCE=2 conftest.c >&5
configure:5608: $? = 0
configure:5623: riscv64-linux-gnu-gcc -c -g -O2 -Werror=implicit-function-declaration -ffile-prefix-map=/<<PKGBUILDDIR>>=. -fstack-protector-strong -Wformat -Werror=format-security  -Werror=incompatible-pointer-types -Wdate-time -D_FORTIFY_SOURCE=2 conftest.c >&5
configure:5623: $? = 0
configure:5637: result: yes
configure:5590: checking if C compiler supports -Werror=discarded-qualifiers
configure:5608: riscv64-linux-gnu-gcc -c -g -O2 -Werror=implicit-function-declaration -ffile-prefix-map=/<<PKGBUILDDIR>>=. -fstack-protector-strong -Wformat -Werror=format-security -Wdate-time -D_FORTIFY_SOURCE=2 conftest.c >&5
configure:5608: $? = 0
configure:5623: riscv64-linux-gnu-gcc -c -g -O2 -Werror=implicit-function-declaration -ffile-prefix-map=/<<PKGBUILDDIR>>=. -fstack-protector-strong -Wformat -Werror=format-security  -Werror=discarded-qualifiers -Wdate-time -D_FORTIFY_SOURCE=2 conftest.c >&5
configure:5623: $? = 0
configure:5637: result: yes
configure:5590: checking if C compiler supports -Werror=implicit-int
configure:5608: riscv64-linux-gnu-gcc -c -g -O2 -Werror=implicit-function-declaration -ffile-prefix-map=/<<PKGBUILDDIR>>=. -fstack-protector-strong -Wformat -Werror=format-security -Wdate-time -D_FORTIFY_SOURCE=2 conftest.c >&5
configure:5608: $? = 0
configure:5623: riscv64-linux-gnu-gcc -c -g -O2 -Werror=implicit-function-declaration -ffile-prefix-map=/<<PKGBUILDDIR>>=. -fstack-protector-strong -Wformat -Werror=format-security  -Werror=implicit-int -Wdate-time -D_FORTIFY_SOURCE=2 conftest.c >&5
configure:5623: $? = 0
configure:5637: result: yes
configure:5660: checking if C compiler supports -Werror=declaration-after-statement
configure:5678: riscv64-linux-gnu-gcc -c -g -O2 -Werror=implicit-function-declaration -ffile-prefix-map=/<<PKGBUILDDIR>>=. -fstack-protector-strong -Wformat -Werror=format-security -Wdate-time -D_FORTIFY_SOURCE=2 conftest.c >&5
configure:5678: $? = 0
configure:5693: riscv64-linux-gnu-gcc -c -g -O2 -Werror=implicit-function-declaration -ffile-prefix-map=/<<PKGBUILDDIR>>=. -fstack-protector-strong -Wformat -Werror=format-security  -Werror=declaration-after-statement -Wdate-time -D_FORTIFY_SOURCE=2 conftest.c >&5
configure:5693: $? = 0
configure:5707: result: yes
configure:5780: checking if C compiler supports -Werror-implicit-function-declaration
configure:5798: riscv64-linux-gnu-gcc -c -g -O2 -Werror=implicit-function-declaration -ffile-prefix-map=/<<PKGBUILDDIR>>=. -fstack-protector-strong -Wformat -Werror=format-security -Wdate-time -D_FORTIFY_SOURCE=2 conftest.c >&5
configure:5798: $? = 0
configure:5813: riscv64-linux-gnu-gcc -c -g -O2 -Werror=implicit-function-declaration -ffile-prefix-map=/<<PKGBUILDDIR>>=. -fstack-protector-strong -Wformat -Werror=format-security  -Werror-implicit-function-declaration -Wdate-time -D_FORTIFY_SOURCE=2 conftest.c >&5
configure:5813: $? = 0
configure:5827: result: yes
configure:5971: checking which version of com_err to use
configure:5976: result: system
configure:5988: checking for com_err
configure:5995: $PKG_CONFIG --exists --print-errors "com_err"
configure:5998: $? = 0
configure:6012: $PKG_CONFIG --exists --print-errors "com_err"
configure:6015: $? = 0
configure:6053: result: yes
configure:6062: checking for add_error_table in -lcom_err
configure:6085: riscv64-linux-gnu-gcc -o conftest -g -O2 -Werror=implicit-function-declaration -ffile-prefix-map=/<<PKGBUILDDIR>>=. -fstack-protector-strong -Wformat -Werror=format-security -Wdate-time -D_FORTIFY_SOURCE=2 -Wl,-z,relro conftest.c -lcom_err   -lcom_err  >&5
configure:6085: $? = 0
configure:6095: result: yes
configure:6104: checking for remove_error_table in -lcom_err
configure:6127: riscv64-linux-gnu-gcc -o conftest -g -O2 -Werror=implicit-function-declaration -ffile-prefix-map=/<<PKGBUILDDIR>>=. -fstack-protector-strong -Wformat -Werror=format-security -Wdate-time -D_FORTIFY_SOURCE=2 -Wl,-z,relro conftest.c -lcom_err   -lcom_err  >&5
configure:6127: $? = 0
configure:6137: result: yes
configure:6156: checking for compile_et
configure:6177: found /usr/bin/compile_et
configure:6188: result: compile_et
configure:6203: checking whether compile_et is useful
configure:6225: riscv64-linux-gnu-gcc -c -g -O2 -Werror=implicit-function-declaration -ffile-prefix-map=/<<PKGBUILDDIR>>=. -fstack-protector-strong -Wformat -Werror=format-security -Wdate-time -D_FORTIFY_SOURCE=2 conftest.c >&5
configure:6225: $? = 0
configure:6237: result: yes
configure:6239: checking whether compile_et supports --textdomain
configure:6255: result: no
configure:6279: checking which version of subsystem package to use
configure:6283: result: system
configure:6290: checking whether system ss package works
configure:6323: result: assumed
configure:6328: checking if ss_execute_command needs a prototype provided
configure:6348: riscv64-linux-gnu-gcc -c -g -O2 -Werror=implicit-function-declaration -ffile-prefix-map=/<<PKGBUILDDIR>>=. -fstack-protector-strong -Wformat -Werror=format-security -Wdate-time -D_FORTIFY_SOURCE=2 conftest.c >&5
configure:6348: $? = 0
configure:6356: result: yes
configure:6416: checking for an ANSI C-conforming const
configure:6483: riscv64-linux-gnu-gcc -c -g -O2 -Werror=implicit-function-declaration -ffile-prefix-map=/<<PKGBUILDDIR>>=. -fstack-protector-strong -Wformat -Werror=format-security -Wdate-time -D_FORTIFY_SOURCE=2 conftest.c >&5
configure:6483: $? = 0
configure:6491: result: yes
configure:6516: checking for gethostbyname
configure:6516: riscv64-linux-gnu-gcc -o conftest -g -O2 -Werror=implicit-function-declaration -ffile-prefix-map=/<<PKGBUILDDIR>>=. -fstack-protector-strong -Wformat -Werror=format-security -Wdate-time -D_FORTIFY_SOURCE=2 -Wl,-z,relro conftest.c  >&5
configure:6516: $? = 0
configure:6516: result: yes
configure:6703: checking for socket
configure:6703: riscv64-linux-gnu-gcc -o conftest -g -O2 -Werror=implicit-function-declaration -ffile-prefix-map=/<<PKGBUILDDIR>>=. -fstack-protector-strong -Wformat -Werror=format-security -Wdate-time -D_FORTIFY_SOURCE=2 -Wl,-z,relro conftest.c  >&5
configure:6703: $? = 0
configure:6703: result: yes
configure:6818: checking for main in -lresolv
configure:6838: riscv64-linux-gnu-gcc -o conftest -g -O2 -Werror=implicit-function-declaration -ffile-prefix-map=/<<PKGBUILDDIR>>=. -fstack-protector-strong -Wformat -Werror=format-security -Wdate-time -D_FORTIFY_SOURCE=2 -Wl,-z,relro conftest.c -lresolv   >&5
configure:6838: $? = 0
configure:6848: result: yes
configure:6865: checking for res_ninit
configure:6889: riscv64-linux-gnu-gcc -o conftest -g -O2 -Werror=implicit-function-declaration -ffile-prefix-map=/<<PKGBUILDDIR>>=. -fstack-protector-strong -Wformat -Werror=format-security -Wdate-time -D_FORTIFY_SOURCE=2 -Wl,-z,relro conftest.c -lresolv  >&5
configure:6889: $? = 0
configure:6899: result: yes
configure:6865: checking for res_nclose
configure:6889: riscv64-linux-gnu-gcc -o conftest -g -O2 -Werror=implicit-function-declaration -ffile-prefix-map=/<<PKGBUILDDIR>>=. -fstack-protector-strong -Wformat -Werror=format-security -Wdate-time -D_FORTIFY_SOURCE=2 -Wl,-z,relro conftest.c -lresolv  >&5
configure:6889: $? = 0
configure:6899: result: yes
configure:6865: checking for res_ndestroy
configure:6889: riscv64-linux-gnu-gcc -o conftest -g -O2 -Werror=implicit-function-declaration -ffile-prefix-map=/<<PKGBUILDDIR>>=. -fstack-protector-strong -Wformat -Werror=format-security -Wdate-time -D_FORTIFY_SOURCE=2 -Wl,-z,relro conftest.c -lresolv  >&5
conftest.c: In function 'main':
conftest.c:28:43: error: 'res_ndestroy' undeclared (first use in this function)
   28 |       void (* volatile p)() = (void (*)())res_ndestroy;
      |                                           ^~~~~~~~~~~~
conftest.c:28:43: note: each undeclared identifier is reported only once for each function it appears in
configure:6889: $? = 1
configure: failed program was:
| /* confdefs.h */
| #define PACKAGE_NAME "Kerberos 5"
| #define PACKAGE_TARNAME "krb5"
| #define PACKAGE_VERSION "1.21.3"
| #define PACKAGE_STRING "Kerberos 5 1.21.3"
| #define PACKAGE_BUGREPORT "krb5-bugs@mit.edu"
| #define PACKAGE_URL ""
| #define _GNU_SOURCE 1
| #define __STDC_WANT_LIB_EXT1__ 1
| #define NEED_SS_EXECUTE_COMMAND_PROTO 1
| #define HAVE_BT_RSEQ 1
| #define KRB5_DNS_LOOKUP 1
| #define HAVE_LIBRESOLV 1
| #define HAVE_RES_NINIT 1
| #define HAVE_RES_NCLOSE 1
| /* end confdefs.h.  */
| #include <sys/types.h>
|       #include <netinet/in.h>
|       #include <arpa/nameser.h>
|       #include <resolv.h>
| 
| int
| main (void)
| {
| /*
|        * Use volatile, or else optimization can cause false positives.
|        */
|       void (* volatile p)() = (void (*)())res_ndestroy;
|   ;
|   return 0;
| }
configure:6899: result: no
configure:6865: checking for res_nsearch
configure:6889: riscv64-linux-gnu-gcc -o conftest -g -O2 -Werror=implicit-function-declaration -ffile-prefix-map=/<<PKGBUILDDIR>>=. -fstack-protector-strong -Wformat -Werror=format-security -Wdate-time -D_FORTIFY_SOURCE=2 -Wl,-z,relro conftest.c -lresolv  >&5
configure:6889: $? = 0
configure:6899: result: yes
configure:6865: checking for ns_initparse
configure:6889: riscv64-linux-gnu-gcc -o conftest -g -O2 -Werror=implicit-function-declaration -ffile-prefix-map=/<<PKGBUILDDIR>>=. -fstack-protector-strong -Wformat -Werror=format-security -Wdate-time -D_FORTIFY_SOURCE=2 -Wl,-z,relro conftest.c -lresolv  >&5
configure:6889: $? = 0
configure:6899: result: yes
configure:6865: checking for ns_name_uncompress
configure:6889: riscv64-linux-gnu-gcc -o conftest -g -O2 -Werror=implicit-function-declaration -ffile-prefix-map=/<<PKGBUILDDIR>>=. -fstack-protector-strong -Wformat -Werror=format-security -Wdate-time -D_FORTIFY_SOURCE=2 -Wl,-z,relro conftest.c -lresolv  >&5
configure:6889: $? = 0
configure:6899: result: yes
configure:6865: checking for dn_skipname
configure:6889: riscv64-linux-gnu-gcc -o conftest -g -O2 -Werror=implicit-function-declaration -ffile-prefix-map=/<<PKGBUILDDIR>>=. -fstack-protector-strong -Wformat -Werror=format-security -Wdate-time -D_FORTIFY_SOURCE=2 -Wl,-z,relro conftest.c -lresolv  >&5
configure:6889: $? = 0
configure:6899: result: yes
configure:6865: checking for res_search
configure:6889: riscv64-linux-gnu-gcc -o conftest -g -O2 -Werror=implicit-function-declaration -ffile-prefix-map=/<<PKGBUILDDIR>>=. -fstack-protector-strong -Wformat -Werror=format-security -Wdate-time -D_FORTIFY_SOURCE=2 -Wl,-z,relro conftest.c -lresolv  >&5
configure:6889: $? = 0
configure:6899: result: yes
configure:7023: checking whether pragma weak references are supported
configure:7041: riscv64-linux-gnu-gcc -o conftest -g -O2 -Werror=implicit-function-declaration -ffile-prefix-map=/<<PKGBUILDDIR>>=. -fstack-protector-strong -Wformat -Werror=format-security -Wdate-time -D_FORTIFY_SOURCE=2 -Wl,-z,relro conftest.c -lresolv  >&5
configure:7041: $? = 0
configure:7050: result: yes
configure:7072: enabling OpenLDAP database backend module support
configure:7097: checking for constructor/destructor attribute support
configure:7117: error: Cannot test for constructor/destructor support when cross compiling

## ---------------- ##
## Cache variables. ##
## ---------------- ##

ac_cv_build=x86_64-pc-linux-gnu
ac_cv_c_compiler_gnu=yes
ac_cv_c_const=yes
ac_cv_cxx_compiler_gnu=yes
ac_cv_env_CCC_set=
ac_cv_env_CCC_value=
ac_cv_env_CC_set=
ac_cv_env_CC_value=
ac_cv_env_CFLAGS_set=set
ac_cv_env_CFLAGS_value='-g -O2 -Werror=implicit-function-declaration -ffile-prefix-map=/<<PKGBUILDDIR>>=. -fstack-protector-strong -Wformat -Werror=format-security'
ac_cv_env_COM_ERR_CFLAGS_set=
ac_cv_env_COM_ERR_CFLAGS_value=
ac_cv_env_COM_ERR_LIBS_set=
ac_cv_env_COM_ERR_LIBS_value=
ac_cv_env_CPPFLAGS_set=set
ac_cv_env_CPPFLAGS_value='-Wdate-time -D_FORTIFY_SOURCE=2'
ac_cv_env_CPP_set=
ac_cv_env_CPP_value=
ac_cv_env_CXXFLAGS_set=set
ac_cv_env_CXXFLAGS_value='-g -O2 -ffile-prefix-map=/<<PKGBUILDDIR>>=. -fstack-protector-strong -Wformat -Werror=format-security'
ac_cv_env_CXX_set=
ac_cv_env_CXX_value=
ac_cv_env_DB_HEADER_set=
ac_cv_env_DB_HEADER_value=
ac_cv_env_DB_LIB_set=
ac_cv_env_DB_LIB_value=
ac_cv_env_DEFCCNAME_set=
ac_cv_env_DEFCCNAME_value=
ac_cv_env_DEFCKTNAME_set=
ac_cv_env_DEFCKTNAME_value=
ac_cv_env_DEFKTNAME_set=
ac_cv_env_DEFKTNAME_value=
ac_cv_env_LDFLAGS_set=set
ac_cv_env_LDFLAGS_value=-Wl,-z,relro
ac_cv_env_LD_set=
ac_cv_env_LD_value=
ac_cv_env_LIBEDIT_CFLAGS_set=
ac_cv_env_LIBEDIT_CFLAGS_value=
ac_cv_env_LIBEDIT_LIBS_set=
ac_cv_env_LIBEDIT_LIBS_value=
ac_cv_env_LIBS_set=
ac_cv_env_LIBS_value=
ac_cv_env_PKCS11_MODNAME_set=
ac_cv_env_PKCS11_MODNAME_value=
ac_cv_env_PKG_CONFIG_LIBDIR_set=
ac_cv_env_PKG_CONFIG_LIBDIR_value=
ac_cv_env_PKG_CONFIG_PATH_set=
ac_cv_env_PKG_CONFIG_PATH_value=
ac_cv_env_PKG_CONFIG_set=
ac_cv_env_PKG_CONFIG_value=
ac_cv_env_SS_LIB_set=
ac_cv_env_SS_LIB_value=
ac_cv_env_VERTO_CFLAGS_set=
ac_cv_env_VERTO_CFLAGS_value=
ac_cv_env_VERTO_LIBS_set=
ac_cv_env_VERTO_LIBS_value=
ac_cv_env_YACC_set=
ac_cv_env_YACC_value=
ac_cv_env_YFLAGS_set=
ac_cv_env_YFLAGS_value=
ac_cv_env_build_alias_set=set
ac_cv_env_build_alias_value=x86_64-linux-gnu
ac_cv_env_host_alias_set=set
ac_cv_env_host_alias_value=riscv64-linux-gnu
ac_cv_env_target_alias_set=
ac_cv_env_target_alias_value=
ac_cv_func_gethostbyname=yes
ac_cv_func_socket=yes
ac_cv_host=riscv64-unknown-linux-gnu
ac_cv_lib_com_err_add_error_table=yes
ac_cv_lib_com_err_remove_error_table=yes
ac_cv_lib_resolv_main=yes
ac_cv_objext=o
ac_cv_path_EGREP='/usr/bin/grep -E'
ac_cv_path_GREP=/usr/bin/grep
ac_cv_path_PKG_CONFIG=/usr/bin/riscv64-linux-gnu-pkg-config
ac_cv_path_SED=/usr/bin/sed
ac_cv_prog_CC=riscv64-linux-gnu-gcc
ac_cv_prog_CPP='riscv64-linux-gnu-gcc -E'
ac_cv_prog_CXX=riscv64-linux-gnu-g++
ac_cv_prog_cc_c11=
ac_cv_prog_cc_g=yes
ac_cv_prog_cc_stdc=
ac_cv_prog_compile_et=compile_et
ac_cv_prog_cxx_11=no
ac_cv_prog_cxx_cxx11=
ac_cv_prog_cxx_g=yes
ac_cv_prog_cxx_stdcxx=
krb5_cv_cc_flag__dash_Werror_dash_implicit_dash_function_dash_declaration=yes
krb5_cv_cc_flag__dash_Werror_eq_declaration_dash_after_dash_statement=yes
krb5_cv_cc_flag__dash_Werror_eq_discarded_dash_qualifiers=yes
krb5_cv_cc_flag__dash_Werror_eq_implicit_dash_int=yes
krb5_cv_cc_flag__dash_Werror_eq_incompatible_dash_pointer_dash_types=yes
krb5_cv_cc_flag__dash_Werror_eq_int_dash_conversion=yes
krb5_cv_cc_flag__dash_Werror_eq_pointer_dash_arith=yes
krb5_cv_cc_flag__dash_Werror_eq_uninitialized=yes
krb5_cv_cc_flag__dash_Werror_eq_unknown_dash_warning_dash_option=no
krb5_cv_cc_flag__dash_Wmissing_dash_braces=yes
krb5_cv_cc_flag__dash_Wmissing_dash_format_dash_attribute=yes
krb5_cv_cc_flag__dash_Wmissing_dash_prototypes=yes
krb5_cv_cc_flag__dash_Wnewline_dash_eof=no
krb5_cv_cc_flag__dash_Wno_dash_format_dash_zero_dash_length=yes
krb5_cv_cc_flag__dash_Wno_dash_maybe_dash_uninitialized=yes
krb5_cv_cc_flag__dash_Woverflow=yes
krb5_cv_cc_flag__dash_Wparentheses=yes
krb5_cv_cc_flag__dash_Wreturn_dash_type=yes
krb5_cv_cc_flag__dash_Wsign_dash_compare=yes
krb5_cv_cc_flag__dash_Wstrict_dash_overflow=yes
krb5_cv_cc_flag__dash_Wswitch=yes
krb5_cv_cc_flag__dash_Wunknown_dash_pragmas=yes
krb5_cv_cc_flag__dash_Wunused_dash_function=yes
krb5_cv_cc_flag__dash_Wunused_dash_label=yes
krb5_cv_cc_flag__dash_Wunused_dash_value=yes
krb5_cv_cc_flag__dash_Wunused_dash_variable=yes
krb5_cv_compile_et_textdomain=no
krb5_cv_compile_et_useful=yes
krb5_cv_func_dn_skipname=yes
krb5_cv_func_ns_initparse=yes
krb5_cv_func_ns_name_uncompress=yes
krb5_cv_func_res_nclose=yes
krb5_cv_func_res_ndestroy=no
krb5_cv_func_res_ninit=yes
krb5_cv_func_res_nsearch=yes
krb5_cv_func_res_search=yes
krb5_cv_func_ss_execute_command_noproto=yes
krb5_cv_host=riscv64-unknown-linux-gnu
krb5_cv_pragma_weak_ref=yes
krb5_cv_prog_gnu_ld=yes
krb5_cv_system_ss_okay=assumed
pkg_cv_COM_ERR_CFLAGS='-I/usr/include/et '
pkg_cv_COM_ERR_LIBS='-lcom_err '

## ----------------- ##
## Output variables. ##
## ----------------- ##

AESNI_FLAGS=''
AESNI_OBJ=''
AR=''
ASAN=''
ASAN_FLAGS=''
AUDIT_IMPL_LIBS=''
AWK=''
BASH='/bin/bash'
CC='riscv64-linux-gnu-gcc'
CC_LINK=''
CFLAGS='-g -O2 -Werror=implicit-function-declaration -ffile-prefix-map=/<<PKGBUILDDIR>>=. -fstack-protector-strong -Wformat -Werror=format-security'
CMOCKA_LIBS=''
COM_ERR_CFLAGS='-I/usr/include/et '
COM_ERR_LIB='-lcom_err '
COM_ERR_LIBS='-lcom_err '
COM_ERR_VERSION='sys'
CONFIG_RELTOPDIR='.'
CPP='riscv64-linux-gnu-gcc -E'
CPPFLAGS='-Wdate-time -D_FORTIFY_SOURCE=2'
CRYPTO_BUILTIN_TESTS=''
CRYPTO_IMPL_CFLAGS=''
CRYPTO_IMPL_LIBS=''
CXX='riscv64-linux-gnu-g++'
CXXFLAGS='-g -O2 -ffile-prefix-map=/<<PKGBUILDDIR>>=. -fstack-protector-strong -Wformat -Werror=format-security'
CXX_LINK=''
DB_EXTRA_LIBS=''
DB_HEADER='db.h'
DB_HEADER_VERSION='k5'
DB_LIB='-ldb'
DB_VERSION='k5'
DEFCCNAME=''
DEFCKTNAME=''
DEFKTNAME=''
DEFS=''
DEPLIBEXT=''
DIG=''
DL_LIB=''
DYNOBJEXT='$(SHLIBEXT)'
DYNOBJ_EXPDEPS='$(SHLIB_EXPDEPS)'
DYNOBJ_EXPFLAGS='$(SHLIB_EXPFLAGS)'
ECHO_C=''
ECHO_N='-n'
ECHO_T=''
EGREP='/usr/bin/grep -E'
EXEEXT=''
EXTRA_FILES=''
EXTRA_SUPPORT_SYMS=''
FCTSH=''
FNMATCH_OBJ=''
FNMATCH_ST_OBJ=''
GEN_LIB=''
GETOPT_LONG_OBJ=''
GETOPT_LONG_ST_OBJ=''
GETOPT_OBJ=''
GETOPT_ST_OBJ=''
GETTIMEOFDAY_OBJ=''
GETTIMEOFDAY_ST_OBJ=''
GREP='/usr/bin/grep'
GROFF=''
GSSRPC__BSD_TYPEALIASES=''
GSSRPC__NETDB_H=''
GSSRPC__SYS_PARAM_H=''
GSSRPC__SYS_SELECT_H=''
GSSRPC__SYS_TIME_H=''
GSSRPC__UNISTD_H=''
HAVE_CMOCKA=''
HAVE_GCC='yes'
HAVE_LMDB=''
HAVE_PYTHON=''
HAVE_RESOLV_WRAPPER=''
HAVE_SASL=''
HAVE_SPAKE_OPENSSL=''
HESIOD_DEFS=''
HESIOD_LIBS=''
INSTALL_DATA=''
INSTALL_PROGRAM=''
INSTALL_SCRIPT=''
INSTALL_SHLIB='$(INSTALL)'
KDB5_DB_LIB=''
KDB5_PLUGIN_DEPLIBS=''
KDB5_PLUGIN_LIBS=''
KRB5_RCTMPDIR=''
KRB5_RUN_ENV=''
KRB5_RUN_VARS=''
KRB5_VERSION=''
KSU_LIBS=''
LD='riscv64-linux-gnu-gcc'
LDAP=''
LDAP_LIBS=''
LDFLAGS='-Wl,-z,relro'
LIBEDIT_CFLAGS=''
LIBEDIT_LIBS=''
LIBINSTLIST=''
LIBLINKS=''
LIBLIST=''
LIBOBJS=''
LIBS='-lresolv '
LIBUTIL=''
LMDB_LIBS=''
LN_S=''
LTLIBOBJS=''
MACOS_FRAMEWORK=''
MAINT='#'
MAINTAINER_MODE_FALSE=''
MAINTAINER_MODE_TRUE='#'
MAKE_DYNOBJ_COMMAND='$(MAKE_SHLIB_COMMAND)'
MAKE_SHLIB_COMMAND='$(CC) -shared -fPIC -Wl,-h,$(LIBPREFIX)$(LIBBASE)$(SHLIBSEXT) $(UNDEF_CHECK) -o $@ $$objlist $(SHLIB_EXPFLAGS) $(LDFLAGS) -Wl,--version-script binutils.versions $(EXPORT_CHECK)'
MKSTEMP_OBJ=''
MKSTEMP_ST_OBJ=''
MSGFMT=''
NSLOOKUP=''
OBJEXT='o'
OBJLISTS=''
OSX=''
PACKAGE_BUGREPORT='krb5-bugs@mit.edu'
PACKAGE_NAME='Kerberos 5'
PACKAGE_STRING='Kerberos 5 1.21.3'
PACKAGE_TARNAME='krb5'
PACKAGE_URL=''
PACKAGE_VERSION='1.21.3'
PATH_SEPARATOR=':'
PERL=''
PFLIBEXT='_p.a'
PFOBJEXT='.po'
PICFLAGS='-fPIC'
PKCS11_MODNAME=''
PKG_CONFIG='/usr/bin/riscv64-linux-gnu-pkg-config'
PKG_CONFIG_LIBDIR=''
PKG_CONFIG_PATH=''
PKINIT=''
PLUGIN=''
PLUGININST=''
PLUGINLINK=''
PRINTF_OBJ=''
PRINTF_ST_OBJ=''
PRIOCNTL_HACK=''
PROFFLAGS='-pg'
PROG_RPATH_FLAGS='$(RPATH_FLAG)$(PROG_RPATH)'
PTHREAD_CC=''
PTHREAD_CFLAGS=''
PTHREAD_CXX=''
PTHREAD_LIBS=''
PYTHON=''
PYTHON_MINVERSION=''
RANLIB=''
RL_CFLAGS=''
RL_LIBS=''
RPATH_FLAG='-Wl,--enable-new-dtags -Wl,-rpath -Wl,'
SECURE_GETENV_INIT=''
SECURE_GETENV_OBJ=''
SECURE_GETENV_ST_OBJ=''
SED='/usr/bin/sed'
SETENVOBJ=''
SH5=''
SH=''
SHELL='/bin/bash'
SHLIBEXT='.so'
SHLIBSEXT='.so.$(LIBMAJOR)'
SHLIBVEXT='.so.$(LIBMAJOR).$(LIBMINOR)'
SHLIB_EXPFLAGS='$(SHLIB_RPATH_FLAGS) $(SHLIB_DIRS) $(SHLIB_EXPLIBS)'
SHLIB_EXPORT_FILE_DEP='binutils.versions'
SHLIB_RPATH_FLAGS='$(RPATH_FLAG)$(SHLIB_RDIRS)'
SHOBJEXT='.so'
SIZEOF_TIME_T=''
SPAKE_OPENSSL_LIBS=''
SS_LIB='-lss'
SS_VERSION='sys'
STLIBEXT='.a'
STOBJEXT='.o'
STRLCPY_OBJ=''
STRLCPY_ST_OBJ=''
SUPPORTLIB_MAJOR=''
SYSCONFCONF=''
THREAD_SUPPORT=''
TLS_IMPL=''
TLS_IMPL_CFLAGS=''
TLS_IMPL_LIBS=''
UNDEF_CHECK='-Wl,--no-undefined'
VERTO_CFLAGS=''
VERTO_LIBS=''
VERTO_VERSION=''
WARN_CFLAGS=' -Wall -Wcast-align -Wshadow -Wmissing-prototypes -Wno-format-zero-length -Woverflow -Wstrict-overflow -Wmissing-format-attribute -Wmissing-prototypes -Wreturn-type -Wmissing-braces -Wparentheses -Wswitch -Wunused-function -Wunused-label -Wunused-variable -Wunused-value -Wunknown-pragmas -Wsign-compare -Werror=uninitialized -Wno-maybe-uninitialized -Werror=pointer-arith -Werror=int-conversion -Werror=incompatible-pointer-types -Werror=discarded-qualifiers -Werror=implicit-int -Werror=declaration-after-statement -Werror-implicit-function-declaration'
WARN_CXXFLAGS=' -Wall -Wcast-align -Wshadow'
YACC=''
YASM=''
YFLAGS=''
ac_ct_CC=''
ac_ct_CXX=''
audit_plugin=''
ax_pthread_config=''
bindir='${exec_prefix}/bin'
build='x86_64-pc-linux-gnu'
build_alias='x86_64-linux-gnu'
build_cpu='x86_64'
build_os='linux-gnu'
build_vendor='pc'
compile_et='compile_et'
datadir='${datarootdir}'
datarootdir='${prefix}/share'
docdir='${datarootdir}/doc/${PACKAGE_TARNAME}'
dvidir='${docdir}'
exec_prefix='NONE'
host='riscv64-unknown-linux-gnu'
host_alias='riscv64-linux-gnu'
host_cpu='riscv64'
host_os='linux-gnu'
host_vendor='unknown'
htmldir='${docdir}'
include_xom=''
includedir='${prefix}/include'
infodir='${prefix}/share/info'
krb5_cv_host='riscv64-unknown-linux-gnu'
ldap_plugin_dir=''
libdir='${prefix}/lib/riscv64-linux-gnu'
libexecdir='${exec_prefix}/libexec'
lmdb_plugin_dir=''
localedir='${datarootdir}/locale'
localstatedir='/etc'
mandir='${prefix}/share/man'
oldincludedir='/usr/include'
pdfdir='${docdir}'
po=''
prefix='/usr'
program_transform_name='s,x,x,'
psdir='${docdir}'
rpcent_define=''
runstatedir='/run'
sam2_plugin=''
sbindir='${exec_prefix}/sbin'
sharedstatedir='${prefix}/com'
sysconfdir='/etc'
target_alias=''

## ------------------- ##
## File substitutions. ##
## ------------------- ##

lib_frag='../src/./config/lib.in'
libnodeps_frag='../src/./config/libnodeps.in'
libnover_frag='../src/./config/libnover.in'
libobj_frag='../src/./config/libobj.in'
libpriv_frag='../src/./config/libpriv.in'

## ----------- ##
## confdefs.h. ##
## ----------- ##

/* confdefs.h */
#define PACKAGE_NAME "Kerberos 5"
#define PACKAGE_TARNAME "krb5"
#define PACKAGE_VERSION "1.21.3"
#define PACKAGE_STRING "Kerberos 5 1.21.3"
#define PACKAGE_BUGREPORT "krb5-bugs@mit.edu"
#define PACKAGE_URL ""
#define _GNU_SOURCE 1
#define __STDC_WANT_LIB_EXT1__ 1
#define NEED_SS_EXECUTE_COMMAND_PROTO 1
#define HAVE_BT_RSEQ 1
#define KRB5_DNS_LOOKUP 1
#define HAVE_LIBRESOLV 1
#define HAVE_RES_NINIT 1
#define HAVE_RES_NCLOSE 1
#define HAVE_RES_NSEARCH 1
#define HAVE_NS_INITPARSE 1
#define HAVE_NS_NAME_UNCOMPRESS 1
#define HAVE_DN_SKIPNAME 1
#define HAVE_RES_SEARCH 1
#define HAVE_PRAGMA_WEAK_REF 1
#define DELAY_INITIALIZER 1

configure: exit 1
dh_auto_configure: error: cd build && ../src/configure --build=x86_64-linux-gnu --prefix=/usr --includedir=\${prefix}/include --mandir=\${prefix}/share/man --infodir=\${prefix}/share/info --sysconfdir=/etc --localstatedir=/var --disable-option-checking --disable-silent-rules --libdir=\${prefix}/lib/riscv64-linux-gnu --runstatedir=/run --disable-maintainer-mode --disable-dependency-tracking --host=riscv64-linux-gnu --with-system-et --with-system-ss --disable-rpath --enable-shared --with-ldap --without-tcl --with-system-verto --with-lmdb --sysconfdir=/etc --localstatedir=/etc returned exit code 1
make[1]: *** [debian/rules:50: override_dh_auto_configure] Error 25
make[1]: Leaving directory '/<<PKGBUILDDIR>>'
make: *** [debian/rules:161: binary-arch] Error 2
dpkg-buildpackage: error: debian/rules binary-arch subprocess returned exit status 2
--------------------------------------------------------------------------------
Build finished at 2025-03-28T16:05:02Z

+------------------------------------------------------------------------------+
| Finished Timed Build Commands                                                |
+------------------------------------------------------------------------------+


rm -Rf /<<PKGBUILDDIR>>/
--------------------------------------


I: Finished running 'rm -Rf /<<PKGBUILDDIR>>/'.

Finished processing commands.
--------------------------------------------------------------------------------

Finished
--------


+------------------------------------------------------------------------------+
| Cleanup                                                                      |
+------------------------------------------------------------------------------+

Purging /<<BUILDDIR>>
Not cleaning session: cloned chroot in use
E: Build failure (dpkg-buildpackage died)

+------------------------------------------------------------------------------+
| Summary                                                                      |
+------------------------------------------------------------------------------+

Build Architecture: amd64
Build Profiles: cross nocheck
Build Type: any
Build-Space: n/a
Build-Time: 4
Distribution: unstable
Fail-Stage: build
Foreign Architectures: riscv64
Host Architecture: riscv64
Install-Time: 13
Job: krb5_1.21.3-5
Machine Architecture: amd64
Package: krb5
Package-Time: 31
Source-Version: 1.21.3-5
Space: n/a
Status: attempted
Version: 1.21.3-5
--------------------------------------------------------------------------------
Finished at 2025-03-28T16:05:02Z
Build needed 00:00:31, no disk space