sbuild (Debian sbuild) 0.85.0 (04 January 2023) on mjolnir.einval.org

+==============================================================================+
| lunar-date 3.0.1-2 (amd64)                   Tue, 11 Mar 2025 11:33:57 +0000 |
+==============================================================================+

Package: lunar-date
Version: 3.0.1-2
Source Version: 3.0.1-2
Distribution: unstable
Machine Architecture: arm64
Host Architecture: amd64
Build Architecture: arm64
Build Profiles: cross nocheck
Build Type: any

Unpacking /home/helmut/.cache/sbuild/unstable-arm64-sbuild.tar.zst to /tmp/tmp.sbuild.WMks1272PH...
I: NOTICE: Log filtering will replace 'sbuild-unshare-dummy-location' with '<<CHROOT>>'
I: NOTICE: Log filtering will replace 'build/lunar-date-YArExb/resolver-0DFZY8' with '<<RESOLVERDIR>>'

+------------------------------------------------------------------------------+
| Update chroot                                                                |
+------------------------------------------------------------------------------+

Get:1 http://mirror.einval.org/debian unstable InRelease [205 kB]
Get:2 http://mirror.einval.org/debian unstable/main Sources [11.0 MB]
Get:3 http://mirror.einval.org/debian unstable/main amd64 Packages [10.1 MB]
Get:4 http://mirror.einval.org/debian unstable/main arm64 Packages [10.0 MB]
Fetched 31.3 MB in 7s (4344 kB/s)
Reading package lists...
Reading package lists...
Building dependency tree...
Reading state information...
Calculating upgrade...
The following packages will be upgraded:
  apt apt-utils debconf dpkg dpkg-dev libapt-pkg7.0 libc-bin libc-dev-bin
  libc6 libc6-dev libdpkg-perl
11 upgraded, 0 newly installed, 0 to remove and 0 not upgraded.
Need to get 11.0 MB of archives.
After this operation, 66.6 kB of additional disk space will be used.
Get:1 http://mirror.einval.org/debian unstable/main arm64 libc6-dev arm64 2.41-4 [1620 kB]
Get:2 http://mirror.einval.org/debian unstable/main arm64 libc-dev-bin arm64 2.41-4 [57.5 kB]
Get:3 http://mirror.einval.org/debian unstable/main arm64 libc6 arm64 2.41-4 [2484 kB]
Get:4 http://mirror.einval.org/debian unstable/main arm64 libapt-pkg7.0 arm64 2.9.32 [973 kB]
Get:5 http://mirror.einval.org/debian unstable/main arm64 dpkg arm64 1.22.18 [1529 kB]
Get:6 http://mirror.einval.org/debian unstable/main arm64 apt arm64 2.9.32 [1358 kB]
Get:7 http://mirror.einval.org/debian unstable/main arm64 apt-utils arm64 2.9.32 [313 kB]
Get:8 http://mirror.einval.org/debian unstable/main arm64 libc-bin arm64 2.41-4 [549 kB]
Get:9 http://mirror.einval.org/debian unstable/main arm64 debconf all 1.5.91 [121 kB]
Get:10 http://mirror.einval.org/debian unstable/main arm64 dpkg-dev all 1.22.18 [1338 kB]
Get:11 http://mirror.einval.org/debian unstable/main arm64 libdpkg-perl all 1.22.18 [649 kB]
Preconfiguring packages ...
Fetched 11.0 MB in 0s (74.7 MB/s)
(Reading database ... 
(Reading database ... 5%
(Reading database ... 10%
(Reading database ... 15%
(Reading database ... 20%
(Reading database ... 25%
(Reading database ... 30%
(Reading database ... 35%
(Reading database ... 40%
(Reading database ... 45%
(Reading database ... 50%
(Reading database ... 55%
(Reading database ... 60%
(Reading database ... 65%
(Reading database ... 70%
(Reading database ... 75%
(Reading database ... 80%
(Reading database ... 85%
(Reading database ... 90%
(Reading database ... 95%
(Reading database ... 100%
(Reading database ... 11984 files and directories currently installed.)
Preparing to unpack .../libc6-dev_2.41-4_arm64.deb ...
Unpacking libc6-dev:arm64 (2.41-4) over (2.41-3) ...
Preparing to unpack .../libc-dev-bin_2.41-4_arm64.deb ...
Unpacking libc-dev-bin (2.41-4) over (2.41-3) ...
Preparing to unpack .../libc6_2.41-4_arm64.deb ...
Unpacking libc6:arm64 (2.41-4) over (2.41-3) ...
Setting up libc6:arm64 (2.41-4) ...
(Reading database ... 
(Reading database ... 5%
(Reading database ... 10%
(Reading database ... 15%
(Reading database ... 20%
(Reading database ... 25%
(Reading database ... 30%
(Reading database ... 35%
(Reading database ... 40%
(Reading database ... 45%
(Reading database ... 50%
(Reading database ... 55%
(Reading database ... 60%
(Reading database ... 65%
(Reading database ... 70%
(Reading database ... 75%
(Reading database ... 80%
(Reading database ... 85%
(Reading database ... 90%
(Reading database ... 95%
(Reading database ... 100%
(Reading database ... 11984 files and directories currently installed.)
Preparing to unpack .../libapt-pkg7.0_2.9.32_arm64.deb ...
Unpacking libapt-pkg7.0:arm64 (2.9.32) over (2.9.31) ...
Setting up libapt-pkg7.0:arm64 (2.9.32) ...
(Reading database ... 
(Reading database ... 5%
(Reading database ... 10%
(Reading database ... 15%
(Reading database ... 20%
(Reading database ... 25%
(Reading database ... 30%
(Reading database ... 35%
(Reading database ... 40%
(Reading database ... 45%
(Reading database ... 50%
(Reading database ... 55%
(Reading database ... 60%
(Reading database ... 65%
(Reading database ... 70%
(Reading database ... 75%
(Reading database ... 80%
(Reading database ... 85%
(Reading database ... 90%
(Reading database ... 95%
(Reading database ... 100%
(Reading database ... 11984 files and directories currently installed.)
Preparing to unpack .../dpkg_1.22.18_arm64.deb ...
Unpacking dpkg (1.22.18) over (1.22.17) ...
Setting up dpkg (1.22.18) ...
(Reading database ... 
(Reading database ... 5%
(Reading database ... 10%
(Reading database ... 15%
(Reading database ... 20%
(Reading database ... 25%
(Reading database ... 30%
(Reading database ... 35%
(Reading database ... 40%
(Reading database ... 45%
(Reading database ... 50%
(Reading database ... 55%
(Reading database ... 60%
(Reading database ... 65%
(Reading database ... 70%
(Reading database ... 75%
(Reading database ... 80%
(Reading database ... 85%
(Reading database ... 90%
(Reading database ... 95%
(Reading database ... 100%
(Reading database ... 11984 files and directories currently installed.)
Preparing to unpack .../archives/apt_2.9.32_arm64.deb ...
Unpacking apt (2.9.32) over (2.9.31) ...
Setting up apt (2.9.32) ...
(Reading database ... 
(Reading database ... 5%
(Reading database ... 10%
(Reading database ... 15%
(Reading database ... 20%
(Reading database ... 25%
(Reading database ... 30%
(Reading database ... 35%
(Reading database ... 40%
(Reading database ... 45%
(Reading database ... 50%
(Reading database ... 55%
(Reading database ... 60%
(Reading database ... 65%
(Reading database ... 70%
(Reading database ... 75%
(Reading database ... 80%
(Reading database ... 85%
(Reading database ... 90%
(Reading database ... 95%
(Reading database ... 100%
(Reading database ... 11984 files and directories currently installed.)
Preparing to unpack .../apt-utils_2.9.32_arm64.deb ...
Unpacking apt-utils (2.9.32) over (2.9.31) ...
Preparing to unpack .../libc-bin_2.41-4_arm64.deb ...
Unpacking libc-bin (2.41-4) over (2.41-3) ...
Setting up libc-bin (2.41-4) ...
(Reading database ... 
(Reading database ... 5%
(Reading database ... 10%
(Reading database ... 15%
(Reading database ... 20%
(Reading database ... 25%
(Reading database ... 30%
(Reading database ... 35%
(Reading database ... 40%
(Reading database ... 45%
(Reading database ... 50%
(Reading database ... 55%
(Reading database ... 60%
(Reading database ... 65%
(Reading database ... 70%
(Reading database ... 75%
(Reading database ... 80%
(Reading database ... 85%
(Reading database ... 90%
(Reading database ... 95%
(Reading database ... 100%
(Reading database ... 11984 files and directories currently installed.)
Preparing to unpack .../debconf_1.5.91_all.deb ...
Unpacking debconf (1.5.91) over (1.5.90) ...
Setting up debconf (1.5.91) ...
(Reading database ... 
(Reading database ... 5%
(Reading database ... 10%
(Reading database ... 15%
(Reading database ... 20%
(Reading database ... 25%
(Reading database ... 30%
(Reading database ... 35%
(Reading database ... 40%
(Reading database ... 45%
(Reading database ... 50%
(Reading database ... 55%
(Reading database ... 60%
(Reading database ... 65%
(Reading database ... 70%
(Reading database ... 75%
(Reading database ... 80%
(Reading database ... 85%
(Reading database ... 90%
(Reading database ... 95%
(Reading database ... 100%
(Reading database ... 11984 files and directories currently installed.)
Preparing to unpack .../dpkg-dev_1.22.18_all.deb ...
Unpacking dpkg-dev (1.22.18) over (1.22.17) ...
Preparing to unpack .../libdpkg-perl_1.22.18_all.deb ...
Unpacking libdpkg-perl (1.22.18) over (1.22.17) ...
Setting up apt-utils (2.9.32) ...
Setting up libdpkg-perl (1.22.18) ...
Setting up libc-dev-bin (2.41-4) ...
Setting up dpkg-dev (1.22.18) ...
Setting up libc6-dev:arm64 (2.41-4) ...

+------------------------------------------------------------------------------+
| Fetch source files                                                           |
+------------------------------------------------------------------------------+


Check APT
---------

Checking available source versions...

Download source files with APT
------------------------------

Reading package lists...
NOTICE: 'lunar-date' packaging is maintained in the 'Git' version control system at:
https://salsa.debian.org/chinese-team/lunar-date.git
Please use:
git clone https://salsa.debian.org/chinese-team/lunar-date.git
to retrieve the latest (possibly unreleased) updates to the package.
Need to get 111 kB of source archives.
Get:1 http://mirror.einval.org/debian unstable/main lunar-date 3.0.1-2 (dsc) [2452 B]
Get:2 http://mirror.einval.org/debian unstable/main lunar-date 3.0.1-2 (tar) [103 kB]
Get:3 http://mirror.einval.org/debian unstable/main lunar-date 3.0.1-2 (diff) [5008 B]
Fetched 111 kB in 0s (437 kB/s)
Download complete and in download only mode
I: NOTICE: Log filtering will replace 'build/lunar-date-YArExb/lunar-date-3.0.1' with '<<PKGBUILDDIR>>'
I: NOTICE: Log filtering will replace 'build/lunar-date-YArExb' with '<<BUILDDIR>>'

+------------------------------------------------------------------------------+
| Install package build dependencies                                           |
+------------------------------------------------------------------------------+


Setup apt archive
-----------------

Merged Build-Depends: meson, debhelper-compat (= 13), dh-exec, gnome-common, gobject-introspection, gtk-doc-tools (>= 1.0), intltool, libgirepository1.0-dev, libglib2.0-dev, valac, dh-sequence-gir, libc-dev, libstdc++-dev, build-essential:arm64, fakeroot:arm64, crossbuild-essential-amd64:arm64, libc-dev:amd64, libstdc++-dev:amd64
Filtered Build-Depends: meson, debhelper-compat (= 13), dh-exec, gnome-common, gobject-introspection, gtk-doc-tools (>= 1.0), intltool, libgirepository1.0-dev, libglib2.0-dev, valac, dh-sequence-gir, libc-dev, libstdc++-dev, build-essential:arm64, fakeroot:arm64, crossbuild-essential-amd64:arm64, libc-dev:amd64, libstdc++-dev:amd64
dpkg-deb: warning: root directory /<<RESOLVERDIR>>/sbuild-build-depends-main-dummy has unusual owner or group 998:999
dpkg-deb: hint: you might need to pass --root-owner-group, see <https://wiki.debian.org/Teams/Dpkg/RootlessBuilds> for further details
dpkg-deb: warning: ignoring 1 warning about the control file(s)
dpkg-deb: building package 'sbuild-build-depends-main-dummy' in '/<<RESOLVERDIR>>/apt_archive/sbuild-build-depends-main-dummy.deb'.
Ign:1 copy:/<<RESOLVERDIR>>/apt_archive ./ InRelease
Get:2 copy:/<<RESOLVERDIR>>/apt_archive ./ Release [609 B]
Ign:3 copy:/<<RESOLVERDIR>>/apt_archive ./ Release.gpg
Get:4 copy:/<<RESOLVERDIR>>/apt_archive ./ Sources [865 B]
Get:5 copy:/<<RESOLVERDIR>>/apt_archive ./ Packages [909 B]
Fetched 2383 B in 0s (92.0 kB/s)
Reading package lists...
Reading package lists...

Install main build dependencies (apt-based resolver)
----------------------------------------------------

Installing build dependencies
Reading package lists...
Building dependency tree...
Reading state information...
Execute external solver...
The following additional packages will be installed:
  autoconf autoconf-archive automake autopoint autotools-dev
  binutils-x86-64-linux-gnu bsdextrautils ca-certificates
  cpp-14-x86-64-linux-gnu cpp-x86-64-linux-gnu cross-exe-wrapper:amd64
  crossbuild-essential-amd64 debhelper dh-autoreconf dh-exec
  dh-strip-nondeterminism docbook docbook-to-man docbook-xml docbook-xsl dwz
  fakeroot file fontconfig-config fonts-dejavu-core fonts-dejavu-mono
  g++-14-x86-64-linux-gnu g++-x86-64-linux-gnu gcc-14-base:amd64
  gcc-14-cross-base gcc-14-x86-64-linux-gnu gcc-14-x86-64-linux-gnu-base
  gcc-x86-64-linux-gnu gettext gettext-base gir1.2-freedesktop:amd64
  gir1.2-freedesktop-dev:amd64 gir1.2-girepository-2.0:amd64
  gir1.2-girepository-2.0-dev:amd64 gir1.2-glib-2.0:amd64
  gir1.2-glib-2.0-dev:amd64 girepository-tools girepository-tools:amd64
  gnome-common gobject-introspection:amd64 gobject-introspection-bin
  groff-base gtk-doc-tools intltool intltool-debian libarchive-zip-perl
  libasan8:amd64 libasan8-amd64-cross libatomic1:amd64 libatomic1-amd64-cross
  libblkid-dev:amd64 libblkid1:amd64 libbrotli1:amd64 libbz2-1.0:amd64
  libc6:amd64 libc6-amd64-cross libc6-dev:amd64 libc6-dev-amd64-cross
  libcairo-gobject2:amd64 libcairo2:amd64 libclone-perl libcrypt-dev:amd64
  libcrypt1:amd64 libdebhelper-perl libelf1t64 libencode-locale-perl libexpat1
  libexpat1:amd64 libfakeroot libffi-dev:amd64 libffi8 libffi8:amd64
  libfile-listing-perl libfile-stripnondeterminism-perl libfontconfig1:amd64
  libfreetype6:amd64 libgcc-14-dev:amd64 libgcc-14-dev-amd64-cross
  libgcc-s1:amd64 libgcc-s1-amd64-cross libgcrypt20 libgio-2.0-dev:amd64
  libgio-2.0-dev-bin libgirepository-1.0-1 libgirepository-1.0-1:amd64
  libgirepository-1.0-dev:amd64 libgirepository-2.0-0
  libgirepository-2.0-0:amd64 libgirepository1.0-dev:amd64 libglib2.0-0t64
  libglib2.0-0t64:amd64 libglib2.0-bin libglib2.0-data libglib2.0-dev:amd64
  libglib2.0-dev-bin libgomp1:amd64 libgomp1-amd64-cross libgpg-error0
  libhtml-parser-perl libhtml-tagset-perl libhtml-tree-perl
  libhttp-cookies-perl libhttp-date-perl libhttp-message-perl
  libhttp-negotiate-perl libhwasan0:amd64 libhwasan0-amd64-cross libicu72
  libio-html-perl libio-socket-ssl-perl libitm1:amd64 libitm1-amd64-cross
  liblsan0:amd64 liblsan0-amd64-cross liblwp-mediatypes-perl
  liblwp-protocol-https-perl libmagic-mgc libmagic1t64 libmount-dev:amd64
  libmount1:amd64 libncursesw6 libnet-http-perl libnet-ssleay-perl libosp5
  libpcre2-16-0:amd64 libpcre2-32-0:amd64 libpcre2-8-0:amd64
  libpcre2-dev:amd64 libpcre2-posix3:amd64 libpipeline1 libpixman-1-0:amd64
  libpkgconf3 libpng16-16t64:amd64 libpython3-stdlib libpython3.13-minimal
  libpython3.13-stdlib libquadmath0:amd64 libquadmath0-amd64-cross
  libreadline8t64 libselinux1:amd64 libselinux1-dev:amd64 libsepol-dev:amd64
  libsepol2:amd64 libsqlite3-0 libstdc++-14-dev:amd64
  libstdc++-14-dev-amd64-cross libstdc++6:amd64 libstdc++6-amd64-cross
  libsysprof-capture-4-dev:amd64 libtimedate-perl libtool libtry-tiny-perl
  libtsan2:amd64 libtsan2-amd64-cross libubsan1:amd64 libubsan1-amd64-cross
  libuchardet0 libunistring5 liburi-perl libuuid1:amd64 libvala-0.56-0
  libvala-0.56-0:amd64 libvalacodegen-0.56-0 libvalacodegen-0.56-0:amd64
  libwww-perl libwww-robotrules-perl libx11-6:amd64 libx11-data libxau6:amd64
  libxcb-render0:amd64 libxcb-shm0:amd64 libxcb1:amd64 libxdmcp6:amd64
  libxext6:amd64 libxml-parser-perl libxml2 libxrender1:amd64 libxslt1.1
  linux-libc-dev-amd64-cross m4 man-db media-types meson native-architecture
  netbase ninja-build opensp openssl perl-openssl-defaults pkgconf
  pkgconf:amd64 pkgconf-bin po-debconf python3 python3-autocommand
  python3-inflect python3-jaraco.context python3-jaraco.functools
  python3-jaraco.text python3-lxml python3-mako python3-markdown
  python3-markupsafe python3-minimal python3-more-itertools python3-packaging
  python3-pkg-resources python3-pygments python3-setuptools python3-typeguard
  python3-typing-extensions python3-zipp python3.13 python3.13-minimal
  qemu-user readline-common sensible-utils sgml-base sgml-data tzdata
  uuid-dev:amd64 valac:amd64 valac-0.56-vapi valac-bin xml-core xsltproc
  zlib1g:amd64 zlib1g-dev:amd64
Suggested packages:
  gnu-standards autoconf-doc binutils-doc gcc-14-locales cpp-14-doc cpp-doc
  dh-make docbook-defguide docbook-dsssl psgml dbtoepub docbook-xsl-doc-html
  | docbook-xsl-doc-pdf | docbook-xsl-doc-text | docbook-xsl-doc
  docbook-xsl-saxon fop libsaxon-java libxalan2-java libxslthl-java xalan
  gcc-14-doc manpages-dev flex bison gdb-x86-64-linux-gnu gcc-doc gettext-doc
  libasprintf-dev libgettextpo-dev groff dblatex glibc-doc:amd64
  libc-l10n:amd64 locales:amd64 libnss-nis:amd64 libnss-nisplus:amd64
  manpages-dev:amd64 rng-tools libglib2.0-doc:amd64 libgdk-pixbuf2.0-bin
  libxml2-utils libgirepository1.0-doc:amd64 low-memory-monitor
  low-memory-monitor:amd64 libdata-dump-perl libcrypt-ssleay-perl
  cryptsetup-bin:amd64 libstdc++-14-doc:amd64 libtool-doc gfortran
  | fortran95-compiler gcj-jdk libsub-name-perl libbusiness-isbn-perl
  libmime-base32-perl libregexp-ipv6-perl uuid-runtime:amd64
  libauthen-ntlm-perl m4-doc apparmor less www-browser doc-base
  libmail-box-perl python3-doc python3-tk python3-venv python-lxml-doc
  python-mako-doc python3-beaker python-markdown-doc python-pygments-doc
  ttf-bitstream-vera python-setuptools-doc python3.13-venv python3.13-doc
  binfmt-support readline-doc sgml-base-doc perlsgml w3-recs
Recommended packages:
  curl | wget | lynx libidn2-0:amd64 libarchive-cpio-perl shared-mime-info
  xdg-user-dirs shared-mime-info:amd64 xdg-user-dirs:amd64 libgpg-error-l10n
  libhtml-format-perl libio-compress-brotli-perl libgpm2 libltdl-dev
  libdata-dump-perl libhtml-form-perl libhttp-daemon-perl libmailtools-perl
  libmail-sendmail-perl python3-bs4 python3-cssselect python3-html5lib
  python3-yaml qemu-user-binfmt gcc:amd64
The following NEW packages will be installed:
  autoconf autoconf-archive automake autopoint autotools-dev
  binutils-x86-64-linux-gnu bsdextrautils ca-certificates
  cpp-14-x86-64-linux-gnu cpp-x86-64-linux-gnu cross-exe-wrapper:amd64
  crossbuild-essential-amd64 debhelper dh-autoreconf dh-exec
  dh-strip-nondeterminism docbook docbook-to-man docbook-xml docbook-xsl dwz
  fakeroot file fontconfig-config fonts-dejavu-core fonts-dejavu-mono
  g++-14-x86-64-linux-gnu g++-x86-64-linux-gnu gcc-14-base:amd64
  gcc-14-cross-base gcc-14-x86-64-linux-gnu gcc-14-x86-64-linux-gnu-base
  gcc-x86-64-linux-gnu gettext gettext-base gir1.2-freedesktop:amd64
  gir1.2-freedesktop-dev:amd64 gir1.2-girepository-2.0:amd64
  gir1.2-girepository-2.0-dev:amd64 gir1.2-glib-2.0:amd64
  gir1.2-glib-2.0-dev:amd64 girepository-tools girepository-tools:amd64
  gnome-common gobject-introspection:amd64 gobject-introspection-bin
  groff-base gtk-doc-tools intltool intltool-debian libarchive-zip-perl
  libasan8:amd64 libasan8-amd64-cross libatomic1:amd64 libatomic1-amd64-cross
  libblkid-dev:amd64 libblkid1:amd64 libbrotli1:amd64 libbz2-1.0:amd64
  libc6:amd64 libc6-amd64-cross libc6-dev:amd64 libc6-dev-amd64-cross
  libcairo-gobject2:amd64 libcairo2:amd64 libclone-perl libcrypt-dev:amd64
  libcrypt1:amd64 libdebhelper-perl libelf1t64 libencode-locale-perl libexpat1
  libexpat1:amd64 libfakeroot libffi-dev:amd64 libffi8 libffi8:amd64
  libfile-listing-perl libfile-stripnondeterminism-perl libfontconfig1:amd64
  libfreetype6:amd64 libgcc-14-dev:amd64 libgcc-14-dev-amd64-cross
  libgcc-s1:amd64 libgcc-s1-amd64-cross libgcrypt20 libgio-2.0-dev:amd64
  libgio-2.0-dev-bin libgirepository-1.0-1 libgirepository-1.0-1:amd64
  libgirepository-1.0-dev:amd64 libgirepository-2.0-0
  libgirepository-2.0-0:amd64 libgirepository1.0-dev:amd64 libglib2.0-0t64
  libglib2.0-0t64:amd64 libglib2.0-bin libglib2.0-data libglib2.0-dev:amd64
  libglib2.0-dev-bin libgomp1:amd64 libgomp1-amd64-cross libgpg-error0
  libhtml-parser-perl libhtml-tagset-perl libhtml-tree-perl
  libhttp-cookies-perl libhttp-date-perl libhttp-message-perl
  libhttp-negotiate-perl libhwasan0:amd64 libhwasan0-amd64-cross libicu72
  libio-html-perl libio-socket-ssl-perl libitm1:amd64 libitm1-amd64-cross
  liblsan0:amd64 liblsan0-amd64-cross liblwp-mediatypes-perl
  liblwp-protocol-https-perl libmagic-mgc libmagic1t64 libmount-dev:amd64
  libmount1:amd64 libncursesw6 libnet-http-perl libnet-ssleay-perl libosp5
  libpcre2-16-0:amd64 libpcre2-32-0:amd64 libpcre2-8-0:amd64
  libpcre2-dev:amd64 libpcre2-posix3:amd64 libpipeline1 libpixman-1-0:amd64
  libpkgconf3 libpng16-16t64:amd64 libpython3-stdlib libpython3.13-minimal
  libpython3.13-stdlib libquadmath0:amd64 libquadmath0-amd64-cross
  libreadline8t64 libselinux1:amd64 libselinux1-dev:amd64 libsepol-dev:amd64
  libsepol2:amd64 libsqlite3-0 libstdc++-14-dev:amd64
  libstdc++-14-dev-amd64-cross libstdc++6:amd64 libstdc++6-amd64-cross
  libsysprof-capture-4-dev:amd64 libtimedate-perl libtool libtry-tiny-perl
  libtsan2:amd64 libtsan2-amd64-cross libubsan1:amd64 libubsan1-amd64-cross
  libuchardet0 libunistring5 liburi-perl libuuid1:amd64 libvala-0.56-0
  libvala-0.56-0:amd64 libvalacodegen-0.56-0 libvalacodegen-0.56-0:amd64
  libwww-perl libwww-robotrules-perl libx11-6:amd64 libx11-data libxau6:amd64
  libxcb-render0:amd64 libxcb-shm0:amd64 libxcb1:amd64 libxdmcp6:amd64
  libxext6:amd64 libxml-parser-perl libxml2 libxrender1:amd64 libxslt1.1
  linux-libc-dev-amd64-cross m4 man-db media-types meson native-architecture
  netbase ninja-build opensp openssl perl-openssl-defaults pkgconf
  pkgconf:amd64 pkgconf-bin po-debconf python3 python3-autocommand
  python3-inflect python3-jaraco.context python3-jaraco.functools
  python3-jaraco.text python3-lxml python3-mako python3-markdown
  python3-markupsafe python3-minimal python3-more-itertools python3-packaging
  python3-pkg-resources python3-pygments python3-setuptools python3-typeguard
  python3-typing-extensions python3-zipp python3.13 python3.13-minimal
  qemu-user readline-common sbuild-build-depends-main-dummy:amd64
  sensible-utils sgml-base sgml-data tzdata uuid-dev:amd64 valac:amd64
  valac-0.56-vapi valac-bin xml-core xsltproc zlib1g:amd64 zlib1g-dev:amd64
0 upgraded, 234 newly installed, 0 to remove and 0 not upgraded.
Need to get 211 MB of archives.
After this operation, 1097 MB of additional disk space will be used.
Get:1 copy:/<<RESOLVERDIR>>/apt_archive ./ sbuild-build-depends-main-dummy 0.invalid.0 [1000 B]
Get:2 http://mirror.einval.org/debian unstable/main arm64 autoconf-archive all 20220903-3 [775 kB]
Get:3 http://mirror.einval.org/debian unstable/main arm64 libpython3.13-minimal arm64 3.13.2-1 [853 kB]
Get:4 http://mirror.einval.org/debian unstable/main arm64 libexpat1 arm64 2.6.4-1 [90.7 kB]
Get:5 http://mirror.einval.org/debian unstable/main arm64 python3.13-minimal arm64 3.13.2-1 [1997 kB]
Get:6 http://mirror.einval.org/debian unstable/main arm64 python3-minimal arm64 3.13.2-2 [27.1 kB]
Get:7 http://mirror.einval.org/debian unstable/main arm64 media-types all 13.0.0 [29.3 kB]
Get:8 http://mirror.einval.org/debian unstable/main arm64 netbase all 6.4 [12.8 kB]
Get:9 http://mirror.einval.org/debian unstable/main arm64 tzdata all 2025a-2 [259 kB]
Get:10 http://mirror.einval.org/debian unstable/main arm64 libffi8 arm64 3.4.7-1 [21.2 kB]
Get:11 http://mirror.einval.org/debian unstable/main arm64 libncursesw6 arm64 6.5+20250216-2 [124 kB]
Get:12 http://mirror.einval.org/debian unstable/main arm64 readline-common all 8.2-6 [69.4 kB]
Get:13 http://mirror.einval.org/debian unstable/main arm64 libreadline8t64 arm64 8.2-6 [159 kB]
Get:14 http://mirror.einval.org/debian unstable/main arm64 libsqlite3-0 arm64 3.46.1-2 [852 kB]
Get:15 http://mirror.einval.org/debian unstable/main arm64 libpython3.13-stdlib arm64 3.13.2-1 [1914 kB]
Get:16 http://mirror.einval.org/debian unstable/main arm64 python3.13 arm64 3.13.2-1 [745 kB]
Get:17 http://mirror.einval.org/debian unstable/main arm64 libpython3-stdlib arm64 3.13.2-2 [10.1 kB]
Get:18 http://mirror.einval.org/debian unstable/main arm64 python3 arm64 3.13.2-2 [28.1 kB]
Get:19 http://mirror.einval.org/debian unstable/main arm64 sgml-base all 1.31 [15.4 kB]
Get:20 http://mirror.einval.org/debian unstable/main arm64 sensible-utils all 0.0.24 [24.8 kB]
Get:21 http://mirror.einval.org/debian unstable/main arm64 openssl arm64 3.4.1-1 [1390 kB]
Get:22 http://mirror.einval.org/debian unstable/main arm64 ca-certificates all 20241223 [164 kB]
Get:23 http://mirror.einval.org/debian unstable/main arm64 libmagic-mgc arm64 1:5.45-3+b1 [314 kB]
Get:24 http://mirror.einval.org/debian unstable/main arm64 libmagic1t64 arm64 1:5.45-3+b1 [102 kB]
Get:25 http://mirror.einval.org/debian unstable/main arm64 file arm64 1:5.45-3+b1 [43.4 kB]
Get:26 http://mirror.einval.org/debian unstable/main arm64 gettext-base arm64 0.23.1-1 [241 kB]
Get:27 http://mirror.einval.org/debian unstable/main arm64 libuchardet0 arm64 0.0.8-1+b2 [69.2 kB]
Get:28 http://mirror.einval.org/debian unstable/main arm64 groff-base arm64 1.23.0-7 [1129 kB]
Get:29 http://mirror.einval.org/debian unstable/main arm64 bsdextrautils arm64 2.40.4-5 [92.0 kB]
Get:30 http://mirror.einval.org/debian unstable/main arm64 libpipeline1 arm64 1.5.8-1 [40.2 kB]
Get:31 http://mirror.einval.org/debian unstable/main arm64 man-db arm64 2.13.0-1 [1404 kB]
Get:32 http://mirror.einval.org/debian unstable/main arm64 m4 arm64 1.4.19-7 [285 kB]
Get:33 http://mirror.einval.org/debian unstable/main arm64 autoconf all 2.72-3 [493 kB]
Get:34 http://mirror.einval.org/debian unstable/main arm64 autotools-dev all 20220109.1 [51.6 kB]
Get:35 http://mirror.einval.org/debian unstable/main arm64 automake all 1:1.17-3 [862 kB]
Get:36 http://mirror.einval.org/debian unstable/main arm64 autopoint all 0.23.1-1 [770 kB]
Get:37 http://mirror.einval.org/debian unstable/main arm64 gcc-14-x86-64-linux-gnu-base arm64 14.2.0-12cross1 [48.5 kB]
Get:38 http://mirror.einval.org/debian unstable/main arm64 cpp-14-x86-64-linux-gnu arm64 14.2.0-12cross1 [10.4 MB]
Get:39 http://mirror.einval.org/debian unstable/main arm64 cpp-x86-64-linux-gnu arm64 4:14.2.0-1 [4852 B]
Get:40 http://mirror.einval.org/debian unstable/main amd64 gcc-14-base amd64 14.2.0-17 [49.1 kB]
Get:41 http://mirror.einval.org/debian unstable/main amd64 libgcc-s1 amd64 14.2.0-17 [72.7 kB]
Get:42 http://mirror.einval.org/debian unstable/main amd64 libc6 amd64 2.41-4 [2843 kB]
Get:43 http://mirror.einval.org/debian unstable/main arm64 qemu-user arm64 1:9.2.2+ds-1 [61.9 MB]
Get:44 http://mirror.einval.org/debian unstable/main amd64 cross-exe-wrapper amd64 0.2.6 [6660 B]
Get:45 http://mirror.einval.org/debian unstable/main arm64 binutils-x86-64-linux-gnu arm64 2.44-3 [1483 kB]
Get:46 http://mirror.einval.org/debian unstable/main arm64 gcc-14-cross-base all 14.2.0-12cross1 [43.7 kB]
Get:47 http://mirror.einval.org/debian unstable/main arm64 libgcc-s1-amd64-cross all 14.2.0-12cross1 [72.8 kB]
Get:48 http://mirror.einval.org/debian unstable/main arm64 libgomp1-amd64-cross all 14.2.0-12cross1 [129 kB]
Get:49 http://mirror.einval.org/debian unstable/main arm64 libitm1-amd64-cross all 14.2.0-12cross1 [25.3 kB]
Get:50 http://mirror.einval.org/debian unstable/main arm64 libatomic1-amd64-cross all 14.2.0-12cross1 [8976 B]
Get:51 http://mirror.einval.org/debian unstable/main arm64 libasan8-amd64-cross all 14.2.0-12cross1 [2713 kB]
Get:52 http://mirror.einval.org/debian unstable/main arm64 liblsan0-amd64-cross all 14.2.0-12cross1 [1204 kB]
Get:53 http://mirror.einval.org/debian unstable/main arm64 libtsan2-amd64-cross all 14.2.0-12cross1 [2449 kB]
Get:54 http://mirror.einval.org/debian unstable/main arm64 libc6-amd64-cross all 2.41-4cross1 [1557 kB]
Get:55 http://mirror.einval.org/debian unstable/main arm64 libstdc++6-amd64-cross all 14.2.0-12cross1 [666 kB]
Get:56 http://mirror.einval.org/debian unstable/main arm64 libubsan1-amd64-cross all 14.2.0-12cross1 [1074 kB]
Get:57 http://mirror.einval.org/debian unstable/main arm64 libhwasan0-amd64-cross all 14.2.0-12cross1 [1485 kB]
Get:58 http://mirror.einval.org/debian unstable/main arm64 libquadmath0-amd64-cross all 14.2.0-12cross1 [145 kB]
Get:59 http://mirror.einval.org/debian unstable/main arm64 libgcc-14-dev-amd64-cross all 14.2.0-12cross1 [2667 kB]
Get:60 http://mirror.einval.org/debian unstable/main arm64 gcc-14-x86-64-linux-gnu arm64 14.2.0-12cross1 [20.0 MB]
Get:61 http://mirror.einval.org/debian unstable/main arm64 gcc-x86-64-linux-gnu arm64 4:14.2.0-1 [1448 B]
Get:62 http://mirror.einval.org/debian unstable/main arm64 linux-libc-dev-amd64-cross all 6.12.17-1cross1 [2368 kB]
Get:63 http://mirror.einval.org/debian unstable/main arm64 libc6-dev-amd64-cross all 2.41-4cross1 [1983 kB]
Get:64 http://mirror.einval.org/debian unstable/main arm64 libstdc++-14-dev-amd64-cross all 14.2.0-12cross1 [2352 kB]
Get:65 http://mirror.einval.org/debian unstable/main arm64 g++-14-x86-64-linux-gnu arm64 14.2.0-12cross1 [11.3 MB]
Get:66 http://mirror.einval.org/debian unstable/main arm64 g++-x86-64-linux-gnu arm64 4:14.2.0-1 [1204 B]
Get:67 http://mirror.einval.org/debian unstable/main arm64 crossbuild-essential-amd64 all 12.12 [3552 B]
Get:68 http://mirror.einval.org/debian unstable/main arm64 libdebhelper-perl all 13.24.1 [90.9 kB]
Get:69 http://mirror.einval.org/debian unstable/main arm64 libtool all 2.5.4-4 [539 kB]
Get:70 http://mirror.einval.org/debian unstable/main arm64 dh-autoreconf all 20 [17.1 kB]
Get:71 http://mirror.einval.org/debian unstable/main arm64 libarchive-zip-perl all 1.68-1 [104 kB]
Get:72 http://mirror.einval.org/debian unstable/main arm64 libfile-stripnondeterminism-perl all 1.14.1-2 [19.7 kB]
Get:73 http://mirror.einval.org/debian unstable/main arm64 dh-strip-nondeterminism all 1.14.1-2 [8620 B]
Get:74 http://mirror.einval.org/debian unstable/main arm64 libelf1t64 arm64 0.192-4 [189 kB]
Get:75 http://mirror.einval.org/debian unstable/main arm64 dwz arm64 0.15-1+b1 [102 kB]
Get:76 http://mirror.einval.org/debian unstable/main arm64 libunistring5 arm64 1.3-1 [449 kB]
Get:77 http://mirror.einval.org/debian unstable/main arm64 libicu72 arm64 72.1-6 [9239 kB]
Get:78 http://mirror.einval.org/debian unstable/main arm64 libxml2 arm64 2.12.7+dfsg+really2.9.14-0.2+b2 [630 kB]
Get:79 http://mirror.einval.org/debian unstable/main arm64 gettext arm64 0.23.1-1 [1610 kB]
Get:80 http://mirror.einval.org/debian unstable/main arm64 intltool-debian all 0.35.0+20060710.6 [22.9 kB]
Get:81 http://mirror.einval.org/debian unstable/main arm64 po-debconf all 1.0.21+nmu1 [248 kB]
Get:82 http://mirror.einval.org/debian unstable/main arm64 debhelper all 13.24.1 [920 kB]
Get:83 http://mirror.einval.org/debian unstable/main arm64 dh-exec arm64 0.30+b1 [25.8 kB]
Get:84 http://mirror.einval.org/debian unstable/main arm64 xml-core all 0.19 [20.1 kB]
Get:85 http://mirror.einval.org/debian unstable/main arm64 sgml-data all 2.0.11+nmu1 [179 kB]
Get:86 http://mirror.einval.org/debian unstable/main arm64 docbook all 4.5-11 [126 kB]
Get:87 http://mirror.einval.org/debian unstable/main arm64 libosp5 arm64 1.5.2-15.2 [922 kB]
Get:88 http://mirror.einval.org/debian unstable/main arm64 opensp arm64 1.5.2-15.2 [442 kB]
Get:89 http://mirror.einval.org/debian unstable/main arm64 docbook-to-man arm64 1:2.0.0-48 [71.1 kB]
Get:90 http://mirror.einval.org/debian unstable/main arm64 docbook-xml all 4.5-13 [77.4 kB]
Get:91 http://mirror.einval.org/debian unstable/main arm64 docbook-xsl all 1.79.2+dfsg-7 [1221 kB]
Get:92 http://mirror.einval.org/debian unstable/main arm64 libfakeroot arm64 1.37-1 [29.5 kB]
Get:93 http://mirror.einval.org/debian unstable/main arm64 fakeroot arm64 1.37-1 [74.9 kB]
Get:94 http://mirror.einval.org/debian unstable/main arm64 fonts-dejavu-mono all 2.37-8 [489 kB]
Get:95 http://mirror.einval.org/debian unstable/main arm64 fonts-dejavu-core all 2.37-8 [840 kB]
Get:96 http://mirror.einval.org/debian unstable/main arm64 fontconfig-config arm64 2.15.0-2.1 [318 kB]
Get:97 http://mirror.einval.org/debian unstable/main amd64 libatomic1 amd64 14.2.0-17 [9316 B]
Get:98 http://mirror.einval.org/debian unstable/main amd64 libffi8 amd64 3.4.7-1 [23.9 kB]
Get:99 http://mirror.einval.org/debian unstable/main amd64 libblkid1 amd64 2.40.4-5 [169 kB]
Get:100 http://mirror.einval.org/debian unstable/main amd64 libpcre2-8-0 amd64 10.45-1 [298 kB]
Get:101 http://mirror.einval.org/debian unstable/main amd64 libselinux1 amd64 3.8-4 [84.8 kB]
Get:102 http://mirror.einval.org/debian unstable/main amd64 libmount1 amd64 2.40.4-5 [200 kB]
Get:103 http://mirror.einval.org/debian unstable/main amd64 zlib1g amd64 1:1.3.dfsg+really1.3.1-1+b1 [88.9 kB]
Get:104 http://mirror.einval.org/debian unstable/main amd64 libglib2.0-0t64 amd64 2.84.0-1 [1514 kB]
Get:105 http://mirror.einval.org/debian unstable/main amd64 gir1.2-glib-2.0 amd64 2.84.0-1 [197 kB]
Get:106 http://mirror.einval.org/debian unstable/main amd64 libexpat1 amd64 2.6.4-1 [106 kB]
Get:107 http://mirror.einval.org/debian unstable/main amd64 libbrotli1 amd64 1.1.0-2+b7 [307 kB]
Get:108 http://mirror.einval.org/debian unstable/main amd64 libbz2-1.0 amd64 1.0.8-6 [37.9 kB]
Get:109 http://mirror.einval.org/debian unstable/main amd64 libpng16-16t64 amd64 1.6.47-1 [282 kB]
Get:110 http://mirror.einval.org/debian unstable/main amd64 libfreetype6 amd64 2.13.3+dfsg-1 [452 kB]
Get:111 http://mirror.einval.org/debian unstable/main amd64 libfontconfig1 amd64 2.15.0-2.1 [391 kB]
Get:112 http://mirror.einval.org/debian unstable/main amd64 libpixman-1-0 amd64 0.44.0-3 [248 kB]
Get:113 http://mirror.einval.org/debian unstable/main amd64 libxau6 amd64 1:1.0.11-1 [20.4 kB]
Get:114 http://mirror.einval.org/debian unstable/main amd64 libxdmcp6 amd64 1:1.1.5-1 [27.8 kB]
Get:115 http://mirror.einval.org/debian unstable/main amd64 libxcb1 amd64 1.17.0-2+b1 [144 kB]
Get:116 http://mirror.einval.org/debian unstable/main arm64 libx11-data all 2:1.8.10-2 [337 kB]
Get:117 http://mirror.einval.org/debian unstable/main amd64 libx11-6 amd64 2:1.8.10-2 [813 kB]
Get:118 http://mirror.einval.org/debian unstable/main amd64 libxcb-render0 amd64 1.17.0-2+b1 [115 kB]
Get:119 http://mirror.einval.org/debian unstable/main amd64 libxcb-shm0 amd64 1.17.0-2+b1 [105 kB]
Get:120 http://mirror.einval.org/debian unstable/main amd64 libxext6 amd64 2:1.3.4-1+b3 [50.4 kB]
Get:121 http://mirror.einval.org/debian unstable/main amd64 libxrender1 amd64 1:0.9.10-1.1+b4 [27.8 kB]
Get:122 http://mirror.einval.org/debian unstable/main amd64 libcairo2 amd64 1.18.2-2 [535 kB]
Get:123 http://mirror.einval.org/debian unstable/main amd64 libcairo-gobject2 amd64 1.18.2-2 [130 kB]
Get:124 http://mirror.einval.org/debian unstable/main amd64 gir1.2-freedesktop amd64 1.83.4-1 [60.5 kB]
Get:125 http://mirror.einval.org/debian unstable/main amd64 gir1.2-glib-2.0-dev amd64 2.84.0-1 [913 kB]
Get:126 http://mirror.einval.org/debian unstable/main amd64 gir1.2-freedesktop-dev amd64 1.83.4-1 [51.5 kB]
Get:127 http://mirror.einval.org/debian unstable/main amd64 libgirepository-1.0-1 amd64 1.83.4-1 [116 kB]
Get:128 http://mirror.einval.org/debian unstable/main amd64 gir1.2-girepository-2.0 amd64 1.83.4-1 [39.7 kB]
Get:129 http://mirror.einval.org/debian unstable/main amd64 gir1.2-girepository-2.0-dev amd64 1.83.4-1 [57.4 kB]
Get:130 http://mirror.einval.org/debian unstable/main arm64 native-architecture all 0.2.6 [2264 B]
Get:131 http://mirror.einval.org/debian unstable/main arm64 libglib2.0-0t64 arm64 2.84.0-1 [1423 kB]
Get:132 http://mirror.einval.org/debian unstable/main arm64 libgirepository-2.0-0 arm64 2.84.0-1 [132 kB]
Get:133 http://mirror.einval.org/debian unstable/main arm64 girepository-tools arm64 2.84.0-1 [137 kB]
Get:134 http://mirror.einval.org/debian unstable/main amd64 libgirepository-2.0-0 amd64 2.84.0-1 [141 kB]
Get:135 http://mirror.einval.org/debian unstable/main amd64 girepository-tools amd64 2.84.0-1 [148 kB]
Get:136 http://mirror.einval.org/debian unstable/main arm64 liburi-perl all 5.30-1 [105 kB]
Get:137 http://mirror.einval.org/debian unstable/main arm64 libencode-locale-perl all 1.05-3 [12.9 kB]
Get:138 http://mirror.einval.org/debian unstable/main arm64 libtimedate-perl all 2.3300-2 [39.3 kB]
Get:139 http://mirror.einval.org/debian unstable/main arm64 libhttp-date-perl all 6.06-1 [10.7 kB]
Get:140 http://mirror.einval.org/debian unstable/main arm64 libfile-listing-perl all 6.16-1 [12.4 kB]
Get:141 http://mirror.einval.org/debian unstable/main arm64 libhtml-tagset-perl all 3.24-1 [14.7 kB]
Get:142 http://mirror.einval.org/debian unstable/main arm64 libhtml-parser-perl arm64 3.83-1+b2 [97.5 kB]
Get:143 http://mirror.einval.org/debian unstable/main arm64 libhtml-tree-perl all 5.07-3 [211 kB]
Get:144 http://mirror.einval.org/debian unstable/main arm64 libclone-perl arm64 0.47-1+b1 [13.7 kB]
Get:145 http://mirror.einval.org/debian unstable/main arm64 libio-html-perl all 1.004-3 [16.2 kB]
Get:146 http://mirror.einval.org/debian unstable/main arm64 liblwp-mediatypes-perl all 6.04-2 [20.2 kB]
Get:147 http://mirror.einval.org/debian unstable/main arm64 libhttp-message-perl all 7.00-2 [79.8 kB]
Get:148 http://mirror.einval.org/debian unstable/main arm64 libhttp-cookies-perl all 6.11-1 [19.1 kB]
Get:149 http://mirror.einval.org/debian unstable/main arm64 libhttp-negotiate-perl all 6.01-2 [13.1 kB]
Get:150 http://mirror.einval.org/debian unstable/main arm64 perl-openssl-defaults arm64 7+b2 [6712 B]
Get:151 http://mirror.einval.org/debian unstable/main arm64 libnet-ssleay-perl arm64 1.94-3 [323 kB]
Get:152 http://mirror.einval.org/debian unstable/main arm64 libio-socket-ssl-perl all 2.089-1 [223 kB]
Get:153 http://mirror.einval.org/debian unstable/main arm64 libnet-http-perl all 6.23-1 [23.9 kB]
Get:154 http://mirror.einval.org/debian unstable/main arm64 liblwp-protocol-https-perl all 6.14-1 [10.8 kB]
Get:155 http://mirror.einval.org/debian unstable/main arm64 libtry-tiny-perl all 0.32-1 [22.9 kB]
Get:156 http://mirror.einval.org/debian unstable/main arm64 libwww-robotrules-perl all 6.02-1 [12.9 kB]
Get:157 http://mirror.einval.org/debian unstable/main arm64 libwww-perl all 6.78-1 [183 kB]
Get:158 http://mirror.einval.org/debian unstable/main arm64 libxml-parser-perl arm64 2.47-1+b3 [197 kB]
Get:159 http://mirror.einval.org/debian unstable/main arm64 intltool all 0.51.0-6 [50.8 kB]
Get:160 http://mirror.einval.org/debian unstable/main arm64 libpkgconf3 arm64 1.8.1-4 [35.3 kB]
Get:161 http://mirror.einval.org/debian unstable/main arm64 pkgconf-bin arm64 1.8.1-4 [29.6 kB]
Get:162 http://mirror.einval.org/debian unstable/main arm64 pkgconf arm64 1.8.1-4 [26.1 kB]
Get:163 http://mirror.einval.org/debian unstable/main arm64 gnome-common all 3.18.0-6 [131 kB]
Get:164 http://mirror.einval.org/debian unstable/main arm64 libgirepository-1.0-1 arm64 1.83.4-1 [108 kB]
Get:165 http://mirror.einval.org/debian unstable/main arm64 python3-markupsafe arm64 2.1.5-1+b4 [14.1 kB]
Get:166 http://mirror.einval.org/debian unstable/main arm64 python3-mako all 1.3.8-2 [83.5 kB]
Get:167 http://mirror.einval.org/debian unstable/main arm64 python3-markdown all 3.7-2 [85.2 kB]
Get:168 http://mirror.einval.org/debian unstable/main arm64 python3-autocommand all 2.2.2-3 [13.6 kB]
Get:169 http://mirror.einval.org/debian unstable/main arm64 python3-more-itertools all 10.6.0-1 [65.3 kB]
Get:170 http://mirror.einval.org/debian unstable/main arm64 python3-typing-extensions all 4.12.2-2 [73.0 kB]
Get:171 http://mirror.einval.org/debian unstable/main arm64 python3-typeguard all 4.4.2-1 [37.3 kB]
Get:172 http://mirror.einval.org/debian unstable/main arm64 python3-inflect all 7.3.1-2 [32.4 kB]
Get:173 http://mirror.einval.org/debian unstable/main arm64 python3-jaraco.context all 6.0.1-1 [8276 B]
Get:174 http://mirror.einval.org/debian unstable/main arm64 python3-jaraco.functools all 4.1.0-1 [12.0 kB]
Get:175 http://mirror.einval.org/debian unstable/main arm64 python3-pkg-resources all 75.8.0-1 [222 kB]
Get:176 http://mirror.einval.org/debian unstable/main arm64 python3-jaraco.text all 4.0.0-1 [11.4 kB]
Get:177 http://mirror.einval.org/debian unstable/main arm64 python3-zipp all 3.21.0-1 [10.6 kB]
Get:178 http://mirror.einval.org/debian unstable/main arm64 python3-setuptools all 75.8.0-1 [724 kB]
Get:179 http://mirror.einval.org/debian unstable/main arm64 gobject-introspection-bin arm64 1.83.4-1 [270 kB]
Get:180 http://mirror.einval.org/debian unstable/main amd64 libffi-dev amd64 3.4.7-1 [60.8 kB]
Get:181 http://mirror.einval.org/debian unstable/main amd64 libcrypt1 amd64 1:4.4.38-1 [90.1 kB]
Get:182 http://mirror.einval.org/debian unstable/main amd64 libcrypt-dev amd64 1:4.4.38-1 [119 kB]
Get:183 http://mirror.einval.org/debian unstable/main amd64 libc6-dev amd64 2.41-4 [1989 kB]
Get:184 http://mirror.einval.org/debian unstable/main amd64 libuuid1 amd64 2.40.4-5 [36.5 kB]
Get:185 http://mirror.einval.org/debian unstable/main amd64 uuid-dev amd64 2.40.4-5 [47.8 kB]
Get:186 http://mirror.einval.org/debian unstable/main amd64 libblkid-dev amd64 2.40.4-5 [205 kB]
Get:187 http://mirror.einval.org/debian unstable/main amd64 libsepol2 amd64 3.8-1 [296 kB]
Get:188 http://mirror.einval.org/debian unstable/main amd64 libsepol-dev amd64 3.8-1 [372 kB]
Get:189 http://mirror.einval.org/debian unstable/main amd64 libpcre2-16-0 amd64 10.45-1 [281 kB]
Get:190 http://mirror.einval.org/debian unstable/main amd64 libpcre2-32-0 amd64 10.45-1 [268 kB]
Get:191 http://mirror.einval.org/debian unstable/main amd64 libpcre2-posix3 amd64 10.45-1 [63.5 kB]
Get:192 http://mirror.einval.org/debian unstable/main amd64 libpcre2-dev amd64 10.45-1 [853 kB]
Get:193 http://mirror.einval.org/debian unstable/main amd64 libselinux1-dev amd64 3.8-4 [169 kB]
Get:194 http://mirror.einval.org/debian unstable/main amd64 libmount-dev amd64 2.40.4-5 [29.6 kB]
Get:195 http://mirror.einval.org/debian unstable/main amd64 libsysprof-capture-4-dev amd64 48~beta-2 [48.0 kB]
Get:196 http://mirror.einval.org/debian unstable/main amd64 pkgconf amd64 1.8.1-4 [26.2 kB]
Get:197 http://mirror.einval.org/debian unstable/main amd64 zlib1g-dev amd64 1:1.3.dfsg+really1.3.1-1+b1 [920 kB]
Get:198 http://mirror.einval.org/debian unstable/main amd64 libgio-2.0-dev amd64 2.84.0-1 [1685 kB]
Get:199 http://mirror.einval.org/debian unstable/main arm64 libglib2.0-data all 2.84.0-1 [1287 kB]
Get:200 http://mirror.einval.org/debian unstable/main arm64 libglib2.0-bin arm64 2.84.0-1 [124 kB]
Get:201 http://mirror.einval.org/debian unstable/main arm64 python3-packaging all 24.2-1 [55.3 kB]
Get:202 http://mirror.einval.org/debian unstable/main arm64 libgio-2.0-dev-bin arm64 2.84.0-1 [163 kB]
Get:203 http://mirror.einval.org/debian unstable/main arm64 libglib2.0-dev-bin arm64 2.84.0-1 [52.8 kB]
Get:204 http://mirror.einval.org/debian unstable/main amd64 libglib2.0-dev amd64 2.84.0-1 [53.6 kB]
Get:205 http://mirror.einval.org/debian unstable/main amd64 gobject-introspection amd64 1.83.4-1 [126 kB]
Get:206 http://mirror.einval.org/debian unstable/main arm64 libgpg-error0 arm64 1.51-3 [78.5 kB]
Get:207 http://mirror.einval.org/debian unstable/main arm64 libgcrypt20 arm64 1.11.0-7 [742 kB]
Get:208 http://mirror.einval.org/debian unstable/main arm64 libxslt1.1 arm64 1.1.35-1.1+b1 [222 kB]
Get:209 http://mirror.einval.org/debian unstable/main arm64 python3-lxml arm64 5.3.1-1+b1 [1139 kB]
Get:210 http://mirror.einval.org/debian unstable/main arm64 python3-pygments all 2.18.0+dfsg-2 [836 kB]
Get:211 http://mirror.einval.org/debian unstable/main arm64 xsltproc arm64 1.1.35-1.1+b1 [115 kB]
Get:212 http://mirror.einval.org/debian unstable/main arm64 gtk-doc-tools all 1.34.0-2 [328 kB]
Get:213 http://mirror.einval.org/debian unstable/main amd64 libasan8 amd64 14.2.0-17 [2730 kB]
Get:214 http://mirror.einval.org/debian unstable/main amd64 libgomp1 amd64 14.2.0-17 [137 kB]
Get:215 http://mirror.einval.org/debian unstable/main amd64 libitm1 amd64 14.2.0-17 [25.9 kB]
Get:216 http://mirror.einval.org/debian unstable/main amd64 liblsan0 amd64 14.2.0-17 [1205 kB]
Get:217 http://mirror.einval.org/debian unstable/main amd64 libtsan2 amd64 14.2.0-17 [2460 kB]
Get:218 http://mirror.einval.org/debian unstable/main amd64 libstdc++6 amd64 14.2.0-17 [713 kB]
Get:219 http://mirror.einval.org/debian unstable/main amd64 libubsan1 amd64 14.2.0-17 [1075 kB]
Get:220 http://mirror.einval.org/debian unstable/main amd64 libhwasan0 amd64 14.2.0-17 [1489 kB]
Get:221 http://mirror.einval.org/debian unstable/main amd64 libquadmath0 amd64 14.2.0-17 [145 kB]
Get:222 http://mirror.einval.org/debian unstable/main amd64 libgcc-14-dev amd64 14.2.0-17 [2673 kB]
Get:223 http://mirror.einval.org/debian unstable/main amd64 libgirepository-1.0-dev amd64 1.83.4-1 [44.5 kB]
Get:224 http://mirror.einval.org/debian unstable/main amd64 libgirepository1.0-dev amd64 1.83.4-1 [33.2 kB]
Get:225 http://mirror.einval.org/debian unstable/main amd64 libstdc++-14-dev amd64 14.2.0-17 [2373 kB]
Get:226 http://mirror.einval.org/debian unstable/main amd64 libvala-0.56-0 amd64 0.56.18-2 [871 kB]
Get:227 http://mirror.einval.org/debian unstable/main arm64 libvala-0.56-0 arm64 0.56.18-2 [814 kB]
Get:228 http://mirror.einval.org/debian unstable/main amd64 libvalacodegen-0.56-0 amd64 0.56.18-2 [705 kB]
Get:229 http://mirror.einval.org/debian unstable/main arm64 libvalacodegen-0.56-0 arm64 0.56.18-2 [660 kB]
Get:230 http://mirror.einval.org/debian unstable/main arm64 ninja-build arm64 1.12.1-1+b1 [130 kB]
Get:231 http://mirror.einval.org/debian unstable/main arm64 meson all 1.7.0-1 [639 kB]
Get:232 http://mirror.einval.org/debian unstable/main arm64 valac-0.56-vapi all 0.56.18-2 [1080 kB]
Get:233 http://mirror.einval.org/debian unstable/main arm64 valac-bin arm64 0.56.18-2 [337 kB]
Get:234 http://mirror.einval.org/debian unstable/main amd64 valac amd64 0.56.18-2 [433 kB]
Preconfiguring packages ...
Fetched 211 MB in 2s (88.0 MB/s)
Selecting previously unselected package autoconf-archive.
(Reading database ... 11984 files and directories currently installed.)
Preparing to unpack .../autoconf-archive_20220903-3_all.deb ...
Unpacking autoconf-archive (20220903-3) ...
Selecting previously unselected package libpython3.13-minimal:arm64.
Preparing to unpack .../libpython3.13-minimal_3.13.2-1_arm64.deb ...
Unpacking libpython3.13-minimal:arm64 (3.13.2-1) ...
Selecting previously unselected package libexpat1:arm64.
Preparing to unpack .../libexpat1_2.6.4-1_arm64.deb ...
Unpacking libexpat1:arm64 (2.6.4-1) ...
Selecting previously unselected package python3.13-minimal.
Preparing to unpack .../python3.13-minimal_3.13.2-1_arm64.deb ...
Unpacking python3.13-minimal (3.13.2-1) ...
Setting up libpython3.13-minimal:arm64 (3.13.2-1) ...
Setting up libexpat1:arm64 (2.6.4-1) ...
Setting up python3.13-minimal (3.13.2-1) ...
Selecting previously unselected package python3-minimal.
(Reading database ... 13500 files and directories currently installed.)
Preparing to unpack .../00-python3-minimal_3.13.2-2_arm64.deb ...
Unpacking python3-minimal (3.13.2-2) ...
Selecting previously unselected package media-types.
Preparing to unpack .../01-media-types_13.0.0_all.deb ...
Unpacking media-types (13.0.0) ...
Selecting previously unselected package netbase.
Preparing to unpack .../02-netbase_6.4_all.deb ...
Unpacking netbase (6.4) ...
Selecting previously unselected package tzdata.
Preparing to unpack .../03-tzdata_2025a-2_all.deb ...
Unpacking tzdata (2025a-2) ...
Selecting previously unselected package libffi8:arm64.
Preparing to unpack .../04-libffi8_3.4.7-1_arm64.deb ...
Unpacking libffi8:arm64 (3.4.7-1) ...
Selecting previously unselected package libncursesw6:arm64.
Preparing to unpack .../05-libncursesw6_6.5+20250216-2_arm64.deb ...
Unpacking libncursesw6:arm64 (6.5+20250216-2) ...
Selecting previously unselected package readline-common.
Preparing to unpack .../06-readline-common_8.2-6_all.deb ...
Unpacking readline-common (8.2-6) ...
Selecting previously unselected package libreadline8t64:arm64.
Preparing to unpack .../07-libreadline8t64_8.2-6_arm64.deb ...
Adding 'diversion of /lib/aarch64-linux-gnu/libhistory.so.8 to /lib/aarch64-linux-gnu/libhistory.so.8.usr-is-merged by libreadline8t64'
Adding 'diversion of /lib/aarch64-linux-gnu/libhistory.so.8.2 to /lib/aarch64-linux-gnu/libhistory.so.8.2.usr-is-merged by libreadline8t64'
Adding 'diversion of /lib/aarch64-linux-gnu/libreadline.so.8 to /lib/aarch64-linux-gnu/libreadline.so.8.usr-is-merged by libreadline8t64'
Adding 'diversion of /lib/aarch64-linux-gnu/libreadline.so.8.2 to /lib/aarch64-linux-gnu/libreadline.so.8.2.usr-is-merged by libreadline8t64'
Unpacking libreadline8t64:arm64 (8.2-6) ...
Selecting previously unselected package libsqlite3-0:arm64.
Preparing to unpack .../08-libsqlite3-0_3.46.1-2_arm64.deb ...
Unpacking libsqlite3-0:arm64 (3.46.1-2) ...
Selecting previously unselected package libpython3.13-stdlib:arm64.
Preparing to unpack .../09-libpython3.13-stdlib_3.13.2-1_arm64.deb ...
Unpacking libpython3.13-stdlib:arm64 (3.13.2-1) ...
Selecting previously unselected package python3.13.
Preparing to unpack .../10-python3.13_3.13.2-1_arm64.deb ...
Unpacking python3.13 (3.13.2-1) ...
Selecting previously unselected package libpython3-stdlib:arm64.
Preparing to unpack .../11-libpython3-stdlib_3.13.2-2_arm64.deb ...
Unpacking libpython3-stdlib:arm64 (3.13.2-2) ...
Setting up python3-minimal (3.13.2-2) ...
Selecting previously unselected package python3.
(Reading database ... 14527 files and directories currently installed.)
Preparing to unpack .../000-python3_3.13.2-2_arm64.deb ...
Unpacking python3 (3.13.2-2) ...
Selecting previously unselected package sgml-base.
Preparing to unpack .../001-sgml-base_1.31_all.deb ...
Unpacking sgml-base (1.31) ...
Selecting previously unselected package sensible-utils.
Preparing to unpack .../002-sensible-utils_0.0.24_all.deb ...
Unpacking sensible-utils (0.0.24) ...
Selecting previously unselected package openssl.
Preparing to unpack .../003-openssl_3.4.1-1_arm64.deb ...
Unpacking openssl (3.4.1-1) ...
Selecting previously unselected package ca-certificates.
Preparing to unpack .../004-ca-certificates_20241223_all.deb ...
Unpacking ca-certificates (20241223) ...
Selecting previously unselected package libmagic-mgc.
Preparing to unpack .../005-libmagic-mgc_1%3a5.45-3+b1_arm64.deb ...
Unpacking libmagic-mgc (1:5.45-3+b1) ...
Selecting previously unselected package libmagic1t64:arm64.
Preparing to unpack .../006-libmagic1t64_1%3a5.45-3+b1_arm64.deb ...
Unpacking libmagic1t64:arm64 (1:5.45-3+b1) ...
Selecting previously unselected package file.
Preparing to unpack .../007-file_1%3a5.45-3+b1_arm64.deb ...
Unpacking file (1:5.45-3+b1) ...
Selecting previously unselected package gettext-base.
Preparing to unpack .../008-gettext-base_0.23.1-1_arm64.deb ...
Unpacking gettext-base (0.23.1-1) ...
Selecting previously unselected package libuchardet0:arm64.
Preparing to unpack .../009-libuchardet0_0.0.8-1+b2_arm64.deb ...
Unpacking libuchardet0:arm64 (0.0.8-1+b2) ...
Selecting previously unselected package groff-base.
Preparing to unpack .../010-groff-base_1.23.0-7_arm64.deb ...
Unpacking groff-base (1.23.0-7) ...
Selecting previously unselected package bsdextrautils.
Preparing to unpack .../011-bsdextrautils_2.40.4-5_arm64.deb ...
Unpacking bsdextrautils (2.40.4-5) ...
Selecting previously unselected package libpipeline1:arm64.
Preparing to unpack .../012-libpipeline1_1.5.8-1_arm64.deb ...
Unpacking libpipeline1:arm64 (1.5.8-1) ...
Selecting previously unselected package man-db.
Preparing to unpack .../013-man-db_2.13.0-1_arm64.deb ...
Unpacking man-db (2.13.0-1) ...
Selecting previously unselected package m4.
Preparing to unpack .../014-m4_1.4.19-7_arm64.deb ...
Unpacking m4 (1.4.19-7) ...
Selecting previously unselected package autoconf.
Preparing to unpack .../015-autoconf_2.72-3_all.deb ...
Unpacking autoconf (2.72-3) ...
Selecting previously unselected package autotools-dev.
Preparing to unpack .../016-autotools-dev_20220109.1_all.deb ...
Unpacking autotools-dev (20220109.1) ...
Selecting previously unselected package automake.
Preparing to unpack .../017-automake_1%3a1.17-3_all.deb ...
Unpacking automake (1:1.17-3) ...
Selecting previously unselected package autopoint.
Preparing to unpack .../018-autopoint_0.23.1-1_all.deb ...
Unpacking autopoint (0.23.1-1) ...
Selecting previously unselected package gcc-14-x86-64-linux-gnu-base:arm64.
Preparing to unpack .../019-gcc-14-x86-64-linux-gnu-base_14.2.0-12cross1_arm64.deb ...
Unpacking gcc-14-x86-64-linux-gnu-base:arm64 (14.2.0-12cross1) ...
Selecting previously unselected package cpp-14-x86-64-linux-gnu.
Preparing to unpack .../020-cpp-14-x86-64-linux-gnu_14.2.0-12cross1_arm64.deb ...
Unpacking cpp-14-x86-64-linux-gnu (14.2.0-12cross1) ...
Selecting previously unselected package cpp-x86-64-linux-gnu.
Preparing to unpack .../021-cpp-x86-64-linux-gnu_4%3a14.2.0-1_arm64.deb ...
Unpacking cpp-x86-64-linux-gnu (4:14.2.0-1) ...
Selecting previously unselected package gcc-14-base:amd64.
Preparing to unpack .../022-gcc-14-base_14.2.0-17_amd64.deb ...
Unpacking gcc-14-base:amd64 (14.2.0-17) ...
Selecting previously unselected package libgcc-s1:amd64.
Preparing to unpack .../023-libgcc-s1_14.2.0-17_amd64.deb ...
Unpacking libgcc-s1:amd64 (14.2.0-17) ...
Selecting previously unselected package libc6:amd64.
Preparing to unpack .../024-libc6_2.41-4_amd64.deb ...
Unpacking libc6:amd64 (2.41-4) ...
Selecting previously unselected package qemu-user.
Preparing to unpack .../025-qemu-user_1%3a9.2.2+ds-1_arm64.deb ...
Unpacking qemu-user (1:9.2.2+ds-1) ...
Selecting previously unselected package cross-exe-wrapper:amd64.
Preparing to unpack .../026-cross-exe-wrapper_0.2.6_amd64.deb ...
Unpacking cross-exe-wrapper:amd64 (0.2.6) ...
Selecting previously unselected package binutils-x86-64-linux-gnu.
Preparing to unpack .../027-binutils-x86-64-linux-gnu_2.44-3_arm64.deb ...
Unpacking binutils-x86-64-linux-gnu (2.44-3) ...
Selecting previously unselected package gcc-14-cross-base.
Preparing to unpack .../028-gcc-14-cross-base_14.2.0-12cross1_all.deb ...
Unpacking gcc-14-cross-base (14.2.0-12cross1) ...
Selecting previously unselected package libgcc-s1-amd64-cross.
Preparing to unpack .../029-libgcc-s1-amd64-cross_14.2.0-12cross1_all.deb ...
Unpacking libgcc-s1-amd64-cross (14.2.0-12cross1) ...
Selecting previously unselected package libgomp1-amd64-cross.
Preparing to unpack .../030-libgomp1-amd64-cross_14.2.0-12cross1_all.deb ...
Unpacking libgomp1-amd64-cross (14.2.0-12cross1) ...
Selecting previously unselected package libitm1-amd64-cross.
Preparing to unpack .../031-libitm1-amd64-cross_14.2.0-12cross1_all.deb ...
Unpacking libitm1-amd64-cross (14.2.0-12cross1) ...
Selecting previously unselected package libatomic1-amd64-cross.
Preparing to unpack .../032-libatomic1-amd64-cross_14.2.0-12cross1_all.deb ...
Unpacking libatomic1-amd64-cross (14.2.0-12cross1) ...
Selecting previously unselected package libasan8-amd64-cross.
Preparing to unpack .../033-libasan8-amd64-cross_14.2.0-12cross1_all.deb ...
Unpacking libasan8-amd64-cross (14.2.0-12cross1) ...
Selecting previously unselected package liblsan0-amd64-cross.
Preparing to unpack .../034-liblsan0-amd64-cross_14.2.0-12cross1_all.deb ...
Unpacking liblsan0-amd64-cross (14.2.0-12cross1) ...
Selecting previously unselected package libtsan2-amd64-cross.
Preparing to unpack .../035-libtsan2-amd64-cross_14.2.0-12cross1_all.deb ...
Unpacking libtsan2-amd64-cross (14.2.0-12cross1) ...
Selecting previously unselected package libc6-amd64-cross.
Preparing to unpack .../036-libc6-amd64-cross_2.41-4cross1_all.deb ...
Unpacking libc6-amd64-cross (2.41-4cross1) ...
Selecting previously unselected package libstdc++6-amd64-cross.
Preparing to unpack .../037-libstdc++6-amd64-cross_14.2.0-12cross1_all.deb ...
Unpacking libstdc++6-amd64-cross (14.2.0-12cross1) ...
Selecting previously unselected package libubsan1-amd64-cross.
Preparing to unpack .../038-libubsan1-amd64-cross_14.2.0-12cross1_all.deb ...
Unpacking libubsan1-amd64-cross (14.2.0-12cross1) ...
Selecting previously unselected package libhwasan0-amd64-cross.
Preparing to unpack .../039-libhwasan0-amd64-cross_14.2.0-12cross1_all.deb ...
Unpacking libhwasan0-amd64-cross (14.2.0-12cross1) ...
Selecting previously unselected package libquadmath0-amd64-cross.
Preparing to unpack .../040-libquadmath0-amd64-cross_14.2.0-12cross1_all.deb ...
Unpacking libquadmath0-amd64-cross (14.2.0-12cross1) ...
Selecting previously unselected package libgcc-14-dev-amd64-cross.
Preparing to unpack .../041-libgcc-14-dev-amd64-cross_14.2.0-12cross1_all.deb ...
Unpacking libgcc-14-dev-amd64-cross (14.2.0-12cross1) ...
Selecting previously unselected package gcc-14-x86-64-linux-gnu.
Preparing to unpack .../042-gcc-14-x86-64-linux-gnu_14.2.0-12cross1_arm64.deb ...
Unpacking gcc-14-x86-64-linux-gnu (14.2.0-12cross1) ...
Selecting previously unselected package gcc-x86-64-linux-gnu.
Preparing to unpack .../043-gcc-x86-64-linux-gnu_4%3a14.2.0-1_arm64.deb ...
Unpacking gcc-x86-64-linux-gnu (4:14.2.0-1) ...
Selecting previously unselected package linux-libc-dev-amd64-cross.
Preparing to unpack .../044-linux-libc-dev-amd64-cross_6.12.17-1cross1_all.deb ...
Unpacking linux-libc-dev-amd64-cross (6.12.17-1cross1) ...
Selecting previously unselected package libc6-dev-amd64-cross.
Preparing to unpack .../045-libc6-dev-amd64-cross_2.41-4cross1_all.deb ...
Unpacking libc6-dev-amd64-cross (2.41-4cross1) ...
Selecting previously unselected package libstdc++-14-dev-amd64-cross.
Preparing to unpack .../046-libstdc++-14-dev-amd64-cross_14.2.0-12cross1_all.deb ...
Unpacking libstdc++-14-dev-amd64-cross (14.2.0-12cross1) ...
Selecting previously unselected package g++-14-x86-64-linux-gnu.
Preparing to unpack .../047-g++-14-x86-64-linux-gnu_14.2.0-12cross1_arm64.deb ...
Unpacking g++-14-x86-64-linux-gnu (14.2.0-12cross1) ...
Selecting previously unselected package g++-x86-64-linux-gnu.
Preparing to unpack .../048-g++-x86-64-linux-gnu_4%3a14.2.0-1_arm64.deb ...
Unpacking g++-x86-64-linux-gnu (4:14.2.0-1) ...
Selecting previously unselected package crossbuild-essential-amd64.
Preparing to unpack .../049-crossbuild-essential-amd64_12.12_all.deb ...
Unpacking crossbuild-essential-amd64 (12.12) ...
Selecting previously unselected package libdebhelper-perl.
Preparing to unpack .../050-libdebhelper-perl_13.24.1_all.deb ...
Unpacking libdebhelper-perl (13.24.1) ...
Selecting previously unselected package libtool.
Preparing to unpack .../051-libtool_2.5.4-4_all.deb ...
Unpacking libtool (2.5.4-4) ...
Selecting previously unselected package dh-autoreconf.
Preparing to unpack .../052-dh-autoreconf_20_all.deb ...
Unpacking dh-autoreconf (20) ...
Selecting previously unselected package libarchive-zip-perl.
Preparing to unpack .../053-libarchive-zip-perl_1.68-1_all.deb ...
Unpacking libarchive-zip-perl (1.68-1) ...
Selecting previously unselected package libfile-stripnondeterminism-perl.
Preparing to unpack .../054-libfile-stripnondeterminism-perl_1.14.1-2_all.deb ...
Unpacking libfile-stripnondeterminism-perl (1.14.1-2) ...
Selecting previously unselected package dh-strip-nondeterminism.
Preparing to unpack .../055-dh-strip-nondeterminism_1.14.1-2_all.deb ...
Unpacking dh-strip-nondeterminism (1.14.1-2) ...
Selecting previously unselected package libelf1t64:arm64.
Preparing to unpack .../056-libelf1t64_0.192-4_arm64.deb ...
Unpacking libelf1t64:arm64 (0.192-4) ...
Selecting previously unselected package dwz.
Preparing to unpack .../057-dwz_0.15-1+b1_arm64.deb ...
Unpacking dwz (0.15-1+b1) ...
Selecting previously unselected package libunistring5:arm64.
Preparing to unpack .../058-libunistring5_1.3-1_arm64.deb ...
Unpacking libunistring5:arm64 (1.3-1) ...
Selecting previously unselected package libicu72:arm64.
Preparing to unpack .../059-libicu72_72.1-6_arm64.deb ...
Unpacking libicu72:arm64 (72.1-6) ...
Selecting previously unselected package libxml2:arm64.
Preparing to unpack .../060-libxml2_2.12.7+dfsg+really2.9.14-0.2+b2_arm64.deb ...
Unpacking libxml2:arm64 (2.12.7+dfsg+really2.9.14-0.2+b2) ...
Selecting previously unselected package gettext.
Preparing to unpack .../061-gettext_0.23.1-1_arm64.deb ...
Unpacking gettext (0.23.1-1) ...
Selecting previously unselected package intltool-debian.
Preparing to unpack .../062-intltool-debian_0.35.0+20060710.6_all.deb ...
Unpacking intltool-debian (0.35.0+20060710.6) ...
Selecting previously unselected package po-debconf.
Preparing to unpack .../063-po-debconf_1.0.21+nmu1_all.deb ...
Unpacking po-debconf (1.0.21+nmu1) ...
Selecting previously unselected package debhelper.
Preparing to unpack .../064-debhelper_13.24.1_all.deb ...
Unpacking debhelper (13.24.1) ...
Selecting previously unselected package dh-exec.
Preparing to unpack .../065-dh-exec_0.30+b1_arm64.deb ...
Unpacking dh-exec (0.30+b1) ...
Selecting previously unselected package xml-core.
Preparing to unpack .../066-xml-core_0.19_all.deb ...
Unpacking xml-core (0.19) ...
Selecting previously unselected package sgml-data.
Preparing to unpack .../067-sgml-data_2.0.11+nmu1_all.deb ...
Unpacking sgml-data (2.0.11+nmu1) ...
Selecting previously unselected package docbook.
Preparing to unpack .../068-docbook_4.5-11_all.deb ...
Unpacking docbook (4.5-11) ...
Selecting previously unselected package libosp5.
Preparing to unpack .../069-libosp5_1.5.2-15.2_arm64.deb ...
Unpacking libosp5 (1.5.2-15.2) ...
Selecting previously unselected package opensp.
Preparing to unpack .../070-opensp_1.5.2-15.2_arm64.deb ...
Unpacking opensp (1.5.2-15.2) ...
Selecting previously unselected package docbook-to-man.
Preparing to unpack .../071-docbook-to-man_1%3a2.0.0-48_arm64.deb ...
Unpacking docbook-to-man (1:2.0.0-48) ...
Selecting previously unselected package docbook-xml.
Preparing to unpack .../072-docbook-xml_4.5-13_all.deb ...
Unpacking docbook-xml (4.5-13) ...
Selecting previously unselected package docbook-xsl.
Preparing to unpack .../073-docbook-xsl_1.79.2+dfsg-7_all.deb ...
Unpacking docbook-xsl (1.79.2+dfsg-7) ...
Selecting previously unselected package libfakeroot:arm64.
Preparing to unpack .../074-libfakeroot_1.37-1_arm64.deb ...
Unpacking libfakeroot:arm64 (1.37-1) ...
Selecting previously unselected package fakeroot.
Preparing to unpack .../075-fakeroot_1.37-1_arm64.deb ...
Unpacking fakeroot (1.37-1) ...
Selecting previously unselected package fonts-dejavu-mono.
Preparing to unpack .../076-fonts-dejavu-mono_2.37-8_all.deb ...
Unpacking fonts-dejavu-mono (2.37-8) ...
Selecting previously unselected package fonts-dejavu-core.
Preparing to unpack .../077-fonts-dejavu-core_2.37-8_all.deb ...
Unpacking fonts-dejavu-core (2.37-8) ...
Selecting previously unselected package fontconfig-config.
Preparing to unpack .../078-fontconfig-config_2.15.0-2.1_arm64.deb ...
Unpacking fontconfig-config (2.15.0-2.1) ...
Selecting previously unselected package libatomic1:amd64.
Preparing to unpack .../079-libatomic1_14.2.0-17_amd64.deb ...
Unpacking libatomic1:amd64 (14.2.0-17) ...
Selecting previously unselected package libffi8:amd64.
Preparing to unpack .../080-libffi8_3.4.7-1_amd64.deb ...
Unpacking libffi8:amd64 (3.4.7-1) ...
Selecting previously unselected package libblkid1:amd64.
Preparing to unpack .../081-libblkid1_2.40.4-5_amd64.deb ...
Unpacking libblkid1:amd64 (2.40.4-5) ...
Selecting previously unselected package libpcre2-8-0:amd64.
Preparing to unpack .../082-libpcre2-8-0_10.45-1_amd64.deb ...
Unpacking libpcre2-8-0:amd64 (10.45-1) ...
Selecting previously unselected package libselinux1:amd64.
Preparing to unpack .../083-libselinux1_3.8-4_amd64.deb ...
Unpacking libselinux1:amd64 (3.8-4) ...
Selecting previously unselected package libmount1:amd64.
Preparing to unpack .../084-libmount1_2.40.4-5_amd64.deb ...
Unpacking libmount1:amd64 (2.40.4-5) ...
Selecting previously unselected package zlib1g:amd64.
Preparing to unpack .../085-zlib1g_1%3a1.3.dfsg+really1.3.1-1+b1_amd64.deb ...
Unpacking zlib1g:amd64 (1:1.3.dfsg+really1.3.1-1+b1) ...
Selecting previously unselected package libglib2.0-0t64:amd64.
Preparing to unpack .../086-libglib2.0-0t64_2.84.0-1_amd64.deb ...
Unpacking libglib2.0-0t64:amd64 (2.84.0-1) ...
Selecting previously unselected package gir1.2-glib-2.0:amd64.
Preparing to unpack .../087-gir1.2-glib-2.0_2.84.0-1_amd64.deb ...
Unpacking gir1.2-glib-2.0:amd64 (2.84.0-1) ...
Selecting previously unselected package libexpat1:amd64.
Preparing to unpack .../088-libexpat1_2.6.4-1_amd64.deb ...
Unpacking libexpat1:amd64 (2.6.4-1) ...
Selecting previously unselected package libbrotli1:amd64.
Preparing to unpack .../089-libbrotli1_1.1.0-2+b7_amd64.deb ...
Unpacking libbrotli1:amd64 (1.1.0-2+b7) ...
Selecting previously unselected package libbz2-1.0:amd64.
Preparing to unpack .../090-libbz2-1.0_1.0.8-6_amd64.deb ...
Unpacking libbz2-1.0:amd64 (1.0.8-6) ...
Selecting previously unselected package libpng16-16t64:amd64.
Preparing to unpack .../091-libpng16-16t64_1.6.47-1_amd64.deb ...
Unpacking libpng16-16t64:amd64 (1.6.47-1) ...
Selecting previously unselected package libfreetype6:amd64.
Preparing to unpack .../092-libfreetype6_2.13.3+dfsg-1_amd64.deb ...
Unpacking libfreetype6:amd64 (2.13.3+dfsg-1) ...
Selecting previously unselected package libfontconfig1:amd64.
Preparing to unpack .../093-libfontconfig1_2.15.0-2.1_amd64.deb ...
Unpacking libfontconfig1:amd64 (2.15.0-2.1) ...
Selecting previously unselected package libpixman-1-0:amd64.
Preparing to unpack .../094-libpixman-1-0_0.44.0-3_amd64.deb ...
Unpacking libpixman-1-0:amd64 (0.44.0-3) ...
Selecting previously unselected package libxau6:amd64.
Preparing to unpack .../095-libxau6_1%3a1.0.11-1_amd64.deb ...
Unpacking libxau6:amd64 (1:1.0.11-1) ...
Selecting previously unselected package libxdmcp6:amd64.
Preparing to unpack .../096-libxdmcp6_1%3a1.1.5-1_amd64.deb ...
Unpacking libxdmcp6:amd64 (1:1.1.5-1) ...
Selecting previously unselected package libxcb1:amd64.
Preparing to unpack .../097-libxcb1_1.17.0-2+b1_amd64.deb ...
Unpacking libxcb1:amd64 (1.17.0-2+b1) ...
Selecting previously unselected package libx11-data.
Preparing to unpack .../098-libx11-data_2%3a1.8.10-2_all.deb ...
Unpacking libx11-data (2:1.8.10-2) ...
Selecting previously unselected package libx11-6:amd64.
Preparing to unpack .../099-libx11-6_2%3a1.8.10-2_amd64.deb ...
Unpacking libx11-6:amd64 (2:1.8.10-2) ...
Selecting previously unselected package libxcb-render0:amd64.
Preparing to unpack .../100-libxcb-render0_1.17.0-2+b1_amd64.deb ...
Unpacking libxcb-render0:amd64 (1.17.0-2+b1) ...
Selecting previously unselected package libxcb-shm0:amd64.
Preparing to unpack .../101-libxcb-shm0_1.17.0-2+b1_amd64.deb ...
Unpacking libxcb-shm0:amd64 (1.17.0-2+b1) ...
Selecting previously unselected package libxext6:amd64.
Preparing to unpack .../102-libxext6_2%3a1.3.4-1+b3_amd64.deb ...
Unpacking libxext6:amd64 (2:1.3.4-1+b3) ...
Selecting previously unselected package libxrender1:amd64.
Preparing to unpack .../103-libxrender1_1%3a0.9.10-1.1+b4_amd64.deb ...
Unpacking libxrender1:amd64 (1:0.9.10-1.1+b4) ...
Selecting previously unselected package libcairo2:amd64.
Preparing to unpack .../104-libcairo2_1.18.2-2_amd64.deb ...
Unpacking libcairo2:amd64 (1.18.2-2) ...
Selecting previously unselected package libcairo-gobject2:amd64.
Preparing to unpack .../105-libcairo-gobject2_1.18.2-2_amd64.deb ...
Unpacking libcairo-gobject2:amd64 (1.18.2-2) ...
Selecting previously unselected package gir1.2-freedesktop:amd64.
Preparing to unpack .../106-gir1.2-freedesktop_1.83.4-1_amd64.deb ...
Unpacking gir1.2-freedesktop:amd64 (1.83.4-1) ...
Selecting previously unselected package gir1.2-glib-2.0-dev:amd64.
Preparing to unpack .../107-gir1.2-glib-2.0-dev_2.84.0-1_amd64.deb ...
Unpacking gir1.2-glib-2.0-dev:amd64 (2.84.0-1) ...
Selecting previously unselected package gir1.2-freedesktop-dev:amd64.
Preparing to unpack .../108-gir1.2-freedesktop-dev_1.83.4-1_amd64.deb ...
Unpacking gir1.2-freedesktop-dev:amd64 (1.83.4-1) ...
Selecting previously unselected package libgirepository-1.0-1:amd64.
Preparing to unpack .../109-libgirepository-1.0-1_1.83.4-1_amd64.deb ...
Unpacking libgirepository-1.0-1:amd64 (1.83.4-1) ...
Selecting previously unselected package gir1.2-girepository-2.0:amd64.
Preparing to unpack .../110-gir1.2-girepository-2.0_1.83.4-1_amd64.deb ...
Unpacking gir1.2-girepository-2.0:amd64 (1.83.4-1) ...
Selecting previously unselected package gir1.2-girepository-2.0-dev:amd64.
Preparing to unpack .../111-gir1.2-girepository-2.0-dev_1.83.4-1_amd64.deb ...
Unpacking gir1.2-girepository-2.0-dev:amd64 (1.83.4-1) ...
Selecting previously unselected package native-architecture.
Preparing to unpack .../112-native-architecture_0.2.6_all.deb ...
Unpacking native-architecture (0.2.6) ...
Selecting previously unselected package libglib2.0-0t64:arm64.
Preparing to unpack .../113-libglib2.0-0t64_2.84.0-1_arm64.deb ...
Unpacking libglib2.0-0t64:arm64 (2.84.0-1) ...
Selecting previously unselected package libgirepository-2.0-0:arm64.
Preparing to unpack .../114-libgirepository-2.0-0_2.84.0-1_arm64.deb ...
Unpacking libgirepository-2.0-0:arm64 (2.84.0-1) ...
Selecting previously unselected package girepository-tools:arm64.
Preparing to unpack .../115-girepository-tools_2.84.0-1_arm64.deb ...
Unpacking girepository-tools:arm64 (2.84.0-1) ...
Selecting previously unselected package libgirepository-2.0-0:amd64.
Preparing to unpack .../116-libgirepository-2.0-0_2.84.0-1_amd64.deb ...
Unpacking libgirepository-2.0-0:amd64 (2.84.0-1) ...
Selecting previously unselected package girepository-tools:amd64.
Preparing to unpack .../117-girepository-tools_2.84.0-1_amd64.deb ...
Unpacking girepository-tools:amd64 (2.84.0-1) ...
Selecting previously unselected package liburi-perl.
Preparing to unpack .../118-liburi-perl_5.30-1_all.deb ...
Unpacking liburi-perl (5.30-1) ...
Selecting previously unselected package libencode-locale-perl.
Preparing to unpack .../119-libencode-locale-perl_1.05-3_all.deb ...
Unpacking libencode-locale-perl (1.05-3) ...
Selecting previously unselected package libtimedate-perl.
Preparing to unpack .../120-libtimedate-perl_2.3300-2_all.deb ...
Unpacking libtimedate-perl (2.3300-2) ...
Selecting previously unselected package libhttp-date-perl.
Preparing to unpack .../121-libhttp-date-perl_6.06-1_all.deb ...
Unpacking libhttp-date-perl (6.06-1) ...
Selecting previously unselected package libfile-listing-perl.
Preparing to unpack .../122-libfile-listing-perl_6.16-1_all.deb ...
Unpacking libfile-listing-perl (6.16-1) ...
Selecting previously unselected package libhtml-tagset-perl.
Preparing to unpack .../123-libhtml-tagset-perl_3.24-1_all.deb ...
Unpacking libhtml-tagset-perl (3.24-1) ...
Selecting previously unselected package libhtml-parser-perl:arm64.
Preparing to unpack .../124-libhtml-parser-perl_3.83-1+b2_arm64.deb ...
Unpacking libhtml-parser-perl:arm64 (3.83-1+b2) ...
Selecting previously unselected package libhtml-tree-perl.
Preparing to unpack .../125-libhtml-tree-perl_5.07-3_all.deb ...
Unpacking libhtml-tree-perl (5.07-3) ...
Selecting previously unselected package libclone-perl:arm64.
Preparing to unpack .../126-libclone-perl_0.47-1+b1_arm64.deb ...
Unpacking libclone-perl:arm64 (0.47-1+b1) ...
Selecting previously unselected package libio-html-perl.
Preparing to unpack .../127-libio-html-perl_1.004-3_all.deb ...
Unpacking libio-html-perl (1.004-3) ...
Selecting previously unselected package liblwp-mediatypes-perl.
Preparing to unpack .../128-liblwp-mediatypes-perl_6.04-2_all.deb ...
Unpacking liblwp-mediatypes-perl (6.04-2) ...
Selecting previously unselected package libhttp-message-perl.
Preparing to unpack .../129-libhttp-message-perl_7.00-2_all.deb ...
Unpacking libhttp-message-perl (7.00-2) ...
Selecting previously unselected package libhttp-cookies-perl.
Preparing to unpack .../130-libhttp-cookies-perl_6.11-1_all.deb ...
Unpacking libhttp-cookies-perl (6.11-1) ...
Selecting previously unselected package libhttp-negotiate-perl.
Preparing to unpack .../131-libhttp-negotiate-perl_6.01-2_all.deb ...
Unpacking libhttp-negotiate-perl (6.01-2) ...
Selecting previously unselected package perl-openssl-defaults:arm64.
Preparing to unpack .../132-perl-openssl-defaults_7+b2_arm64.deb ...
Unpacking perl-openssl-defaults:arm64 (7+b2) ...
Selecting previously unselected package libnet-ssleay-perl:arm64.
Preparing to unpack .../133-libnet-ssleay-perl_1.94-3_arm64.deb ...
Unpacking libnet-ssleay-perl:arm64 (1.94-3) ...
Selecting previously unselected package libio-socket-ssl-perl.
Preparing to unpack .../134-libio-socket-ssl-perl_2.089-1_all.deb ...
Unpacking libio-socket-ssl-perl (2.089-1) ...
Selecting previously unselected package libnet-http-perl.
Preparing to unpack .../135-libnet-http-perl_6.23-1_all.deb ...
Unpacking libnet-http-perl (6.23-1) ...
Selecting previously unselected package liblwp-protocol-https-perl.
Preparing to unpack .../136-liblwp-protocol-https-perl_6.14-1_all.deb ...
Unpacking liblwp-protocol-https-perl (6.14-1) ...
Selecting previously unselected package libtry-tiny-perl.
Preparing to unpack .../137-libtry-tiny-perl_0.32-1_all.deb ...
Unpacking libtry-tiny-perl (0.32-1) ...
Selecting previously unselected package libwww-robotrules-perl.
Preparing to unpack .../138-libwww-robotrules-perl_6.02-1_all.deb ...
Unpacking libwww-robotrules-perl (6.02-1) ...
Selecting previously unselected package libwww-perl.
Preparing to unpack .../139-libwww-perl_6.78-1_all.deb ...
Unpacking libwww-perl (6.78-1) ...
Selecting previously unselected package libxml-parser-perl.
Preparing to unpack .../140-libxml-parser-perl_2.47-1+b3_arm64.deb ...
Unpacking libxml-parser-perl (2.47-1+b3) ...
Selecting previously unselected package intltool.
Preparing to unpack .../141-intltool_0.51.0-6_all.deb ...
Unpacking intltool (0.51.0-6) ...
Selecting previously unselected package libpkgconf3:arm64.
Preparing to unpack .../142-libpkgconf3_1.8.1-4_arm64.deb ...
Unpacking libpkgconf3:arm64 (1.8.1-4) ...
Selecting previously unselected package pkgconf-bin.
Preparing to unpack .../143-pkgconf-bin_1.8.1-4_arm64.deb ...
Unpacking pkgconf-bin (1.8.1-4) ...
Selecting previously unselected package pkgconf:arm64.
Preparing to unpack .../144-pkgconf_1.8.1-4_arm64.deb ...
Unpacking pkgconf:arm64 (1.8.1-4) ...
Selecting previously unselected package gnome-common.
Preparing to unpack .../145-gnome-common_3.18.0-6_all.deb ...
Unpacking gnome-common (3.18.0-6) ...
Selecting previously unselected package libgirepository-1.0-1:arm64.
Preparing to unpack .../146-libgirepository-1.0-1_1.83.4-1_arm64.deb ...
Unpacking libgirepository-1.0-1:arm64 (1.83.4-1) ...
Selecting previously unselected package python3-markupsafe.
Preparing to unpack .../147-python3-markupsafe_2.1.5-1+b4_arm64.deb ...
Unpacking python3-markupsafe (2.1.5-1+b4) ...
Selecting previously unselected package python3-mako.
Preparing to unpack .../148-python3-mako_1.3.8-2_all.deb ...
Unpacking python3-mako (1.3.8-2) ...
Selecting previously unselected package python3-markdown.
Preparing to unpack .../149-python3-markdown_3.7-2_all.deb ...
Unpacking python3-markdown (3.7-2) ...
Selecting previously unselected package python3-autocommand.
Preparing to unpack .../150-python3-autocommand_2.2.2-3_all.deb ...
Unpacking python3-autocommand (2.2.2-3) ...
Selecting previously unselected package python3-more-itertools.
Preparing to unpack .../151-python3-more-itertools_10.6.0-1_all.deb ...
Unpacking python3-more-itertools (10.6.0-1) ...
Selecting previously unselected package python3-typing-extensions.
Preparing to unpack .../152-python3-typing-extensions_4.12.2-2_all.deb ...
Unpacking python3-typing-extensions (4.12.2-2) ...
Selecting previously unselected package python3-typeguard.
Preparing to unpack .../153-python3-typeguard_4.4.2-1_all.deb ...
Unpacking python3-typeguard (4.4.2-1) ...
Selecting previously unselected package python3-inflect.
Preparing to unpack .../154-python3-inflect_7.3.1-2_all.deb ...
Unpacking python3-inflect (7.3.1-2) ...
Selecting previously unselected package python3-jaraco.context.
Preparing to unpack .../155-python3-jaraco.context_6.0.1-1_all.deb ...
Unpacking python3-jaraco.context (6.0.1-1) ...
Selecting previously unselected package python3-jaraco.functools.
Preparing to unpack .../156-python3-jaraco.functools_4.1.0-1_all.deb ...
Unpacking python3-jaraco.functools (4.1.0-1) ...
Selecting previously unselected package python3-pkg-resources.
Preparing to unpack .../157-python3-pkg-resources_75.8.0-1_all.deb ...
Unpacking python3-pkg-resources (75.8.0-1) ...
Selecting previously unselected package python3-jaraco.text.
Preparing to unpack .../158-python3-jaraco.text_4.0.0-1_all.deb ...
Unpacking python3-jaraco.text (4.0.0-1) ...
Selecting previously unselected package python3-zipp.
Preparing to unpack .../159-python3-zipp_3.21.0-1_all.deb ...
Unpacking python3-zipp (3.21.0-1) ...
Selecting previously unselected package python3-setuptools.
Preparing to unpack .../160-python3-setuptools_75.8.0-1_all.deb ...
Unpacking python3-setuptools (75.8.0-1) ...
Selecting previously unselected package gobject-introspection-bin.
Preparing to unpack .../161-gobject-introspection-bin_1.83.4-1_arm64.deb ...
Unpacking gobject-introspection-bin (1.83.4-1) ...
Selecting previously unselected package libffi-dev:amd64.
Preparing to unpack .../162-libffi-dev_3.4.7-1_amd64.deb ...
Unpacking libffi-dev:amd64 (3.4.7-1) ...
Selecting previously unselected package libcrypt1:amd64.
Preparing to unpack .../163-libcrypt1_1%3a4.4.38-1_amd64.deb ...
Unpacking libcrypt1:amd64 (1:4.4.38-1) ...
Selecting previously unselected package libcrypt-dev:amd64.
Preparing to unpack .../164-libcrypt-dev_1%3a4.4.38-1_amd64.deb ...
Unpacking libcrypt-dev:amd64 (1:4.4.38-1) ...
Selecting previously unselected package libc6-dev:amd64.
Preparing to unpack .../165-libc6-dev_2.41-4_amd64.deb ...
Unpacking libc6-dev:amd64 (2.41-4) ...
Selecting previously unselected package libuuid1:amd64.
Preparing to unpack .../166-libuuid1_2.40.4-5_amd64.deb ...
Unpacking libuuid1:amd64 (2.40.4-5) ...
Selecting previously unselected package uuid-dev:amd64.
Preparing to unpack .../167-uuid-dev_2.40.4-5_amd64.deb ...
Unpacking uuid-dev:amd64 (2.40.4-5) ...
Selecting previously unselected package libblkid-dev:amd64.
Preparing to unpack .../168-libblkid-dev_2.40.4-5_amd64.deb ...
Unpacking libblkid-dev:amd64 (2.40.4-5) ...
Selecting previously unselected package libsepol2:amd64.
Preparing to unpack .../169-libsepol2_3.8-1_amd64.deb ...
Unpacking libsepol2:amd64 (3.8-1) ...
Selecting previously unselected package libsepol-dev:amd64.
Preparing to unpack .../170-libsepol-dev_3.8-1_amd64.deb ...
Unpacking libsepol-dev:amd64 (3.8-1) ...
Selecting previously unselected package libpcre2-16-0:amd64.
Preparing to unpack .../171-libpcre2-16-0_10.45-1_amd64.deb ...
Unpacking libpcre2-16-0:amd64 (10.45-1) ...
Selecting previously unselected package libpcre2-32-0:amd64.
Preparing to unpack .../172-libpcre2-32-0_10.45-1_amd64.deb ...
Unpacking libpcre2-32-0:amd64 (10.45-1) ...
Selecting previously unselected package libpcre2-posix3:amd64.
Preparing to unpack .../173-libpcre2-posix3_10.45-1_amd64.deb ...
Unpacking libpcre2-posix3:amd64 (10.45-1) ...
Selecting previously unselected package libpcre2-dev:amd64.
Preparing to unpack .../174-libpcre2-dev_10.45-1_amd64.deb ...
Unpacking libpcre2-dev:amd64 (10.45-1) ...
Selecting previously unselected package libselinux1-dev:amd64.
Preparing to unpack .../175-libselinux1-dev_3.8-4_amd64.deb ...
Unpacking libselinux1-dev:amd64 (3.8-4) ...
Selecting previously unselected package libmount-dev:amd64.
Preparing to unpack .../176-libmount-dev_2.40.4-5_amd64.deb ...
Unpacking libmount-dev:amd64 (2.40.4-5) ...
Selecting previously unselected package libsysprof-capture-4-dev:amd64.
Preparing to unpack .../177-libsysprof-capture-4-dev_48~beta-2_amd64.deb ...
Unpacking libsysprof-capture-4-dev:amd64 (48~beta-2) ...
Selecting previously unselected package pkgconf:amd64.
Preparing to unpack .../178-pkgconf_1.8.1-4_amd64.deb ...
Unpacking pkgconf:amd64 (1.8.1-4) ...
Selecting previously unselected package zlib1g-dev:amd64.
Preparing to unpack .../179-zlib1g-dev_1%3a1.3.dfsg+really1.3.1-1+b1_amd64.deb ...
Unpacking zlib1g-dev:amd64 (1:1.3.dfsg+really1.3.1-1+b1) ...
Selecting previously unselected package libgio-2.0-dev:amd64.
Preparing to unpack .../180-libgio-2.0-dev_2.84.0-1_amd64.deb ...
Unpacking libgio-2.0-dev:amd64 (2.84.0-1) ...
Selecting previously unselected package libglib2.0-data.
Preparing to unpack .../181-libglib2.0-data_2.84.0-1_all.deb ...
Unpacking libglib2.0-data (2.84.0-1) ...
Selecting previously unselected package libglib2.0-bin.
Preparing to unpack .../182-libglib2.0-bin_2.84.0-1_arm64.deb ...
Unpacking libglib2.0-bin (2.84.0-1) ...
Selecting previously unselected package python3-packaging.
Preparing to unpack .../183-python3-packaging_24.2-1_all.deb ...
Unpacking python3-packaging (24.2-1) ...
Selecting previously unselected package libgio-2.0-dev-bin.
Preparing to unpack .../184-libgio-2.0-dev-bin_2.84.0-1_arm64.deb ...
Unpacking libgio-2.0-dev-bin (2.84.0-1) ...
Selecting previously unselected package libglib2.0-dev-bin.
Preparing to unpack .../185-libglib2.0-dev-bin_2.84.0-1_arm64.deb ...
Unpacking libglib2.0-dev-bin (2.84.0-1) ...
Selecting previously unselected package libglib2.0-dev:amd64.
Preparing to unpack .../186-libglib2.0-dev_2.84.0-1_amd64.deb ...
Unpacking libglib2.0-dev:amd64 (2.84.0-1) ...
Selecting previously unselected package gobject-introspection:amd64.
Preparing to unpack .../187-gobject-introspection_1.83.4-1_amd64.deb ...
Unpacking gobject-introspection:amd64 (1.83.4-1) ...
Selecting previously unselected package libgpg-error0:arm64.
Preparing to unpack .../188-libgpg-error0_1.51-3_arm64.deb ...
Unpacking libgpg-error0:arm64 (1.51-3) ...
Selecting previously unselected package libgcrypt20:arm64.
Preparing to unpack .../189-libgcrypt20_1.11.0-7_arm64.deb ...
Unpacking libgcrypt20:arm64 (1.11.0-7) ...
Selecting previously unselected package libxslt1.1:arm64.
Preparing to unpack .../190-libxslt1.1_1.1.35-1.1+b1_arm64.deb ...
Unpacking libxslt1.1:arm64 (1.1.35-1.1+b1) ...
Selecting previously unselected package python3-lxml:arm64.
Preparing to unpack .../191-python3-lxml_5.3.1-1+b1_arm64.deb ...
Unpacking python3-lxml:arm64 (5.3.1-1+b1) ...
Selecting previously unselected package python3-pygments.
Preparing to unpack .../192-python3-pygments_2.18.0+dfsg-2_all.deb ...
Unpacking python3-pygments (2.18.0+dfsg-2) ...
Selecting previously unselected package xsltproc.
Preparing to unpack .../193-xsltproc_1.1.35-1.1+b1_arm64.deb ...
Unpacking xsltproc (1.1.35-1.1+b1) ...
Selecting previously unselected package gtk-doc-tools.
Preparing to unpack .../194-gtk-doc-tools_1.34.0-2_all.deb ...
Unpacking gtk-doc-tools (1.34.0-2) ...
Selecting previously unselected package libasan8:amd64.
Preparing to unpack .../195-libasan8_14.2.0-17_amd64.deb ...
Unpacking libasan8:amd64 (14.2.0-17) ...
Selecting previously unselected package libgomp1:amd64.
Preparing to unpack .../196-libgomp1_14.2.0-17_amd64.deb ...
Unpacking libgomp1:amd64 (14.2.0-17) ...
Selecting previously unselected package libitm1:amd64.
Preparing to unpack .../197-libitm1_14.2.0-17_amd64.deb ...
Unpacking libitm1:amd64 (14.2.0-17) ...
Selecting previously unselected package liblsan0:amd64.
Preparing to unpack .../198-liblsan0_14.2.0-17_amd64.deb ...
Unpacking liblsan0:amd64 (14.2.0-17) ...
Selecting previously unselected package libtsan2:amd64.
Preparing to unpack .../199-libtsan2_14.2.0-17_amd64.deb ...
Unpacking libtsan2:amd64 (14.2.0-17) ...
Selecting previously unselected package libstdc++6:amd64.
Preparing to unpack .../200-libstdc++6_14.2.0-17_amd64.deb ...
Unpacking libstdc++6:amd64 (14.2.0-17) ...
Selecting previously unselected package libubsan1:amd64.
Preparing to unpack .../201-libubsan1_14.2.0-17_amd64.deb ...
Unpacking libubsan1:amd64 (14.2.0-17) ...
Selecting previously unselected package libhwasan0:amd64.
Preparing to unpack .../202-libhwasan0_14.2.0-17_amd64.deb ...
Unpacking libhwasan0:amd64 (14.2.0-17) ...
Selecting previously unselected package libquadmath0:amd64.
Preparing to unpack .../203-libquadmath0_14.2.0-17_amd64.deb ...
Unpacking libquadmath0:amd64 (14.2.0-17) ...
Selecting previously unselected package libgcc-14-dev:amd64.
Preparing to unpack .../204-libgcc-14-dev_14.2.0-17_amd64.deb ...
Unpacking libgcc-14-dev:amd64 (14.2.0-17) ...
Selecting previously unselected package libgirepository-1.0-dev:amd64.
Preparing to unpack .../205-libgirepository-1.0-dev_1.83.4-1_amd64.deb ...
Unpacking libgirepository-1.0-dev:amd64 (1.83.4-1) ...
Selecting previously unselected package libgirepository1.0-dev:amd64.
Preparing to unpack .../206-libgirepository1.0-dev_1.83.4-1_amd64.deb ...
Unpacking libgirepository1.0-dev:amd64 (1.83.4-1) ...
Selecting previously unselected package libstdc++-14-dev:amd64.
Preparing to unpack .../207-libstdc++-14-dev_14.2.0-17_amd64.deb ...
Unpacking libstdc++-14-dev:amd64 (14.2.0-17) ...
Selecting previously unselected package libvala-0.56-0:arm64.
Preparing to unpack .../208-libvala-0.56-0_0.56.18-2_arm64.deb ...
Unpacking libvala-0.56-0:arm64 (0.56.18-2) ...
Selecting previously unselected package libvala-0.56-0:amd64.
Preparing to unpack .../209-libvala-0.56-0_0.56.18-2_amd64.deb ...
Unpacking libvala-0.56-0:amd64 (0.56.18-2) ...
Selecting previously unselected package libvalacodegen-0.56-0:amd64.
Preparing to unpack .../210-libvalacodegen-0.56-0_0.56.18-2_amd64.deb ...
Unpacking libvalacodegen-0.56-0:amd64 (0.56.18-2) ...
Selecting previously unselected package libvalacodegen-0.56-0:arm64.
Preparing to unpack .../211-libvalacodegen-0.56-0_0.56.18-2_arm64.deb ...
Unpacking libvalacodegen-0.56-0:arm64 (0.56.18-2) ...
Selecting previously unselected package ninja-build.
Preparing to unpack .../212-ninja-build_1.12.1-1+b1_arm64.deb ...
Unpacking ninja-build (1.12.1-1+b1) ...
Selecting previously unselected package meson.
Preparing to unpack .../213-meson_1.7.0-1_all.deb ...
Unpacking meson (1.7.0-1) ...
Selecting previously unselected package valac-0.56-vapi.
Preparing to unpack .../214-valac-0.56-vapi_0.56.18-2_all.deb ...
Unpacking valac-0.56-vapi (0.56.18-2) ...
Selecting previously unselected package valac-bin.
Preparing to unpack .../215-valac-bin_0.56.18-2_arm64.deb ...
Unpacking valac-bin (0.56.18-2) ...
Selecting previously unselected package valac:amd64.
Preparing to unpack .../216-valac_0.56.18-2_amd64.deb ...
Unpacking valac:amd64 (0.56.18-2) ...
Selecting previously unselected package sbuild-build-depends-main-dummy:amd64.
Preparing to unpack .../217-sbuild-build-depends-main-dummy_0.invalid.0_amd64.deb ...
Unpacking sbuild-build-depends-main-dummy:amd64 (0.invalid.0) ...
Setting up media-types (13.0.0) ...
Setting up libpipeline1:arm64 (1.5.8-1) ...
Setting up gcc-14-x86-64-linux-gnu-base:arm64 (14.2.0-12cross1) ...
Setting up native-architecture (0.2.6) ...
Setting up libicu72:arm64 (72.1-6) ...
Setting up linux-libc-dev-amd64-cross (6.12.17-1cross1) ...
Setting up bsdextrautils (2.40.4-5) ...
Setting up libgpg-error0:arm64 (1.51-3) ...
Setting up libmagic-mgc (1:5.45-3+b1) ...
Setting up gcc-14-base:amd64 (14.2.0-17) ...
Setting up libclone-perl:arm64 (0.47-1+b1) ...
Setting up libarchive-zip-perl (1.68-1) ...
Setting up libhtml-tagset-perl (3.24-1) ...
Setting up libdebhelper-perl (13.24.1) ...
Setting up libsqlite3-0:arm64 (3.46.1-2) ...
Setting up liblwp-mediatypes-perl (6.04-2) ...
Setting up libmagic1t64:arm64 (1:5.45-3+b1) ...
Setting up libtry-tiny-perl (0.32-1) ...
Setting up perl-openssl-defaults:arm64 (7+b2) ...
Setting up gettext-base (0.23.1-1) ...
Setting up m4 (1.4.19-7) ...
Setting up libgcrypt20:arm64 (1.11.0-7) ...
Setting up libencode-locale-perl (1.05-3) ...
Setting up gcc-14-cross-base (14.2.0-12cross1) ...
Setting up autoconf-archive (20220903-3) ...
Setting up file (1:5.45-3+b1) ...
Setting up libgomp1-amd64-cross (14.2.0-12cross1) ...
Setting up libfakeroot:arm64 (1.37-1) ...
Setting up ninja-build (1.12.1-1+b1) ...
Setting up libelf1t64:arm64 (0.192-4) ...
Setting up libosp5 (1.5.2-15.2) ...
Setting up tzdata (2025a-2) ...

Current default time zone: 'Etc/UTC'
Local time is now:      Tue Mar 11 11:35:55 UTC 2025.
Universal Time is now:  Tue Mar 11 11:35:55 UTC 2025.
Run 'dpkg-reconfigure tzdata' if you wish to change it.

Setting up fakeroot (1.37-1) ...
update-alternatives: using /usr/bin/fakeroot-sysv to provide /usr/bin/fakeroot (fakeroot) in auto mode
Setting up libsysprof-capture-4-dev:amd64 (48~beta-2) ...
Setting up libitm1-amd64-cross (14.2.0-12cross1) ...
Setting up autotools-dev (20220109.1) ...
Setting up libglib2.0-data (2.84.0-1) ...
Setting up libpkgconf3:arm64 (1.8.1-4) ...
Setting up libatomic1-amd64-cross (14.2.0-12cross1) ...
Setting up libx11-data (2:1.8.10-2) ...
Setting up qemu-user (1:9.2.2+ds-1) ...
Setting up libunistring5:arm64 (1.3-1) ...
Setting up fonts-dejavu-mono (2.37-8) ...
Setting up libquadmath0-amd64-cross (14.2.0-12cross1) ...
Setting up libio-html-perl (1.004-3) ...
Setting up autopoint (0.23.1-1) ...
Setting up fonts-dejavu-core (2.37-8) ...
Setting up cpp-14-x86-64-linux-gnu (14.2.0-12cross1) ...
Setting up libc6-amd64-cross (2.41-4cross1) ...
Setting up pkgconf-bin (1.8.1-4) ...
Setting up libncursesw6:arm64 (6.5+20250216-2) ...
Setting up autoconf (2.72-3) ...
Setting up libtimedate-perl (2.3300-2) ...
Setting up libffi8:arm64 (3.4.7-1) ...
Setting up dwz (0.15-1+b1) ...
Setting up sensible-utils (0.0.24) ...
Setting up libuchardet0:arm64 (0.0.8-1+b2) ...
Setting up netbase (6.4) ...
Setting up sgml-base (1.31) ...
Setting up valac-0.56-vapi (0.56.18-2) ...
Setting up libgcc-s1-amd64-cross (14.2.0-12cross1) ...
Setting up openssl (3.4.1-1) ...
Setting up readline-common (8.2-6) ...
Setting up libxml2:arm64 (2.12.7+dfsg+really2.9.14-0.2+b2) ...
Setting up liburi-perl (5.30-1) ...
Setting up binutils-x86-64-linux-gnu (2.44-3) ...
Setting up libstdc++6-amd64-cross (14.2.0-12cross1) ...
Setting up libnet-ssleay-perl:arm64 (1.94-3) ...
Setting up cpp-x86-64-linux-gnu (4:14.2.0-1) ...
Setting up automake (1:1.17-3) ...
update-alternatives: using /usr/bin/automake-1.17 to provide /usr/bin/automake (automake) in auto mode
Setting up libfile-stripnondeterminism-perl (1.14.1-2) ...
Setting up libhttp-date-perl (6.06-1) ...
Setting up gettext (0.23.1-1) ...
Setting up libfile-listing-perl (6.16-1) ...
Setting up libtool (2.5.4-4) ...
Setting up fontconfig-config (2.15.0-2.1) ...
Setting up libasan8-amd64-cross (14.2.0-12cross1) ...
Setting up liblsan0-amd64-cross (14.2.0-12cross1) ...
Setting up libc6-dev-amd64-cross (2.41-4cross1) ...
Setting up libnet-http-perl (6.23-1) ...
Setting up libtsan2-amd64-cross (14.2.0-12cross1) ...
Setting up opensp (1.5.2-15.2) ...
Setting up pkgconf:amd64 (1.8.1-4) ...
Setting up pkgconf:arm64 (1.8.1-4) ...
Setting up intltool-debian (0.35.0+20060710.6) ...
Setting up dh-autoreconf (20) ...
Setting up ca-certificates (20241223) ...
Updating certificates in /etc/ssl/certs...
152 added, 0 removed; done.
Setting up libglib2.0-0t64:arm64 (2.84.0-1) ...
No schema files found: doing nothing.
Setting up libhwasan0-amd64-cross (14.2.0-12cross1) ...
Setting up libubsan1-amd64-cross (14.2.0-12cross1) ...
Setting up libreadline8t64:arm64 (8.2-6) ...
Setting up dh-strip-nondeterminism (1.14.1-2) ...
Setting up libwww-robotrules-perl (6.02-1) ...
Setting up libgcc-14-dev-amd64-cross (14.2.0-12cross1) ...
Setting up groff-base (1.23.0-7) ...
Setting up xml-core (0.19) ...
Setting up libhtml-parser-perl:arm64 (3.83-1+b2) ...
Setting up libxslt1.1:arm64 (1.1.35-1.1+b1) ...
Setting up libgirepository-1.0-1:arm64 (1.83.4-1) ...
Setting up gcc-14-x86-64-linux-gnu (14.2.0-12cross1) ...
Setting up libpython3.13-stdlib:arm64 (3.13.2-1) ...
Setting up libio-socket-ssl-perl (2.089-1) ...
Setting up libpython3-stdlib:arm64 (3.13.2-2) ...
Setting up libstdc++-14-dev-amd64-cross (14.2.0-12cross1) ...
Setting up libhttp-message-perl (7.00-2) ...
Setting up libhttp-negotiate-perl (6.01-2) ...
Setting up gcc-x86-64-linux-gnu (4:14.2.0-1) ...
Setting up libvala-0.56-0:arm64 (0.56.18-2) ...
Setting up libhttp-cookies-perl (6.11-1) ...
Setting up python3.13 (3.13.2-1) ...
Setting up libgirepository-2.0-0:arm64 (2.84.0-1) ...
Setting up libvalacodegen-0.56-0:arm64 (0.56.18-2) ...
Setting up po-debconf (1.0.21+nmu1) ...
Setting up libhtml-tree-perl (5.07-3) ...
Setting up xsltproc (1.1.35-1.1+b1) ...
Setting up libglib2.0-bin (2.84.0-1) ...
Setting up python3 (3.13.2-2) ...
Setting up python3-zipp (3.21.0-1) ...
Setting up python3-autocommand (2.2.2-3) ...
Setting up man-db (2.13.0-1) ...
Not building database; man-db/auto-update is not 'true'.
Setting up python3-markupsafe (2.1.5-1+b4) ...
Setting up python3-pygments (2.18.0+dfsg-2) ...
Setting up python3-packaging (24.2-1) ...
Setting up python3-markdown (3.7-2) ...
Setting up python3-typing-extensions (4.12.2-2) ...
Setting up g++-14-x86-64-linux-gnu (14.2.0-12cross1) ...
Setting up python3-lxml:arm64 (5.3.1-1+b1) ...
Setting up g++-x86-64-linux-gnu (4:14.2.0-1) ...
Setting up python3-mako (1.3.8-2) ...
Setting up python3-more-itertools (10.6.0-1) ...
Setting up valac-bin (0.56.18-2) ...
Setting up libgio-2.0-dev-bin (2.84.0-1) ...
Setting up girepository-tools:arm64 (2.84.0-1) ...
Setting up python3-jaraco.functools (4.1.0-1) ...
Setting up python3-jaraco.context (6.0.1-1) ...
Setting up python3-typeguard (4.4.2-1) ...
Setting up debhelper (13.24.1) ...
Setting up dh-exec (0.30+b1) ...
Setting up python3-inflect (7.3.1-2) ...
Setting up crossbuild-essential-amd64 (12.12) ...
Setting up python3-jaraco.text (4.0.0-1) ...
Setting up python3-pkg-resources (75.8.0-1) ...
Setting up libglib2.0-dev-bin (2.84.0-1) ...
Setting up python3-setuptools (75.8.0-1) ...
Setting up gobject-introspection-bin (1.83.4-1) ...
Setting up meson (1.7.0-1) ...
Setting up libgcc-s1:amd64 (14.2.0-17) ...
Setting up libc6:amd64 (2.41-4) ...
Setting up libffi8:amd64 (3.4.7-1) ...
Setting up libhwasan0:amd64 (14.2.0-17) ...
Setting up libasan8:amd64 (14.2.0-17) ...
Setting up libtsan2:amd64 (14.2.0-17) ...
Setting up libbz2-1.0:amd64 (1.0.8-6) ...
Setting up libblkid1:amd64 (2.40.4-5) ...
Setting up libstdc++6:amd64 (14.2.0-17) ...
Setting up liblsan0:amd64 (14.2.0-17) ...
Setting up libitm1:amd64 (14.2.0-17) ...
Setting up libexpat1:amd64 (2.6.4-1) ...
Setting up liblwp-protocol-https-perl (6.14-1) ...
Setting up libpixman-1-0:amd64 (0.44.0-3) ...
Setting up libxau6:amd64 (1:1.0.11-1) ...
Setting up libxdmcp6:amd64 (1:1.1.5-1) ...
Setting up libxcb1:amd64 (1.17.0-2+b1) ...
Setting up libwww-perl (6.78-1) ...
Setting up libxcb-render0:amd64 (1.17.0-2+b1) ...
Setting up libbrotli1:amd64 (1.1.0-2+b7) ...
Setting up zlib1g:amd64 (1:1.3.dfsg+really1.3.1-1+b1) ...
Setting up libcrypt1:amd64 (1:4.4.38-1) ...
Setting up libxcb-shm0:amd64 (1.17.0-2+b1) ...
Setting up libgomp1:amd64 (14.2.0-17) ...
Setting up libffi-dev:amd64 (3.4.7-1) ...
Setting up libpcre2-16-0:amd64 (10.45-1) ...
Setting up libpcre2-32-0:amd64 (10.45-1) ...
Setting up libquadmath0:amd64 (14.2.0-17) ...
Setting up libpng16-16t64:amd64 (1.6.47-1) ...
Setting up libatomic1:amd64 (14.2.0-17) ...
Setting up libuuid1:amd64 (2.40.4-5) ...
Setting up libsepol2:amd64 (3.8-1) ...
Setting up libsepol-dev:amd64 (3.8-1) ...
Setting up libpcre2-8-0:amd64 (10.45-1) ...
Setting up cross-exe-wrapper:amd64 (0.2.6) ...
Setting up libubsan1:amd64 (14.2.0-17) ...
Setting up libpcre2-posix3:amd64 (10.45-1) ...
Setting up libcrypt-dev:amd64 (1:4.4.38-1) ...
Setting up libc6-dev:amd64 (2.41-4) ...
Setting up libx11-6:amd64 (2:1.8.10-2) ...
Setting up libgcc-14-dev:amd64 (14.2.0-17) ...
Setting up libstdc++-14-dev:amd64 (14.2.0-17) ...
Setting up libxml-parser-perl (2.47-1+b3) ...
Setting up libpcre2-dev:amd64 (10.45-1) ...
Setting up libxrender1:amd64 (1:0.9.10-1.1+b4) ...
Setting up libxext6:amd64 (2:1.3.4-1+b3) ...
Setting up libselinux1:amd64 (3.8-4) ...
Setting up libfreetype6:amd64 (2.13.3+dfsg-1) ...
Setting up uuid-dev:amd64 (2.40.4-5) ...
Setting up intltool (0.51.0-6) ...
Setting up zlib1g-dev:amd64 (1:1.3.dfsg+really1.3.1-1+b1) ...
Setting up libmount1:amd64 (2.40.4-5) ...
Setting up libfontconfig1:amd64 (2.15.0-2.1) ...
Setting up libblkid-dev:amd64 (2.40.4-5) ...
Setting up libselinux1-dev:amd64 (3.8-4) ...
Setting up gnome-common (3.18.0-6) ...
Setting up libcairo2:amd64 (1.18.2-2) ...
Setting up libglib2.0-0t64:amd64 (2.84.0-1) ...
/var/lib/dpkg/info/libglib2.0-0t64:amd64.postinst: 37: /usr/lib/x86_64-linux-gnu/glib-2.0/glib-compile-schemas: Exec format error
/var/lib/dpkg/info/libglib2.0-0t64:amd64.postinst: 38: /usr/lib/x86_64-linux-gnu/glib-2.0/gio-querymodules: Exec format error
Setting up gir1.2-glib-2.0:amd64 (2.84.0-1) ...
Setting up gir1.2-glib-2.0-dev:amd64 (2.84.0-1) ...
Setting up libgirepository-1.0-1:amd64 (1.83.4-1) ...
Setting up libcairo-gobject2:amd64 (1.18.2-2) ...
Setting up libmount-dev:amd64 (2.40.4-5) ...
Setting up gir1.2-freedesktop:amd64 (1.83.4-1) ...
Setting up libgio-2.0-dev:amd64 (2.84.0-1) ...
Setting up libvala-0.56-0:amd64 (0.56.18-2) ...
Setting up libgirepository-2.0-0:amd64 (2.84.0-1) ...
Setting up libvalacodegen-0.56-0:amd64 (0.56.18-2) ...
Setting up gir1.2-girepository-2.0:amd64 (1.83.4-1) ...
Setting up gir1.2-freedesktop-dev:amd64 (1.83.4-1) ...
Setting up girepository-tools:amd64 (2.84.0-1) ...
Setting up gir1.2-girepository-2.0-dev:amd64 (1.83.4-1) ...
Setting up libglib2.0-dev:amd64 (2.84.0-1) ...
Setting up gobject-introspection:amd64 (1.83.4-1) ...
Setting up valac:amd64 (0.56.18-2) ...
Setting up libgirepository-1.0-dev:amd64 (1.83.4-1) ...
Setting up libgirepository1.0-dev:amd64 (1.83.4-1) ...
Processing triggers for base-files (13.7) ...
Processing triggers for libc-bin (2.41-4) ...
Processing triggers for sgml-base (1.31) ...
Setting up docbook-xsl (1.79.2+dfsg-7) ...
Setting up sgml-data (2.0.11+nmu1) ...
Processing triggers for sgml-base (1.31) ...
Setting up docbook-xml (4.5-13) ...
Setting up docbook (4.5-11) ...
Processing triggers for sgml-base (1.31) ...
Setting up docbook-to-man (1:2.0.0-48) ...
Setting up gtk-doc-tools (1.34.0-2) ...
Setting up sbuild-build-depends-main-dummy:amd64 (0.invalid.0) ...
Processing triggers for ca-certificates (20241223) ...
Updating certificates in /etc/ssl/certs...
0 added, 0 removed; done.
Running hooks in /etc/ca-certificates/update.d...
done.

+------------------------------------------------------------------------------+
| Check architectures                                                          |
+------------------------------------------------------------------------------+

Arch check ok (amd64 included in any all)

+------------------------------------------------------------------------------+
| Build environment                                                            |
+------------------------------------------------------------------------------+

Kernel: Linux 6.1.0-28-arm64 #1 SMP Debian 6.1.119-1 (2024-11-22) arm64 (aarch64)
Toolchain package versions: binutils_2.44-3 dpkg-dev_1.22.18 g++-14_14.2.0-17 gcc-14_14.2.0-17 libc6-dev_2.41-4 libstdc++-14-dev_14.2.0-17 libstdc++-14-dev-amd64-cross_14.2.0-12cross1 libstdc++6_14.2.0-17 libstdc++6-amd64-cross_14.2.0-12cross1 linux-libc-dev_6.12.17-1
Package versions: apt_2.9.32 apt-utils_2.9.32 autoconf_2.72-3 autoconf-archive_20220903-3 automake_1:1.17-3 autopoint_0.23.1-1 autotools-dev_20220109.1 base-files_13.7 base-passwd_3.6.6 bash_5.2.37-1.1 binutils_2.44-3 binutils-aarch64-linux-gnu_2.44-3 binutils-common_2.44-3 binutils-x86-64-linux-gnu_2.44-3 bsdextrautils_2.40.4-5 bsdutils_1:2.40.4-5 build-essential_12.12 bzip2_1.0.8-6 ca-certificates_20241223 coreutils_9.5-1+b1 cpp_4:14.2.0-1 cpp-14_14.2.0-17 cpp-14-aarch64-linux-gnu_14.2.0-17 cpp-14-x86-64-linux-gnu_14.2.0-12cross1 cpp-aarch64-linux-gnu_4:14.2.0-1 cpp-x86-64-linux-gnu_4:14.2.0-1 cross-exe-wrapper_0.2.6 crossbuild-essential-amd64_12.12 dash_0.5.12-12 debconf_1.5.91 debhelper_13.24.1 debian-archive-keyring_2023.4 debianutils_5.21 dh-autoreconf_20 dh-exec_0.30+b1 dh-strip-nondeterminism_1.14.1-2 diffutils_1:3.10-2 docbook_4.5-11 docbook-to-man_1:2.0.0-48 docbook-xml_4.5-13 docbook-xsl_1.79.2+dfsg-7 dpkg_1.22.18 dpkg-dev_1.22.18 dwz_0.15-1+b1 fakeroot_1.37-1 file_1:5.45-3+b1 findutils_4.10.0-3 fontconfig-config_2.15.0-2.1 fonts-dejavu-core_2.37-8 fonts-dejavu-mono_2.37-8 g++_4:14.2.0-1 g++-14_14.2.0-17 g++-14-aarch64-linux-gnu_14.2.0-17 g++-14-x86-64-linux-gnu_14.2.0-12cross1 g++-aarch64-linux-gnu_4:14.2.0-1 g++-x86-64-linux-gnu_4:14.2.0-1 gcc_4:14.2.0-1 gcc-14_14.2.0-17 gcc-14-aarch64-linux-gnu_14.2.0-17 gcc-14-base_14.2.0-17 gcc-14-cross-base_14.2.0-12cross1 gcc-14-x86-64-linux-gnu_14.2.0-12cross1 gcc-14-x86-64-linux-gnu-base_14.2.0-12cross1 gcc-aarch64-linux-gnu_4:14.2.0-1 gcc-x86-64-linux-gnu_4:14.2.0-1 gettext_0.23.1-1 gettext-base_0.23.1-1 gir1.2-freedesktop_1.83.4-1 gir1.2-freedesktop-dev_1.83.4-1 gir1.2-girepository-2.0_1.83.4-1 gir1.2-girepository-2.0-dev_1.83.4-1 gir1.2-glib-2.0_2.84.0-1 gir1.2-glib-2.0-dev_2.84.0-1 girepository-tools_2.84.0-1 gnome-common_3.18.0-6 gobject-introspection_1.83.4-1 gobject-introspection-bin_1.83.4-1 grep_3.11-4+b1 groff-base_1.23.0-7 gtk-doc-tools_1.34.0-2 gzip_1.13-1 hostname_3.25 init-system-helpers_1.68 intltool_0.51.0-6 intltool-debian_0.35.0+20060710.6 libacl1_2.3.2-2+b1 libapt-pkg7.0_2.9.32 libarchive-zip-perl_1.68-1 libasan8_14.2.0-17 libasan8-amd64-cross_14.2.0-12cross1 libatomic1_14.2.0-17 libatomic1-amd64-cross_14.2.0-12cross1 libattr1_1:2.5.2-3 libaudit-common_1:4.0.2-2 libaudit1_1:4.0.2-2+b2 libbinutils_2.44-3 libblkid-dev_2.40.4-5 libblkid1_2.40.4-5 libbrotli1_1.1.0-2+b7 libbz2-1.0_1.0.8-6 libc-bin_2.41-4 libc-dev-bin_2.41-4 libc6_2.41-4 libc6-amd64-cross_2.41-4cross1 libc6-dev_2.41-4 libc6-dev-amd64-cross_2.41-4cross1 libcairo-gobject2_1.18.2-2 libcairo2_1.18.2-2 libcap-ng0_0.8.5-4+b1 libcap2_1:2.75-1 libcc1-0_14.2.0-17 libclone-perl_0.47-1+b1 libcrypt-dev_1:4.4.38-1 libcrypt1_1:4.4.38-1 libctf-nobfd0_2.44-3 libctf0_2.44-3 libdb5.3t64_5.3.28+dfsg2-9 libdebconfclient0_0.277 libdebhelper-perl_13.24.1 libdpkg-perl_1.22.18 libelf1t64_0.192-4 libencode-locale-perl_1.05-3 libexpat1_2.6.4-1 libfakeroot_1.37-1 libffi-dev_3.4.7-1 libffi8_3.4.7-1 libfile-listing-perl_6.16-1 libfile-stripnondeterminism-perl_1.14.1-2 libfontconfig1_2.15.0-2.1 libfreetype6_2.13.3+dfsg-1 libgcc-14-dev_14.2.0-17 libgcc-14-dev-amd64-cross_14.2.0-12cross1 libgcc-s1_14.2.0-17 libgcc-s1-amd64-cross_14.2.0-12cross1 libgcrypt20_1.11.0-7 libgdbm-compat4t64_1.24-2 libgdbm6t64_1.24-2 libgio-2.0-dev_2.84.0-1 libgio-2.0-dev-bin_2.84.0-1 libgirepository-1.0-1_1.83.4-1 libgirepository-1.0-dev_1.83.4-1 libgirepository-2.0-0_2.84.0-1 libgirepository1.0-dev_1.83.4-1 libglib2.0-0t64_2.84.0-1 libglib2.0-bin_2.84.0-1 libglib2.0-data_2.84.0-1 libglib2.0-dev_2.84.0-1 libglib2.0-dev-bin_2.84.0-1 libgmp10_2:6.3.0+dfsg-3 libgomp1_14.2.0-17 libgomp1-amd64-cross_14.2.0-12cross1 libgpg-error0_1.51-3 libgprofng0_2.44-3 libhogweed6t64_3.10.1-1 libhtml-parser-perl_3.83-1+b2 libhtml-tagset-perl_3.24-1 libhtml-tree-perl_5.07-3 libhttp-cookies-perl_6.11-1 libhttp-date-perl_6.06-1 libhttp-message-perl_7.00-2 libhttp-negotiate-perl_6.01-2 libhwasan0_14.2.0-17 libhwasan0-amd64-cross_14.2.0-12cross1 libicu72_72.1-6 libio-html-perl_1.004-3 libio-socket-ssl-perl_2.089-1 libisl23_0.27-1 libitm1_14.2.0-17 libitm1-amd64-cross_14.2.0-12cross1 libjansson4_2.14-2+b3 liblsan0_14.2.0-17 liblsan0-amd64-cross_14.2.0-12cross1 liblwp-mediatypes-perl_6.04-2 liblwp-protocol-https-perl_6.14-1 liblz4-1_1.10.0-4 liblzma5_5.6.4-1 libmagic-mgc_1:5.45-3+b1 libmagic1t64_1:5.45-3+b1 libmd0_1.1.0-2+b1 libmount-dev_2.40.4-5 libmount1_2.40.4-5 libmpc3_1.3.1-1+b3 libmpfr6_4.2.1-1+b2 libncursesw6_6.5+20250216-2 libnet-http-perl_6.23-1 libnet-ssleay-perl_1.94-3 libnettle8t64_3.10.1-1 libosp5_1.5.2-15.2 libpam-modules_1.7.0-3 libpam-modules-bin_1.7.0-3 libpam-runtime_1.7.0-3 libpam0g_1.7.0-3 libpcre2-16-0_10.45-1 libpcre2-32-0_10.45-1 libpcre2-8-0_10.45-1 libpcre2-dev_10.45-1 libpcre2-posix3_10.45-1 libperl5.40_5.40.1-2 libpipeline1_1.5.8-1 libpixman-1-0_0.44.0-3 libpkgconf3_1.8.1-4 libpng16-16t64_1.6.47-1 libpython3-stdlib_3.13.2-2 libpython3.13-minimal_3.13.2-1 libpython3.13-stdlib_3.13.2-1 libquadmath0_14.2.0-17 libquadmath0-amd64-cross_14.2.0-12cross1 libreadline8t64_8.2-6 libseccomp2_2.5.5-2+b1 libselinux1_3.8-4 libselinux1-dev_3.8-4 libsepol-dev_3.8-1 libsepol2_3.8-1 libsframe1_2.44-3 libsmartcols1_2.40.4-5 libsqlite3-0_3.46.1-2 libssl3t64_3.4.1-1 libstdc++-14-dev_14.2.0-17 libstdc++-14-dev-amd64-cross_14.2.0-12cross1 libstdc++6_14.2.0-17 libstdc++6-amd64-cross_14.2.0-12cross1 libsysprof-capture-4-dev_48~beta-2 libsystemd0_257.4-1 libtimedate-perl_2.3300-2 libtinfo6_6.5+20250216-2 libtool_2.5.4-4 libtry-tiny-perl_0.32-1 libtsan2_14.2.0-17 libtsan2-amd64-cross_14.2.0-12cross1 libubsan1_14.2.0-17 libubsan1-amd64-cross_14.2.0-12cross1 libuchardet0_0.0.8-1+b2 libudev1_257.4-1 libunistring5_1.3-1 liburi-perl_5.30-1 libuuid1_2.40.4-5 libvala-0.56-0_0.56.18-2 libvalacodegen-0.56-0_0.56.18-2 libwww-perl_6.78-1 libwww-robotrules-perl_6.02-1 libx11-6_2:1.8.10-2 libx11-data_2:1.8.10-2 libxau6_1:1.0.11-1 libxcb-render0_1.17.0-2+b1 libxcb-shm0_1.17.0-2+b1 libxcb1_1.17.0-2+b1 libxdmcp6_1:1.1.5-1 libxext6_2:1.3.4-1+b3 libxml-parser-perl_2.47-1+b3 libxml2_2.12.7+dfsg+really2.9.14-0.2+b2 libxrender1_1:0.9.10-1.1+b4 libxslt1.1_1.1.35-1.1+b1 libxxhash0_0.8.3-2 libzstd1_1.5.6+dfsg-2 linux-libc-dev_6.12.17-1 linux-libc-dev-amd64-cross_6.12.17-1cross1 login_1:4.16.0-2+really2.40.4-5 login.defs_1:4.17.3-1 m4_1.4.19-7 make_4.4.1-1 man-db_2.13.0-1 mawk_1.3.4.20250131-1 media-types_13.0.0 meson_1.7.0-1 native-architecture_0.2.6 ncurses-base_6.5+20250216-2 ncurses-bin_6.5+20250216-2 netbase_6.4 ninja-build_1.12.1-1+b1 opensp_1.5.2-15.2 openssl_3.4.1-1 openssl-provider-legacy_3.4.1-1 patch_2.7.6-7+b1 perl_5.40.1-2 perl-base_5.40.1-2 perl-modules-5.40_5.40.1-2 perl-openssl-defaults_7+b2 pkgconf_1.8.1-4 pkgconf-bin_1.8.1-4 po-debconf_1.0.21+nmu1 python3_3.13.2-2 python3-autocommand_2.2.2-3 python3-inflect_7.3.1-2 python3-jaraco.context_6.0.1-1 python3-jaraco.functools_4.1.0-1 python3-jaraco.text_4.0.0-1 python3-lxml_5.3.1-1+b1 python3-mako_1.3.8-2 python3-markdown_3.7-2 python3-markupsafe_2.1.5-1+b4 python3-minimal_3.13.2-2 python3-more-itertools_10.6.0-1 python3-packaging_24.2-1 python3-pkg-resources_75.8.0-1 python3-pygments_2.18.0+dfsg-2 python3-setuptools_75.8.0-1 python3-typeguard_4.4.2-1 python3-typing-extensions_4.12.2-2 python3-zipp_3.21.0-1 python3.13_3.13.2-1 python3.13-minimal_3.13.2-1 qemu-user_1:9.2.2+ds-1 readline-common_8.2-6 rpcsvc-proto_1.4.3-1+b1 sbuild-build-depends-main-dummy_0.invalid.0 sed_4.9-2+b1 sensible-utils_0.0.24 sgml-base_1.31 sgml-data_2.0.11+nmu1 sqv_1.2.1-6+b1 sysvinit-utils_3.14-3 tar_1.35+dfsg-3.1 tzdata_2025a-2 util-linux_2.40.4-5 uuid-dev_2.40.4-5 valac_0.56.18-2 valac-0.56-vapi_0.56.18-2 valac-bin_0.56.18-2 xml-core_0.19 xsltproc_1.1.35-1.1+b1 xz-utils_5.6.4-1 zlib1g_1:1.3.dfsg+really1.3.1-1+b1 zlib1g-dev_1:1.3.dfsg+really1.3.1-1+b1

+------------------------------------------------------------------------------+
| Build                                                                        |
+------------------------------------------------------------------------------+


Unpack source
-------------

-----BEGIN PGP SIGNED MESSAGE-----
Hash: SHA512

Format: 3.0 (quilt)
Source: lunar-date
Binary: gir1.2-lunardate-3.0, liblunar-date-3.0-1, liblunar-date-dev, liblunar-date-doc, lunar-date
Architecture: any all
Version: 3.0.1-2
Maintainer: Debian Chinese Team <chinese-developers@lists.alioth.debian.org>
Uploaders:  YunQiang Su <syq@debian.org>, ChangZhuo Chen (陳昌倬) <czchen@debian.org>, xiao sheng wen <atzlinux@sina.com>,
Homepage: https://github.com/yetist/lunar-date
Standards-Version: 4.6.0
Vcs-Browser: https://salsa.debian.org/chinese-team/lunar-date
Vcs-Git: https://salsa.debian.org/chinese-team/lunar-date.git
Build-Depends: meson, debhelper-compat (= 13), dh-exec, gnome-common, gobject-introspection, gtk-doc-tools (>= 1.0), intltool, libgirepository1.0-dev, libglib2.0-dev, valac, dh-sequence-gir
Package-List:
 gir1.2-lunardate-3.0 deb introspection optional arch=any
 liblunar-date-3.0-1 deb libs optional arch=any
 liblunar-date-dev deb libdevel optional arch=any
 liblunar-date-doc deb doc optional arch=all
 lunar-date deb utils optional arch=any
Checksums-Sha1:
 a8baf7d7d2be90a166debab3ec7974c41c5cff8a 103134 lunar-date_3.0.1.orig.tar.gz
 a267fc3cd4aab98a521f41937a1b9f08df7b7463 5008 lunar-date_3.0.1-2.debian.tar.xz
Checksums-Sha256:
 bfdd6ea70157ea55f0632fa3c86235cf00aba43bab85b707fd7d0096cbe0ac3e 103134 lunar-date_3.0.1.orig.tar.gz
 264b2dd017ebe5f2387130af6c3fa3c316847f372b89373e8e9fa5979ceb1613 5008 lunar-date_3.0.1-2.debian.tar.xz
Files:
 9b33346f2a8190125bdb879dac8afbc1 103134 lunar-date_3.0.1.orig.tar.gz
 cd80a6ecf5baaebddb21537572fde4a6 5008 lunar-date_3.0.1-2.debian.tar.xz

-----BEGIN PGP SIGNATURE-----

iQIzBAEBCgAdFiEEfncpR22H1vEdkazLwpPntGGCWs4FAmHDhy8ACgkQwpPntGGC
Ws76WA//Z0FuRiyXrsHfOXabGbfuCA6ID+hAamSfT4mG41DISzDFRwBEaTGj/LFU
iCZV935rPsosl5NrJuQXudAnRlSyLJeR/PKn8dQDR9617ILVp+qFnCkjE1Emz1CK
s1eYGcM6gHP5w/3szX1ntr8EsYrDdKSeUeJbUVry7CXWO9B7TN1MA640fBNz1U0B
Gf8d+jAL+I+IZ/upro7ok5SOtLESCKPDvKTM2b+YFNqtWS+qEoGfIDD5At58LC2t
Qp4JVPtjzxP1vTDgK5/1jRDUerVs8YFEuYdPtIjL6cVZRPDsl9ksJ7e0agHHNE+R
fZe83iBs7XOnJ+mhfgyjSsTSCcxYk0qhnd3qJROMMhXcjC3efpR9NsyB90wnb5mN
+gc1j2c7U/F3No1WJ+Eyt5fGhjlMrEJkWsJLUCQ4DAXcMHLHD8x7r0psQRFOwuzB
cHjhQKCvq4OlwwTe4iAW1kwLKj3uvxiT7ALmRDryfJO0M1snnDs79fDwkeeO+1JW
bycs6QAI0E3a799D5p9XgLAbTdQl8ni6SowH9UbkgLv6o3xWoGAFu+nQkJ8vsY2X
5T/xg/nf2/iTm9klJpYuqCO8+N9jX1pOtXSRZtIj0DyOlllAhCqY/JfEtO20UBIc
cXUrQXjBMlAduKLTR7LY/DozPqRf2WrTTIFlXBNBpAOCMWLqRjg=
=5Usp
-----END PGP SIGNATURE-----

dpkg-source: warning: cannot verify inline signature for ./lunar-date_3.0.1-2.dsc: unsupported subcommand
dpkg-source: info: extracting lunar-date in /<<PKGBUILDDIR>>
dpkg-source: info: unpacking lunar-date_3.0.1.orig.tar.gz
dpkg-source: info: unpacking lunar-date_3.0.1-2.debian.tar.xz
dpkg-source: info: using patch list from debian/patches/series
dpkg-source: info: applying meson.build.delwarn.patch

Check disk space
----------------

Sufficient free space for build

User Environment
----------------

APT_CONFIG=/var/lib/sbuild/apt.conf
CONFIG_SITE=/etc/dpkg-cross/cross-config.amd64
DEB_BUILD_OPTIONS=nocheck
HOME=/var/lib/sbuild
LANG=en_GB.UTF-8
LC_ALL=C.UTF-8
LOGNAME=helmut
OLDPWD=/
PATH=/usr/local/sbin:/usr/local/bin:/usr/sbin:/usr/bin:/sbin:/bin:/usr/games
PWD=/<<PKGBUILDDIR>>
SHELL=/bin/sh
USER=helmut

dpkg-buildpackage
-----------------

Command: dpkg-buildpackage --sanitize-env -aamd64 -Pcross,nocheck -us -uc -B -rfakeroot --jobs-try=1
dpkg-buildpackage: info: source package lunar-date
dpkg-buildpackage: info: source version 3.0.1-2
dpkg-buildpackage: info: source distribution unstable
dpkg-buildpackage: info: source changed by xiao sheng wen <atzlinux@sina.com>
dpkg-architecture: warning: specified GNU system type x86_64-linux-gnu does not match CC system type aarch64-linux-gnu, try setting a correct CC environment variable
 dpkg-source --before-build .
dpkg-buildpackage: info: host architecture amd64
 debian/rules clean
dh clean
   dh_clean
 debian/rules binary-arch
dh binary-arch
   dh_update_autotools_config -a
   dh_autoreconf -a
   debian/rules override_dh_auto_configure
make[1]: Entering directory '/<<PKGBUILDDIR>>'
dh_auto_configure -- -Ddocs=true -Dintrospection=true -Dvapi=true -Dtests=true
	cd obj-x86_64-linux-gnu && DEB_PYTHON_INSTALL_LAYOUT=deb LC_ALL=C.UTF-8 meson setup .. --wrap-mode=nodownload --buildtype=plain --prefix=/usr --sysconfdir=/etc --localstatedir=/var --libdir=lib/x86_64-linux-gnu -Dpython.bytecompile=-1 --cross-file /<<PKGBUILDDIR>>/debian/.debhelper/generated/_source/meson-cross-file.conf -Ddocs=true -Dintrospection=true -Dvapi=true -Dtests=true
DEPRECATION: "pkgconfig" entry is deprecated and should be replaced by "pkg-config"
DEPRECATION: c_args in the [properties] section of the machine file is deprecated, use the [built-in options] section.
DEPRECATION: cpp_args in the [properties] section of the machine file is deprecated, use the [built-in options] section.
DEPRECATION: c_link_args in the [properties] section of the machine file is deprecated, use the [built-in options] section.
DEPRECATION: cpp_link_args in the [properties] section of the machine file is deprecated, use the [built-in options] section.
The Meson build system
Version: 1.7.0
Source dir: /<<PKGBUILDDIR>>
Build dir: /<<PKGBUILDDIR>>/obj-x86_64-linux-gnu
Build type: cross build
Project name: lunar-date
Project version: 3.0.1
C compiler for the host machine: /usr/bin/x86_64-linux-gnu-gcc (gcc 14.2.0 "x86_64-linux-gnu-gcc (Debian 14.2.0-12) 14.2.0")
C linker for the host machine: /usr/bin/x86_64-linux-gnu-gcc ld.bfd 2.44
C compiler for the build machine: cc (gcc 14.2.0 "cc (Debian 14.2.0-17) 14.2.0")
C linker for the build machine: cc ld.bfd 2.44
Build machine cpu family: aarch64
Build machine cpu: aarch64
Host machine cpu family: x86_64
Host machine cpu: amd64
Target machine cpu family: x86_64
Target machine cpu: amd64
Compiler for C supports arguments -Waggregate-return: YES 
Compiler for C supports arguments -Warray-bounds: YES 
Compiler for C supports arguments -Wcast-align: YES 
Compiler for C supports arguments -Wclobbered: YES 
Compiler for C supports arguments -Wdeclaration-after-statement: YES 
Compiler for C supports arguments -Wempty-body: YES 
Compiler for C supports arguments -Wformat=2: YES 
Compiler for C supports arguments -Wformat-nonliteral: YES 
Compiler for C supports arguments -Wformat-security: YES 
Compiler for C supports arguments -Wformat-signedness: YES 
Compiler for C supports arguments -Wignored-qualifiers: YES 
Compiler for C supports arguments -Wimplicit-function-declaration: YES 
Compiler for C supports arguments -Winit-self: YES 
Compiler for C supports arguments -Winline: YES 
Compiler for C supports arguments -Wmissing-declarations: YES 
Compiler for C supports arguments -Wmissing-format-attribute: YES 
Compiler for C supports arguments -Wmissing-include-dirs: YES 
Compiler for C supports arguments -Wmissing-noreturn: YES 
Compiler for C supports arguments -Wmissing-parameter-type: YES 
Compiler for C supports arguments -Wmissing-prototypes: YES 
Compiler for C supports arguments -Wnested-externs: YES 
Compiler for C supports arguments -Wno-discarded-qualifiers: YES 
Compiler for C supports arguments -Wno-missing-field-initializers: YES 
Compiler for C supports arguments -Wno-strict-aliasing: YES 
Compiler for C supports arguments -Wno-suggest-attribute=format: YES 
Compiler for C supports arguments -Wno-unused-parameter: YES 
Compiler for C supports arguments -Wold-style-definition: YES 
Compiler for C supports arguments -Woverride-init: YES 
Compiler for C supports arguments -Wpacked: YES 
Compiler for C supports arguments -Wpointer-arith: YES 
Compiler for C supports arguments -Wredundant-decls: YES 
Compiler for C supports arguments -Wreturn-type: YES 
Compiler for C supports arguments -Wshadow: YES 
Compiler for C supports arguments -Wsign-compare: YES 
Compiler for C supports arguments -Wstrict-aliasing: YES 
Compiler for C supports arguments -Wstrict-prototypes: YES 
Compiler for C supports arguments -Wswitch-default: YES 
Compiler for C supports arguments -Wtype-limits: YES 
Compiler for C supports arguments -Wundef: YES 
Compiler for C supports arguments -Wuninitialized: YES 
Compiler for C supports arguments -Wunused-but-set-variable: YES 
Compiler for C supports arguments -Wwrite-strings: YES 
Compiler for C supports arguments -fstack-protector-strong: YES 
Compiler for C supports link arguments -Wl,-z,relro: YES 
Compiler for C supports link arguments -Wl,-z,now: YES 
Found pkg-config: YES (/usr/bin/x86_64-linux-gnu-pkg-config) 1.8.1
Run-time dependency gio-2.0 found: YES 2.84.0
Message: linux
Run-time dependency gio-unix-2.0 found: YES 2.84.0
Configuring config.h using configuration
Program msgfmt found: YES (/usr/bin/msgfmt)
Program msginit found: YES (/usr/bin/msginit)
Program msgmerge found: YES (/usr/bin/msgmerge)
Program xgettext found: YES (/usr/bin/xgettext)
Configuring lunar-date-version.h using configuration
Found pkg-config: YES (/usr/bin/pkg-config) 1.8.1
Did not find CMake 'cmake'
Found CMake: NO
Build-time dependency glib-2.0 found: NO (tried pkgconfig and cmake)
Program glib-mkenums found: YES (/usr/bin/glib-mkenums)
Build-time dependency glib-2.0 found: NO (tried pkgconfig and cmake)
Program glib-mkenums found: YES (/usr/bin/glib-mkenums)
WARNING: Could not detect glib version, assuming 2.54. You may get build errors if your glib is older.
Build-time dependency gio-2.0 found: NO (tried pkgconfig and cmake)
Program glib-compile-resources found: YES (/usr/bin/glib-compile-resources)
Run-time dependency gobject-introspection-1.0 found: YES 1.83.4
Build-time dependency gobject-introspection-1.0 found: NO (tried pkgconfig and cmake)
Program g-ir-scanner found: YES (/usr/bin/g-ir-scanner)
Build-time dependency gobject-introspection-1.0 found: NO (tried pkgconfig and cmake)
Program g-ir-compiler found: NO

../lunar-date/meson.build:61:28: ERROR: Program 'g-ir-compiler' not found or not executable

A full log can be found at /<<PKGBUILDDIR>>/obj-x86_64-linux-gnu/meson-logs/meson-log.txt
	cd obj-x86_64-linux-gnu && tail -v -n \+0 meson-logs/meson-log.txt
==> meson-logs/meson-log.txt <==
Build started at 2025-03-11T11:36:48.476506
Main binary: /usr/bin/python3
Build Options: -Dpython.bytecompile=-1 -Ddocs=true -Dintrospection=true -Dvapi=true -Dtests=true -Dprefix=/usr -Dlibdir=lib/x86_64-linux-gnu -Dlocalstatedir=/var -Dsysconfdir=/etc -Dbuildtype=plain -Dwrap_mode=nodownload --cross-file=/<<PKGBUILDDIR>>/debian/.debhelper/generated/_source/meson-cross-file.conf
Python system: Linux
The Meson build system
Version: 1.7.0
Source dir: /<<PKGBUILDDIR>>
Build dir: /<<PKGBUILDDIR>>/obj-x86_64-linux-gnu
Build type: cross build
Project name: lunar-date
Project version: 3.0.1
-----------
Detecting compiler via: `/usr/bin/x86_64-linux-gnu-gcc --version` -> 0
stdout:
x86_64-linux-gnu-gcc (Debian 14.2.0-12) 14.2.0
Copyright (C) 2024 Free Software Foundation, Inc.
This is free software; see the source for copying conditions.  There is NO
warranty; not even for MERCHANTABILITY or FITNESS FOR A PARTICULAR PURPOSE.
-----------
Running command: -cpp -x c -E -dM -
-----
-----------
Detecting linker via: `/usr/bin/x86_64-linux-gnu-gcc -Wl,--version -g -O2 -Werror=implicit-function-declaration -ffile-prefix-map=/<<PKGBUILDDIR>>=. -fstack-protector-strong -fstack-clash-protection -Wformat -Werror=format-security -fcf-protection -Wl,-z,relro -Wl,-z,now` -> 0
stdout:
GNU ld (GNU Binutils for Debian) 2.44
Copyright (C) 2025 Free Software Foundation, Inc.
This program is free software; you may redistribute it under the terms of
the GNU General Public License version 3 or (at your option) a later version.
This program has absolutely no warranty.
-----------
stderr:
collect2 version 14.2.0
/usr/lib/gcc-cross/x86_64-linux-gnu/14/../../../../x86_64-linux-gnu/bin/ld -plugin /usr/libexec/gcc-cross/x86_64-linux-gnu/14/liblto_plugin.so -plugin-opt=/usr/libexec/gcc-cross/x86_64-linux-gnu/14/lto-wrapper -plugin-opt=-fresolution=/tmp/cc0XGuYK.res -plugin-opt=-pass-through=-lgcc -plugin-opt=-pass-through=-lgcc_s -plugin-opt=-pass-through=-lc -plugin-opt=-pass-through=-lgcc -plugin-opt=-pass-through=-lgcc_s --sysroot=/ --build-id --eh-frame-hdr -m elf_x86_64 --hash-style=gnu --as-needed -dynamic-linker /lib64/ld-linux-x86-64.so.2 -pie /usr/lib/gcc-cross/x86_64-linux-gnu/14/../../../../x86_64-linux-gnu/lib/../lib/Scrt1.o /usr/lib/gcc-cross/x86_64-linux-gnu/14/../../../../x86_64-linux-gnu/lib/../lib/crti.o /usr/lib/gcc-cross/x86_64-linux-gnu/14/crtbeginS.o -L/usr/lib/gcc-cross/x86_64-linux-gnu/14 -L/usr/lib/gcc-cross/x86_64-linux-gnu/14/../../../../x86_64-linux-gnu/lib/../lib -L/lib/x86_64-linux-gnu -L/lib/../lib -L/usr/lib/x86_64-linux-gnu -L/usr/lib/../lib -L/usr/lib/gcc-cross/x86_64-linux-gnu/14/../../../../x86_64-linux-gnu/lib --version -z relro -z now -lgcc --push-state --as-needed -lgcc_s --pop-state -lc -lgcc --push-state --as-needed -lgcc_s --pop-state /usr/lib/gcc-cross/x86_64-linux-gnu/14/crtendS.o /usr/lib/gcc-cross/x86_64-linux-gnu/14/../../../../x86_64-linux-gnu/lib/../lib/crtn.o
-----------
Sanity testing C compiler: /usr/bin/x86_64-linux-gnu-gcc
Is cross compiler: True.
Sanity check compiler command line: /usr/bin/x86_64-linux-gnu-gcc sanitycheckc.c -o sanitycheckc_cross.exe -Wdate-time -D_FORTIFY_SOURCE=2 -g -O2 -Werror=implicit-function-declaration -ffile-prefix-map=/<<PKGBUILDDIR>>=. -fstack-protector-strong -fstack-clash-protection -Wformat -Werror=format-security -fcf-protection -D_FILE_OFFSET_BITS=64 -c
Sanity check compile stdout:

-----
Sanity check compile stderr:

-----
C compiler for the host machine: /usr/bin/x86_64-linux-gnu-gcc (gcc 14.2.0 "x86_64-linux-gnu-gcc (Debian 14.2.0-12) 14.2.0")
C linker for the host machine: /usr/bin/x86_64-linux-gnu-gcc ld.bfd 2.44
-----------
Detecting archiver via: `/usr/bin/x86_64-linux-gnu-ar --version` -> 0
stdout:
GNU ar (GNU Binutils for Debian) 2.44
Copyright (C) 2025 Free Software Foundation, Inc.
This program is free software; you may redistribute it under the terms of
the GNU General Public License version 3 or (at your option) any later version.
This program has absolutely no warranty.
-----------
-----------
Detecting compiler via: `cc --version` -> 0
stdout:
cc (Debian 14.2.0-17) 14.2.0
Copyright (C) 2024 Free Software Foundation, Inc.
This is free software; see the source for copying conditions.  There is NO
warranty; not even for MERCHANTABILITY or FITNESS FOR A PARTICULAR PURPOSE.
-----------
Running command: -cpp -x c -E -dM -
-----
-----------
Detecting linker via: `cc -Wl,--version -g -O2` -> 0
stdout:
GNU ld (GNU Binutils for Debian) 2.44
Copyright (C) 2025 Free Software Foundation, Inc.
This program is free software; you may redistribute it under the terms of
the GNU General Public License version 3 or (at your option) a later version.
This program has absolutely no warranty.
-----------
stderr:
collect2 version 14.2.0
/usr/bin/ld -plugin /usr/libexec/gcc/aarch64-linux-gnu/14/liblto_plugin.so -plugin-opt=/usr/libexec/gcc/aarch64-linux-gnu/14/lto-wrapper -plugin-opt=-fresolution=/tmp/cckV6sXX.res -plugin-opt=-pass-through=-lgcc -plugin-opt=-pass-through=-lgcc_s -plugin-opt=-pass-through=-lc -plugin-opt=-pass-through=-lgcc -plugin-opt=-pass-through=-lgcc_s --build-id --eh-frame-hdr --hash-style=gnu --as-needed -dynamic-linker /lib/ld-linux-aarch64.so.1 -X -EL -maarch64linux --fix-cortex-a53-843419 -pie /usr/lib/gcc/aarch64-linux-gnu/14/../../../aarch64-linux-gnu/Scrt1.o /usr/lib/gcc/aarch64-linux-gnu/14/../../../aarch64-linux-gnu/crti.o /usr/lib/gcc/aarch64-linux-gnu/14/crtbeginS.o -L/usr/lib/gcc/aarch64-linux-gnu/14 -L/usr/lib/gcc/aarch64-linux-gnu/14/../../../aarch64-linux-gnu -L/usr/lib/gcc/aarch64-linux-gnu/14/../../../../lib -L/lib/aarch64-linux-gnu -L/lib/../lib -L/usr/lib/aarch64-linux-gnu -L/usr/lib/../lib -L/usr/lib/gcc/aarch64-linux-gnu/14/../../.. --version -lgcc --push-state --as-needed -lgcc_s --pop-state -lc -lgcc --push-state --as-needed -lgcc_s --pop-state /usr/lib/gcc/aarch64-linux-gnu/14/crtendS.o /usr/lib/gcc/aarch64-linux-gnu/14/../../../aarch64-linux-gnu/crtn.o
-----------
Sanity testing C compiler: cc
Is cross compiler: False.
Sanity check compiler command line: cc sanitycheckc.c -o sanitycheckc.exe -g -O2 -D_FILE_OFFSET_BITS=64
Sanity check compile stdout:

-----
Sanity check compile stderr:

-----
Running test binary command:  /<<PKGBUILDDIR>>/obj-x86_64-linux-gnu/meson-private/sanitycheckc.exe
C compiler for the build machine: cc (gcc 14.2.0 "cc (Debian 14.2.0-17) 14.2.0")
C linker for the build machine: cc ld.bfd 2.44
-----------
Detecting archiver via: `gcc-ar --version` -> 0
stdout:
GNU ar (GNU Binutils for Debian) 2.44
Copyright (C) 2025 Free Software Foundation, Inc.
This program is free software; you may redistribute it under the terms of
the GNU General Public License version 3 or (at your option) any later version.
This program has absolutely no warranty.
-----------
Build machine cpu family: aarch64
Build machine cpu: aarch64
Host machine cpu family: x86_64
Host machine cpu: amd64
Target machine cpu family: x86_64
Target machine cpu: amd64
Running compile:
Working directory:  /<<PKGBUILDDIR>>/obj-x86_64-linux-gnu/meson-private/tmpwt8o4wre
Code:
extern int i;
int i;

-----------
Command line: `/usr/bin/x86_64-linux-gnu-gcc /<<PKGBUILDDIR>>/obj-x86_64-linux-gnu/meson-private/tmpwt8o4wre/testfile.c -o /<<PKGBUILDDIR>>/obj-x86_64-linux-gnu/meson-private/tmpwt8o4wre/output.obj -c -Wdate-time -D_FORTIFY_SOURCE=2 -g -O2 -Werror=implicit-function-declaration -ffile-prefix-map=/<<PKGBUILDDIR>>=. -fstack-protector-strong -fstack-clash-protection -Wformat -Werror=format-security -fcf-protection -D_FILE_OFFSET_BITS=64 -O0 -Waggregate-return` -> 0
Compiler for C supports arguments -Waggregate-return: YES 
Running compile:
Working directory:  /<<PKGBUILDDIR>>/obj-x86_64-linux-gnu/meson-private/tmpepi_t30q
Code:
extern int i;
int i;

-----------
Command line: `/usr/bin/x86_64-linux-gnu-gcc /<<PKGBUILDDIR>>/obj-x86_64-linux-gnu/meson-private/tmpepi_t30q/testfile.c -o /<<PKGBUILDDIR>>/obj-x86_64-linux-gnu/meson-private/tmpepi_t30q/output.obj -c -Wdate-time -D_FORTIFY_SOURCE=2 -g -O2 -Werror=implicit-function-declaration -ffile-prefix-map=/<<PKGBUILDDIR>>=. -fstack-protector-strong -fstack-clash-protection -Wformat -Werror=format-security -fcf-protection -D_FILE_OFFSET_BITS=64 -O0 -Warray-bounds` -> 0
Compiler for C supports arguments -Warray-bounds: YES 
Running compile:
Working directory:  /<<PKGBUILDDIR>>/obj-x86_64-linux-gnu/meson-private/tmpvps6y80e
Code:
extern int i;
int i;

-----------
Command line: `/usr/bin/x86_64-linux-gnu-gcc /<<PKGBUILDDIR>>/obj-x86_64-linux-gnu/meson-private/tmpvps6y80e/testfile.c -o /<<PKGBUILDDIR>>/obj-x86_64-linux-gnu/meson-private/tmpvps6y80e/output.obj -c -Wdate-time -D_FORTIFY_SOURCE=2 -g -O2 -Werror=implicit-function-declaration -ffile-prefix-map=/<<PKGBUILDDIR>>=. -fstack-protector-strong -fstack-clash-protection -Wformat -Werror=format-security -fcf-protection -D_FILE_OFFSET_BITS=64 -O0 -Wcast-align` -> 0
Compiler for C supports arguments -Wcast-align: YES 
Running compile:
Working directory:  /<<PKGBUILDDIR>>/obj-x86_64-linux-gnu/meson-private/tmprocyxg5c
Code:
extern int i;
int i;

-----------
Command line: `/usr/bin/x86_64-linux-gnu-gcc /<<PKGBUILDDIR>>/obj-x86_64-linux-gnu/meson-private/tmprocyxg5c/testfile.c -o /<<PKGBUILDDIR>>/obj-x86_64-linux-gnu/meson-private/tmprocyxg5c/output.obj -c -Wdate-time -D_FORTIFY_SOURCE=2 -g -O2 -Werror=implicit-function-declaration -ffile-prefix-map=/<<PKGBUILDDIR>>=. -fstack-protector-strong -fstack-clash-protection -Wformat -Werror=format-security -fcf-protection -D_FILE_OFFSET_BITS=64 -O0 -Wclobbered` -> 0
Compiler for C supports arguments -Wclobbered: YES 
Running compile:
Working directory:  /<<PKGBUILDDIR>>/obj-x86_64-linux-gnu/meson-private/tmp34e4kkxv
Code:
extern int i;
int i;

-----------
Command line: `/usr/bin/x86_64-linux-gnu-gcc /<<PKGBUILDDIR>>/obj-x86_64-linux-gnu/meson-private/tmp34e4kkxv/testfile.c -o /<<PKGBUILDDIR>>/obj-x86_64-linux-gnu/meson-private/tmp34e4kkxv/output.obj -c -Wdate-time -D_FORTIFY_SOURCE=2 -g -O2 -Werror=implicit-function-declaration -ffile-prefix-map=/<<PKGBUILDDIR>>=. -fstack-protector-strong -fstack-clash-protection -Wformat -Werror=format-security -fcf-protection -D_FILE_OFFSET_BITS=64 -O0 -Wdeclaration-after-statement` -> 0
Compiler for C supports arguments -Wdeclaration-after-statement: YES 
Running compile:
Working directory:  /<<PKGBUILDDIR>>/obj-x86_64-linux-gnu/meson-private/tmpy5sd3rk3
Code:
extern int i;
int i;

-----------
Command line: `/usr/bin/x86_64-linux-gnu-gcc /<<PKGBUILDDIR>>/obj-x86_64-linux-gnu/meson-private/tmpy5sd3rk3/testfile.c -o /<<PKGBUILDDIR>>/obj-x86_64-linux-gnu/meson-private/tmpy5sd3rk3/output.obj -c -Wdate-time -D_FORTIFY_SOURCE=2 -g -O2 -Werror=implicit-function-declaration -ffile-prefix-map=/<<PKGBUILDDIR>>=. -fstack-protector-strong -fstack-clash-protection -Wformat -Werror=format-security -fcf-protection -D_FILE_OFFSET_BITS=64 -O0 -Wempty-body` -> 0
Compiler for C supports arguments -Wempty-body: YES 
Running compile:
Working directory:  /<<PKGBUILDDIR>>/obj-x86_64-linux-gnu/meson-private/tmpi9z8qx2y
Code:
extern int i;
int i;

-----------
Command line: `/usr/bin/x86_64-linux-gnu-gcc /<<PKGBUILDDIR>>/obj-x86_64-linux-gnu/meson-private/tmpi9z8qx2y/testfile.c -o /<<PKGBUILDDIR>>/obj-x86_64-linux-gnu/meson-private/tmpi9z8qx2y/output.obj -c -Wdate-time -D_FORTIFY_SOURCE=2 -g -O2 -Werror=implicit-function-declaration -ffile-prefix-map=/<<PKGBUILDDIR>>=. -fstack-protector-strong -fstack-clash-protection -Wformat -Werror=format-security -fcf-protection -D_FILE_OFFSET_BITS=64 -O0 -Wformat=2` -> 0
Compiler for C supports arguments -Wformat=2: YES 
Running compile:
Working directory:  /<<PKGBUILDDIR>>/obj-x86_64-linux-gnu/meson-private/tmpf50_ata9
Code:
extern int i;
int i;

-----------
Command line: `/usr/bin/x86_64-linux-gnu-gcc /<<PKGBUILDDIR>>/obj-x86_64-linux-gnu/meson-private/tmpf50_ata9/testfile.c -o /<<PKGBUILDDIR>>/obj-x86_64-linux-gnu/meson-private/tmpf50_ata9/output.obj -c -Wdate-time -D_FORTIFY_SOURCE=2 -g -O2 -Werror=implicit-function-declaration -ffile-prefix-map=/<<PKGBUILDDIR>>=. -fstack-protector-strong -fstack-clash-protection -Wformat -Werror=format-security -fcf-protection -D_FILE_OFFSET_BITS=64 -O0 -Wformat-nonliteral` -> 0
Compiler for C supports arguments -Wformat-nonliteral: YES 
Running compile:
Working directory:  /<<PKGBUILDDIR>>/obj-x86_64-linux-gnu/meson-private/tmpmh4wd24y
Code:
extern int i;
int i;

-----------
Command line: `/usr/bin/x86_64-linux-gnu-gcc /<<PKGBUILDDIR>>/obj-x86_64-linux-gnu/meson-private/tmpmh4wd24y/testfile.c -o /<<PKGBUILDDIR>>/obj-x86_64-linux-gnu/meson-private/tmpmh4wd24y/output.obj -c -Wdate-time -D_FORTIFY_SOURCE=2 -g -O2 -Werror=implicit-function-declaration -ffile-prefix-map=/<<PKGBUILDDIR>>=. -fstack-protector-strong -fstack-clash-protection -Wformat -Werror=format-security -fcf-protection -D_FILE_OFFSET_BITS=64 -O0 -Wformat-security` -> 0
Compiler for C supports arguments -Wformat-security: YES 
Running compile:
Working directory:  /<<PKGBUILDDIR>>/obj-x86_64-linux-gnu/meson-private/tmp1g3t491s
Code:
extern int i;
int i;

-----------
Command line: `/usr/bin/x86_64-linux-gnu-gcc /<<PKGBUILDDIR>>/obj-x86_64-linux-gnu/meson-private/tmp1g3t491s/testfile.c -o /<<PKGBUILDDIR>>/obj-x86_64-linux-gnu/meson-private/tmp1g3t491s/output.obj -c -Wdate-time -D_FORTIFY_SOURCE=2 -g -O2 -Werror=implicit-function-declaration -ffile-prefix-map=/<<PKGBUILDDIR>>=. -fstack-protector-strong -fstack-clash-protection -Wformat -Werror=format-security -fcf-protection -D_FILE_OFFSET_BITS=64 -O0 -Wformat-signedness` -> 0
Compiler for C supports arguments -Wformat-signedness: YES 
Running compile:
Working directory:  /<<PKGBUILDDIR>>/obj-x86_64-linux-gnu/meson-private/tmp5j_fexdh
Code:
extern int i;
int i;

-----------
Command line: `/usr/bin/x86_64-linux-gnu-gcc /<<PKGBUILDDIR>>/obj-x86_64-linux-gnu/meson-private/tmp5j_fexdh/testfile.c -o /<<PKGBUILDDIR>>/obj-x86_64-linux-gnu/meson-private/tmp5j_fexdh/output.obj -c -Wdate-time -D_FORTIFY_SOURCE=2 -g -O2 -Werror=implicit-function-declaration -ffile-prefix-map=/<<PKGBUILDDIR>>=. -fstack-protector-strong -fstack-clash-protection -Wformat -Werror=format-security -fcf-protection -D_FILE_OFFSET_BITS=64 -O0 -Wignored-qualifiers` -> 0
Compiler for C supports arguments -Wignored-qualifiers: YES 
Running compile:
Working directory:  /<<PKGBUILDDIR>>/obj-x86_64-linux-gnu/meson-private/tmpaimiat4w
Code:
extern int i;
int i;

-----------
Command line: `/usr/bin/x86_64-linux-gnu-gcc /<<PKGBUILDDIR>>/obj-x86_64-linux-gnu/meson-private/tmpaimiat4w/testfile.c -o /<<PKGBUILDDIR>>/obj-x86_64-linux-gnu/meson-private/tmpaimiat4w/output.obj -c -Wdate-time -D_FORTIFY_SOURCE=2 -g -O2 -Werror=implicit-function-declaration -ffile-prefix-map=/<<PKGBUILDDIR>>=. -fstack-protector-strong -fstack-clash-protection -Wformat -Werror=format-security -fcf-protection -D_FILE_OFFSET_BITS=64 -O0 -Wimplicit-function-declaration` -> 0
Compiler for C supports arguments -Wimplicit-function-declaration: YES 
Running compile:
Working directory:  /<<PKGBUILDDIR>>/obj-x86_64-linux-gnu/meson-private/tmp01d9mn9l
Code:
extern int i;
int i;

-----------
Command line: `/usr/bin/x86_64-linux-gnu-gcc /<<PKGBUILDDIR>>/obj-x86_64-linux-gnu/meson-private/tmp01d9mn9l/testfile.c -o /<<PKGBUILDDIR>>/obj-x86_64-linux-gnu/meson-private/tmp01d9mn9l/output.obj -c -Wdate-time -D_FORTIFY_SOURCE=2 -g -O2 -Werror=implicit-function-declaration -ffile-prefix-map=/<<PKGBUILDDIR>>=. -fstack-protector-strong -fstack-clash-protection -Wformat -Werror=format-security -fcf-protection -D_FILE_OFFSET_BITS=64 -O0 -Winit-self` -> 0
Compiler for C supports arguments -Winit-self: YES 
Running compile:
Working directory:  /<<PKGBUILDDIR>>/obj-x86_64-linux-gnu/meson-private/tmppd00t4qz
Code:
extern int i;
int i;

-----------
Command line: `/usr/bin/x86_64-linux-gnu-gcc /<<PKGBUILDDIR>>/obj-x86_64-linux-gnu/meson-private/tmppd00t4qz/testfile.c -o /<<PKGBUILDDIR>>/obj-x86_64-linux-gnu/meson-private/tmppd00t4qz/output.obj -c -Wdate-time -D_FORTIFY_SOURCE=2 -g -O2 -Werror=implicit-function-declaration -ffile-prefix-map=/<<PKGBUILDDIR>>=. -fstack-protector-strong -fstack-clash-protection -Wformat -Werror=format-security -fcf-protection -D_FILE_OFFSET_BITS=64 -O0 -Winline` -> 0
Compiler for C supports arguments -Winline: YES 
Running compile:
Working directory:  /<<PKGBUILDDIR>>/obj-x86_64-linux-gnu/meson-private/tmpgytzremd
Code:
extern int i;
int i;

-----------
Command line: `/usr/bin/x86_64-linux-gnu-gcc /<<PKGBUILDDIR>>/obj-x86_64-linux-gnu/meson-private/tmpgytzremd/testfile.c -o /<<PKGBUILDDIR>>/obj-x86_64-linux-gnu/meson-private/tmpgytzremd/output.obj -c -Wdate-time -D_FORTIFY_SOURCE=2 -g -O2 -Werror=implicit-function-declaration -ffile-prefix-map=/<<PKGBUILDDIR>>=. -fstack-protector-strong -fstack-clash-protection -Wformat -Werror=format-security -fcf-protection -D_FILE_OFFSET_BITS=64 -O0 -Wmissing-declarations` -> 0
Compiler for C supports arguments -Wmissing-declarations: YES 
Running compile:
Working directory:  /<<PKGBUILDDIR>>/obj-x86_64-linux-gnu/meson-private/tmp9se9x14v
Code:
extern int i;
int i;

-----------
Command line: `/usr/bin/x86_64-linux-gnu-gcc /<<PKGBUILDDIR>>/obj-x86_64-linux-gnu/meson-private/tmp9se9x14v/testfile.c -o /<<PKGBUILDDIR>>/obj-x86_64-linux-gnu/meson-private/tmp9se9x14v/output.obj -c -Wdate-time -D_FORTIFY_SOURCE=2 -g -O2 -Werror=implicit-function-declaration -ffile-prefix-map=/<<PKGBUILDDIR>>=. -fstack-protector-strong -fstack-clash-protection -Wformat -Werror=format-security -fcf-protection -D_FILE_OFFSET_BITS=64 -O0 -Wmissing-format-attribute` -> 0
Compiler for C supports arguments -Wmissing-format-attribute: YES 
Running compile:
Working directory:  /<<PKGBUILDDIR>>/obj-x86_64-linux-gnu/meson-private/tmp9b4qhvwq
Code:
extern int i;
int i;

-----------
Command line: `/usr/bin/x86_64-linux-gnu-gcc /<<PKGBUILDDIR>>/obj-x86_64-linux-gnu/meson-private/tmp9b4qhvwq/testfile.c -o /<<PKGBUILDDIR>>/obj-x86_64-linux-gnu/meson-private/tmp9b4qhvwq/output.obj -c -Wdate-time -D_FORTIFY_SOURCE=2 -g -O2 -Werror=implicit-function-declaration -ffile-prefix-map=/<<PKGBUILDDIR>>=. -fstack-protector-strong -fstack-clash-protection -Wformat -Werror=format-security -fcf-protection -D_FILE_OFFSET_BITS=64 -O0 -Wmissing-include-dirs` -> 0
Compiler for C supports arguments -Wmissing-include-dirs: YES 
Running compile:
Working directory:  /<<PKGBUILDDIR>>/obj-x86_64-linux-gnu/meson-private/tmp5itt7oz8
Code:
extern int i;
int i;

-----------
Command line: `/usr/bin/x86_64-linux-gnu-gcc /<<PKGBUILDDIR>>/obj-x86_64-linux-gnu/meson-private/tmp5itt7oz8/testfile.c -o /<<PKGBUILDDIR>>/obj-x86_64-linux-gnu/meson-private/tmp5itt7oz8/output.obj -c -Wdate-time -D_FORTIFY_SOURCE=2 -g -O2 -Werror=implicit-function-declaration -ffile-prefix-map=/<<PKGBUILDDIR>>=. -fstack-protector-strong -fstack-clash-protection -Wformat -Werror=format-security -fcf-protection -D_FILE_OFFSET_BITS=64 -O0 -Wmissing-noreturn` -> 0
Compiler for C supports arguments -Wmissing-noreturn: YES 
Running compile:
Working directory:  /<<PKGBUILDDIR>>/obj-x86_64-linux-gnu/meson-private/tmpj_2_zqbm
Code:
extern int i;
int i;

-----------
Command line: `/usr/bin/x86_64-linux-gnu-gcc /<<PKGBUILDDIR>>/obj-x86_64-linux-gnu/meson-private/tmpj_2_zqbm/testfile.c -o /<<PKGBUILDDIR>>/obj-x86_64-linux-gnu/meson-private/tmpj_2_zqbm/output.obj -c -Wdate-time -D_FORTIFY_SOURCE=2 -g -O2 -Werror=implicit-function-declaration -ffile-prefix-map=/<<PKGBUILDDIR>>=. -fstack-protector-strong -fstack-clash-protection -Wformat -Werror=format-security -fcf-protection -D_FILE_OFFSET_BITS=64 -O0 -Wmissing-parameter-type` -> 0
Compiler for C supports arguments -Wmissing-parameter-type: YES 
Running compile:
Working directory:  /<<PKGBUILDDIR>>/obj-x86_64-linux-gnu/meson-private/tmppenyhm9l
Code:
extern int i;
int i;

-----------
Command line: `/usr/bin/x86_64-linux-gnu-gcc /<<PKGBUILDDIR>>/obj-x86_64-linux-gnu/meson-private/tmppenyhm9l/testfile.c -o /<<PKGBUILDDIR>>/obj-x86_64-linux-gnu/meson-private/tmppenyhm9l/output.obj -c -Wdate-time -D_FORTIFY_SOURCE=2 -g -O2 -Werror=implicit-function-declaration -ffile-prefix-map=/<<PKGBUILDDIR>>=. -fstack-protector-strong -fstack-clash-protection -Wformat -Werror=format-security -fcf-protection -D_FILE_OFFSET_BITS=64 -O0 -Wmissing-prototypes` -> 0
Compiler for C supports arguments -Wmissing-prototypes: YES 
Running compile:
Working directory:  /<<PKGBUILDDIR>>/obj-x86_64-linux-gnu/meson-private/tmpa9307o1r
Code:
extern int i;
int i;

-----------
Command line: `/usr/bin/x86_64-linux-gnu-gcc /<<PKGBUILDDIR>>/obj-x86_64-linux-gnu/meson-private/tmpa9307o1r/testfile.c -o /<<PKGBUILDDIR>>/obj-x86_64-linux-gnu/meson-private/tmpa9307o1r/output.obj -c -Wdate-time -D_FORTIFY_SOURCE=2 -g -O2 -Werror=implicit-function-declaration -ffile-prefix-map=/<<PKGBUILDDIR>>=. -fstack-protector-strong -fstack-clash-protection -Wformat -Werror=format-security -fcf-protection -D_FILE_OFFSET_BITS=64 -O0 -Wnested-externs` -> 0
Compiler for C supports arguments -Wnested-externs: YES 
Running compile:
Working directory:  /<<PKGBUILDDIR>>/obj-x86_64-linux-gnu/meson-private/tmpr5eartfb
Code:
extern int i;
int i;

-----------
Command line: `/usr/bin/x86_64-linux-gnu-gcc /<<PKGBUILDDIR>>/obj-x86_64-linux-gnu/meson-private/tmpr5eartfb/testfile.c -o /<<PKGBUILDDIR>>/obj-x86_64-linux-gnu/meson-private/tmpr5eartfb/output.obj -c -Wdate-time -D_FORTIFY_SOURCE=2 -g -O2 -Werror=implicit-function-declaration -ffile-prefix-map=/<<PKGBUILDDIR>>=. -fstack-protector-strong -fstack-clash-protection -Wformat -Werror=format-security -fcf-protection -D_FILE_OFFSET_BITS=64 -O0 -Wdiscarded-qualifiers -Wno-discarded-qualifiers` -> 0
Compiler for C supports arguments -Wno-discarded-qualifiers: YES 
Running compile:
Working directory:  /<<PKGBUILDDIR>>/obj-x86_64-linux-gnu/meson-private/tmpykmz6zjl
Code:
extern int i;
int i;

-----------
Command line: `/usr/bin/x86_64-linux-gnu-gcc /<<PKGBUILDDIR>>/obj-x86_64-linux-gnu/meson-private/tmpykmz6zjl/testfile.c -o /<<PKGBUILDDIR>>/obj-x86_64-linux-gnu/meson-private/tmpykmz6zjl/output.obj -c -Wdate-time -D_FORTIFY_SOURCE=2 -g -O2 -Werror=implicit-function-declaration -ffile-prefix-map=/<<PKGBUILDDIR>>=. -fstack-protector-strong -fstack-clash-protection -Wformat -Werror=format-security -fcf-protection -D_FILE_OFFSET_BITS=64 -O0 -Wmissing-field-initializers -Wno-missing-field-initializers` -> 0
Compiler for C supports arguments -Wno-missing-field-initializers: YES 
Running compile:
Working directory:  /<<PKGBUILDDIR>>/obj-x86_64-linux-gnu/meson-private/tmpzj6p1_ij
Code:
extern int i;
int i;

-----------
Command line: `/usr/bin/x86_64-linux-gnu-gcc /<<PKGBUILDDIR>>/obj-x86_64-linux-gnu/meson-private/tmpzj6p1_ij/testfile.c -o /<<PKGBUILDDIR>>/obj-x86_64-linux-gnu/meson-private/tmpzj6p1_ij/output.obj -c -Wdate-time -D_FORTIFY_SOURCE=2 -g -O2 -Werror=implicit-function-declaration -ffile-prefix-map=/<<PKGBUILDDIR>>=. -fstack-protector-strong -fstack-clash-protection -Wformat -Werror=format-security -fcf-protection -D_FILE_OFFSET_BITS=64 -O0 -Wstrict-aliasing -Wno-strict-aliasing` -> 0
Compiler for C supports arguments -Wno-strict-aliasing: YES 
Running compile:
Working directory:  /<<PKGBUILDDIR>>/obj-x86_64-linux-gnu/meson-private/tmpf362jwxm
Code:
extern int i;
int i;

-----------
Command line: `/usr/bin/x86_64-linux-gnu-gcc /<<PKGBUILDDIR>>/obj-x86_64-linux-gnu/meson-private/tmpf362jwxm/testfile.c -o /<<PKGBUILDDIR>>/obj-x86_64-linux-gnu/meson-private/tmpf362jwxm/output.obj -c -Wdate-time -D_FORTIFY_SOURCE=2 -g -O2 -Werror=implicit-function-declaration -ffile-prefix-map=/<<PKGBUILDDIR>>=. -fstack-protector-strong -fstack-clash-protection -Wformat -Werror=format-security -fcf-protection -D_FILE_OFFSET_BITS=64 -O0 -Wsuggest-attribute=format -Wno-suggest-attribute=format` -> 0
Compiler for C supports arguments -Wno-suggest-attribute=format: YES 
Running compile:
Working directory:  /<<PKGBUILDDIR>>/obj-x86_64-linux-gnu/meson-private/tmplsu550ln
Code:
extern int i;
int i;

-----------
Command line: `/usr/bin/x86_64-linux-gnu-gcc /<<PKGBUILDDIR>>/obj-x86_64-linux-gnu/meson-private/tmplsu550ln/testfile.c -o /<<PKGBUILDDIR>>/obj-x86_64-linux-gnu/meson-private/tmplsu550ln/output.obj -c -Wdate-time -D_FORTIFY_SOURCE=2 -g -O2 -Werror=implicit-function-declaration -ffile-prefix-map=/<<PKGBUILDDIR>>=. -fstack-protector-strong -fstack-clash-protection -Wformat -Werror=format-security -fcf-protection -D_FILE_OFFSET_BITS=64 -O0 -Wunused-parameter -Wno-unused-parameter` -> 0
Compiler for C supports arguments -Wno-unused-parameter: YES 
Running compile:
Working directory:  /<<PKGBUILDDIR>>/obj-x86_64-linux-gnu/meson-private/tmpb50dua_d
Code:
extern int i;
int i;

-----------
Command line: `/usr/bin/x86_64-linux-gnu-gcc /<<PKGBUILDDIR>>/obj-x86_64-linux-gnu/meson-private/tmpb50dua_d/testfile.c -o /<<PKGBUILDDIR>>/obj-x86_64-linux-gnu/meson-private/tmpb50dua_d/output.obj -c -Wdate-time -D_FORTIFY_SOURCE=2 -g -O2 -Werror=implicit-function-declaration -ffile-prefix-map=/<<PKGBUILDDIR>>=. -fstack-protector-strong -fstack-clash-protection -Wformat -Werror=format-security -fcf-protection -D_FILE_OFFSET_BITS=64 -O0 -Wold-style-definition` -> 0
Compiler for C supports arguments -Wold-style-definition: YES 
Running compile:
Working directory:  /<<PKGBUILDDIR>>/obj-x86_64-linux-gnu/meson-private/tmp3mpbs0hc
Code:
extern int i;
int i;

-----------
Command line: `/usr/bin/x86_64-linux-gnu-gcc /<<PKGBUILDDIR>>/obj-x86_64-linux-gnu/meson-private/tmp3mpbs0hc/testfile.c -o /<<PKGBUILDDIR>>/obj-x86_64-linux-gnu/meson-private/tmp3mpbs0hc/output.obj -c -Wdate-time -D_FORTIFY_SOURCE=2 -g -O2 -Werror=implicit-function-declaration -ffile-prefix-map=/<<PKGBUILDDIR>>=. -fstack-protector-strong -fstack-clash-protection -Wformat -Werror=format-security -fcf-protection -D_FILE_OFFSET_BITS=64 -O0 -Woverride-init` -> 0
Compiler for C supports arguments -Woverride-init: YES 
Running compile:
Working directory:  /<<PKGBUILDDIR>>/obj-x86_64-linux-gnu/meson-private/tmppqxi68xa
Code:
extern int i;
int i;

-----------
Command line: `/usr/bin/x86_64-linux-gnu-gcc /<<PKGBUILDDIR>>/obj-x86_64-linux-gnu/meson-private/tmppqxi68xa/testfile.c -o /<<PKGBUILDDIR>>/obj-x86_64-linux-gnu/meson-private/tmppqxi68xa/output.obj -c -Wdate-time -D_FORTIFY_SOURCE=2 -g -O2 -Werror=implicit-function-declaration -ffile-prefix-map=/<<PKGBUILDDIR>>=. -fstack-protector-strong -fstack-clash-protection -Wformat -Werror=format-security -fcf-protection -D_FILE_OFFSET_BITS=64 -O0 -Wpacked` -> 0
Compiler for C supports arguments -Wpacked: YES 
Running compile:
Working directory:  /<<PKGBUILDDIR>>/obj-x86_64-linux-gnu/meson-private/tmpw3bt84y0
Code:
extern int i;
int i;

-----------
Command line: `/usr/bin/x86_64-linux-gnu-gcc /<<PKGBUILDDIR>>/obj-x86_64-linux-gnu/meson-private/tmpw3bt84y0/testfile.c -o /<<PKGBUILDDIR>>/obj-x86_64-linux-gnu/meson-private/tmpw3bt84y0/output.obj -c -Wdate-time -D_FORTIFY_SOURCE=2 -g -O2 -Werror=implicit-function-declaration -ffile-prefix-map=/<<PKGBUILDDIR>>=. -fstack-protector-strong -fstack-clash-protection -Wformat -Werror=format-security -fcf-protection -D_FILE_OFFSET_BITS=64 -O0 -Wpointer-arith` -> 0
Compiler for C supports arguments -Wpointer-arith: YES 
Running compile:
Working directory:  /<<PKGBUILDDIR>>/obj-x86_64-linux-gnu/meson-private/tmpr_0wcgq8
Code:
extern int i;
int i;

-----------
Command line: `/usr/bin/x86_64-linux-gnu-gcc /<<PKGBUILDDIR>>/obj-x86_64-linux-gnu/meson-private/tmpr_0wcgq8/testfile.c -o /<<PKGBUILDDIR>>/obj-x86_64-linux-gnu/meson-private/tmpr_0wcgq8/output.obj -c -Wdate-time -D_FORTIFY_SOURCE=2 -g -O2 -Werror=implicit-function-declaration -ffile-prefix-map=/<<PKGBUILDDIR>>=. -fstack-protector-strong -fstack-clash-protection -Wformat -Werror=format-security -fcf-protection -D_FILE_OFFSET_BITS=64 -O0 -Wredundant-decls` -> 0
Compiler for C supports arguments -Wredundant-decls: YES 
Running compile:
Working directory:  /<<PKGBUILDDIR>>/obj-x86_64-linux-gnu/meson-private/tmpcgr5kbhe
Code:
extern int i;
int i;

-----------
Command line: `/usr/bin/x86_64-linux-gnu-gcc /<<PKGBUILDDIR>>/obj-x86_64-linux-gnu/meson-private/tmpcgr5kbhe/testfile.c -o /<<PKGBUILDDIR>>/obj-x86_64-linux-gnu/meson-private/tmpcgr5kbhe/output.obj -c -Wdate-time -D_FORTIFY_SOURCE=2 -g -O2 -Werror=implicit-function-declaration -ffile-prefix-map=/<<PKGBUILDDIR>>=. -fstack-protector-strong -fstack-clash-protection -Wformat -Werror=format-security -fcf-protection -D_FILE_OFFSET_BITS=64 -O0 -Wreturn-type` -> 0
Compiler for C supports arguments -Wreturn-type: YES 
Running compile:
Working directory:  /<<PKGBUILDDIR>>/obj-x86_64-linux-gnu/meson-private/tmpal9m1sn9
Code:
extern int i;
int i;

-----------
Command line: `/usr/bin/x86_64-linux-gnu-gcc /<<PKGBUILDDIR>>/obj-x86_64-linux-gnu/meson-private/tmpal9m1sn9/testfile.c -o /<<PKGBUILDDIR>>/obj-x86_64-linux-gnu/meson-private/tmpal9m1sn9/output.obj -c -Wdate-time -D_FORTIFY_SOURCE=2 -g -O2 -Werror=implicit-function-declaration -ffile-prefix-map=/<<PKGBUILDDIR>>=. -fstack-protector-strong -fstack-clash-protection -Wformat -Werror=format-security -fcf-protection -D_FILE_OFFSET_BITS=64 -O0 -Wshadow` -> 0
Compiler for C supports arguments -Wshadow: YES 
Running compile:
Working directory:  /<<PKGBUILDDIR>>/obj-x86_64-linux-gnu/meson-private/tmpl6mapgr8
Code:
extern int i;
int i;

-----------
Command line: `/usr/bin/x86_64-linux-gnu-gcc /<<PKGBUILDDIR>>/obj-x86_64-linux-gnu/meson-private/tmpl6mapgr8/testfile.c -o /<<PKGBUILDDIR>>/obj-x86_64-linux-gnu/meson-private/tmpl6mapgr8/output.obj -c -Wdate-time -D_FORTIFY_SOURCE=2 -g -O2 -Werror=implicit-function-declaration -ffile-prefix-map=/<<PKGBUILDDIR>>=. -fstack-protector-strong -fstack-clash-protection -Wformat -Werror=format-security -fcf-protection -D_FILE_OFFSET_BITS=64 -O0 -Wsign-compare` -> 0
Compiler for C supports arguments -Wsign-compare: YES 
Running compile:
Working directory:  /<<PKGBUILDDIR>>/obj-x86_64-linux-gnu/meson-private/tmpip43ncus
Code:
extern int i;
int i;

-----------
Command line: `/usr/bin/x86_64-linux-gnu-gcc /<<PKGBUILDDIR>>/obj-x86_64-linux-gnu/meson-private/tmpip43ncus/testfile.c -o /<<PKGBUILDDIR>>/obj-x86_64-linux-gnu/meson-private/tmpip43ncus/output.obj -c -Wdate-time -D_FORTIFY_SOURCE=2 -g -O2 -Werror=implicit-function-declaration -ffile-prefix-map=/<<PKGBUILDDIR>>=. -fstack-protector-strong -fstack-clash-protection -Wformat -Werror=format-security -fcf-protection -D_FILE_OFFSET_BITS=64 -O0 -Wstrict-aliasing` -> 0
Compiler for C supports arguments -Wstrict-aliasing: YES 
Running compile:
Working directory:  /<<PKGBUILDDIR>>/obj-x86_64-linux-gnu/meson-private/tmpvogymgwc
Code:
extern int i;
int i;

-----------
Command line: `/usr/bin/x86_64-linux-gnu-gcc /<<PKGBUILDDIR>>/obj-x86_64-linux-gnu/meson-private/tmpvogymgwc/testfile.c -o /<<PKGBUILDDIR>>/obj-x86_64-linux-gnu/meson-private/tmpvogymgwc/output.obj -c -Wdate-time -D_FORTIFY_SOURCE=2 -g -O2 -Werror=implicit-function-declaration -ffile-prefix-map=/<<PKGBUILDDIR>>=. -fstack-protector-strong -fstack-clash-protection -Wformat -Werror=format-security -fcf-protection -D_FILE_OFFSET_BITS=64 -O0 -Wstrict-prototypes` -> 0
Compiler for C supports arguments -Wstrict-prototypes: YES 
Running compile:
Working directory:  /<<PKGBUILDDIR>>/obj-x86_64-linux-gnu/meson-private/tmpy80axn_v
Code:
extern int i;
int i;

-----------
Command line: `/usr/bin/x86_64-linux-gnu-gcc /<<PKGBUILDDIR>>/obj-x86_64-linux-gnu/meson-private/tmpy80axn_v/testfile.c -o /<<PKGBUILDDIR>>/obj-x86_64-linux-gnu/meson-private/tmpy80axn_v/output.obj -c -Wdate-time -D_FORTIFY_SOURCE=2 -g -O2 -Werror=implicit-function-declaration -ffile-prefix-map=/<<PKGBUILDDIR>>=. -fstack-protector-strong -fstack-clash-protection -Wformat -Werror=format-security -fcf-protection -D_FILE_OFFSET_BITS=64 -O0 -Wswitch-default` -> 0
Compiler for C supports arguments -Wswitch-default: YES 
Running compile:
Working directory:  /<<PKGBUILDDIR>>/obj-x86_64-linux-gnu/meson-private/tmp6isz52_7
Code:
extern int i;
int i;

-----------
Command line: `/usr/bin/x86_64-linux-gnu-gcc /<<PKGBUILDDIR>>/obj-x86_64-linux-gnu/meson-private/tmp6isz52_7/testfile.c -o /<<PKGBUILDDIR>>/obj-x86_64-linux-gnu/meson-private/tmp6isz52_7/output.obj -c -Wdate-time -D_FORTIFY_SOURCE=2 -g -O2 -Werror=implicit-function-declaration -ffile-prefix-map=/<<PKGBUILDDIR>>=. -fstack-protector-strong -fstack-clash-protection -Wformat -Werror=format-security -fcf-protection -D_FILE_OFFSET_BITS=64 -O0 -Wtype-limits` -> 0
Compiler for C supports arguments -Wtype-limits: YES 
Running compile:
Working directory:  /<<PKGBUILDDIR>>/obj-x86_64-linux-gnu/meson-private/tmpevxd4_hs
Code:
extern int i;
int i;

-----------
Command line: `/usr/bin/x86_64-linux-gnu-gcc /<<PKGBUILDDIR>>/obj-x86_64-linux-gnu/meson-private/tmpevxd4_hs/testfile.c -o /<<PKGBUILDDIR>>/obj-x86_64-linux-gnu/meson-private/tmpevxd4_hs/output.obj -c -Wdate-time -D_FORTIFY_SOURCE=2 -g -O2 -Werror=implicit-function-declaration -ffile-prefix-map=/<<PKGBUILDDIR>>=. -fstack-protector-strong -fstack-clash-protection -Wformat -Werror=format-security -fcf-protection -D_FILE_OFFSET_BITS=64 -O0 -Wundef` -> 0
Compiler for C supports arguments -Wundef: YES 
Running compile:
Working directory:  /<<PKGBUILDDIR>>/obj-x86_64-linux-gnu/meson-private/tmprxocfxd4
Code:
extern int i;
int i;

-----------
Command line: `/usr/bin/x86_64-linux-gnu-gcc /<<PKGBUILDDIR>>/obj-x86_64-linux-gnu/meson-private/tmprxocfxd4/testfile.c -o /<<PKGBUILDDIR>>/obj-x86_64-linux-gnu/meson-private/tmprxocfxd4/output.obj -c -Wdate-time -D_FORTIFY_SOURCE=2 -g -O2 -Werror=implicit-function-declaration -ffile-prefix-map=/<<PKGBUILDDIR>>=. -fstack-protector-strong -fstack-clash-protection -Wformat -Werror=format-security -fcf-protection -D_FILE_OFFSET_BITS=64 -O0 -Wuninitialized` -> 0
Compiler for C supports arguments -Wuninitialized: YES 
Running compile:
Working directory:  /<<PKGBUILDDIR>>/obj-x86_64-linux-gnu/meson-private/tmp4qfbsngb
Code:
extern int i;
int i;

-----------
Command line: `/usr/bin/x86_64-linux-gnu-gcc /<<PKGBUILDDIR>>/obj-x86_64-linux-gnu/meson-private/tmp4qfbsngb/testfile.c -o /<<PKGBUILDDIR>>/obj-x86_64-linux-gnu/meson-private/tmp4qfbsngb/output.obj -c -Wdate-time -D_FORTIFY_SOURCE=2 -g -O2 -Werror=implicit-function-declaration -ffile-prefix-map=/<<PKGBUILDDIR>>=. -fstack-protector-strong -fstack-clash-protection -Wformat -Werror=format-security -fcf-protection -D_FILE_OFFSET_BITS=64 -O0 -Wunused-but-set-variable` -> 0
Compiler for C supports arguments -Wunused-but-set-variable: YES 
Running compile:
Working directory:  /<<PKGBUILDDIR>>/obj-x86_64-linux-gnu/meson-private/tmpgtriewia
Code:
extern int i;
int i;

-----------
Command line: `/usr/bin/x86_64-linux-gnu-gcc /<<PKGBUILDDIR>>/obj-x86_64-linux-gnu/meson-private/tmpgtriewia/testfile.c -o /<<PKGBUILDDIR>>/obj-x86_64-linux-gnu/meson-private/tmpgtriewia/output.obj -c -Wdate-time -D_FORTIFY_SOURCE=2 -g -O2 -Werror=implicit-function-declaration -ffile-prefix-map=/<<PKGBUILDDIR>>=. -fstack-protector-strong -fstack-clash-protection -Wformat -Werror=format-security -fcf-protection -D_FILE_OFFSET_BITS=64 -O0 -Wwrite-strings` -> 0
Compiler for C supports arguments -Wwrite-strings: YES 
Running compile:
Working directory:  /<<PKGBUILDDIR>>/obj-x86_64-linux-gnu/meson-private/tmp7zftexfo
Code:
extern int i;
int i;

-----------
Command line: `/usr/bin/x86_64-linux-gnu-gcc /<<PKGBUILDDIR>>/obj-x86_64-linux-gnu/meson-private/tmp7zftexfo/testfile.c -o /<<PKGBUILDDIR>>/obj-x86_64-linux-gnu/meson-private/tmp7zftexfo/output.obj -c -Wdate-time -D_FORTIFY_SOURCE=2 -g -O2 -Werror=implicit-function-declaration -ffile-prefix-map=/<<PKGBUILDDIR>>=. -fstack-protector-strong -fstack-clash-protection -Wformat -Werror=format-security -fcf-protection -D_FILE_OFFSET_BITS=64 -O0 -fstack-protector-strong` -> 0
Compiler for C supports arguments -fstack-protector-strong: YES 
Running compile:
Working directory:  /<<PKGBUILDDIR>>/obj-x86_64-linux-gnu/meson-private/tmpu7l6qzen
Code:
int main(void) { return 0; }

-----------
Command line: `/usr/bin/x86_64-linux-gnu-gcc /<<PKGBUILDDIR>>/obj-x86_64-linux-gnu/meson-private/tmpu7l6qzen/testfile.c -o /<<PKGBUILDDIR>>/obj-x86_64-linux-gnu/meson-private/tmpu7l6qzen/output.exe -Wdate-time -D_FORTIFY_SOURCE=2 -g -O2 -Werror=implicit-function-declaration -ffile-prefix-map=/<<PKGBUILDDIR>>=. -fstack-protector-strong -fstack-clash-protection -Wformat -Werror=format-security -fcf-protection -D_FILE_OFFSET_BITS=64 -O0 -Wl,--fatal-warnings -Wl,-z,relro -Wl,-z,relro -Wl,-z,now` -> 0
Compiler for C supports link arguments -Wl,-z,relro: YES 
Running compile:
Working directory:  /<<PKGBUILDDIR>>/obj-x86_64-linux-gnu/meson-private/tmpcv6ui0qs
Code:
int main(void) { return 0; }

-----------
Command line: `/usr/bin/x86_64-linux-gnu-gcc /<<PKGBUILDDIR>>/obj-x86_64-linux-gnu/meson-private/tmpcv6ui0qs/testfile.c -o /<<PKGBUILDDIR>>/obj-x86_64-linux-gnu/meson-private/tmpcv6ui0qs/output.exe -Wdate-time -D_FORTIFY_SOURCE=2 -g -O2 -Werror=implicit-function-declaration -ffile-prefix-map=/<<PKGBUILDDIR>>=. -fstack-protector-strong -fstack-clash-protection -Wformat -Werror=format-security -fcf-protection -D_FILE_OFFSET_BITS=64 -O0 -Wl,--fatal-warnings -Wl,-z,now -Wl,-z,relro -Wl,-z,now` -> 0
Compiler for C supports link arguments -Wl,-z,now: YES 
Pkg-config binary for host machine specified from cross file, native file, or env var as ['/usr/bin/x86_64-linux-gnu-pkg-config']
Found pkg-config: YES (/usr/bin/x86_64-linux-gnu-pkg-config) 1.8.1
Determining dependency 'gio-2.0' with pkg-config executable '/usr/bin/x86_64-linux-gnu-pkg-config'
env[PKG_CONFIG_PATH]: 
env[PKG_CONFIG]: /usr/bin/x86_64-linux-gnu-pkg-config
-----------
Called: `/usr/bin/x86_64-linux-gnu-pkg-config --modversion gio-2.0` -> 0
stdout:
2.84.0
-----------
env[PKG_CONFIG_PATH]: 
env[PKG_CONFIG]: /usr/bin/x86_64-linux-gnu-pkg-config
-----------
Called: `/usr/bin/x86_64-linux-gnu-pkg-config --cflags gio-2.0` -> 0
stdout:
-I/usr/include/glib-2.0 -I/usr/lib/x86_64-linux-gnu/glib-2.0/include -I/usr/include/sysprof-6 -I/usr/include/libmount -I/usr/include/blkid -pthread
-----------
env[PKG_CONFIG_ALLOW_SYSTEM_LIBS]: 1
env[PKG_CONFIG_PATH]: 
env[PKG_CONFIG]: /usr/bin/x86_64-linux-gnu-pkg-config
-----------
Called: `/usr/bin/x86_64-linux-gnu-pkg-config --libs gio-2.0` -> 0
stdout:
-L/usr/lib/x86_64-linux-gnu -lgio-2.0 -lgobject-2.0 -lglib-2.0
-----------
env[PKG_CONFIG_PATH]: 
env[PKG_CONFIG]: /usr/bin/x86_64-linux-gnu-pkg-config
-----------
Called: `/usr/bin/x86_64-linux-gnu-pkg-config --libs gio-2.0` -> 0
stdout:
-lgio-2.0 -lgobject-2.0 -lglib-2.0
-----------
Running compile:
Working directory:  /<<PKGBUILDDIR>>/obj-x86_64-linux-gnu/meson-private/tmp_zthc0vr
Code:

        #include <stddef.h>
        int main(void) {
            void * something;
            return 0;
        }
-----------
Command line: `/usr/bin/x86_64-linux-gnu-gcc /<<PKGBUILDDIR>>/obj-x86_64-linux-gnu/meson-private/tmp_zthc0vr/testfile.c -o /<<PKGBUILDDIR>>/obj-x86_64-linux-gnu/meson-private/tmp_zthc0vr/output.obj -c -Wdate-time -D_FORTIFY_SOURCE=2 -g -O2 -Werror=implicit-function-declaration -ffile-prefix-map=/<<PKGBUILDDIR>>=. -fstack-protector-strong -fstack-clash-protection -Wformat -Werror=format-security -fcf-protection -D_FILE_OFFSET_BITS=64 -O0` -> 0
Running compile:
Working directory:  /tmp/tmpfi_67guv
Code:

        
        #ifndef sizeof(void *)
        # define sizeof(void *) "MESON_GET_DEFINE_UNDEFINED_SENTINEL"
        #endif
        "MESON_GET_DEFINE_DELIMITER_START"
sizeof(void *)
"MESON_GET_DEFINE_DELIMITER_END"
-----------
Command line: `/usr/bin/x86_64-linux-gnu-gcc /tmp/tmpfi_67guv/testfile.c -E -P -Wdate-time -D_FORTIFY_SOURCE=2 -g -O2 -Werror=implicit-function-declaration -ffile-prefix-map=/<<PKGBUILDDIR>>=. -fstack-protector-strong -fstack-clash-protection -Wformat -Werror=format-security -fcf-protection -D_FILE_OFFSET_BITS=64 -P -O0` -> 1
stdout:
"MESON_GET_DEFINE_DELIMITER_START"
sizeof(void *)
"MESON_GET_DEFINE_DELIMITER_END"
-----------
stderr:
/tmp/tmpfi_67guv/testfile.c:3:23: warning: extra tokens at end of #ifndef directive
    3 |         #ifndef sizeof(void *)
      |                       ^
/tmp/tmpfi_67guv/testfile.c:4:30: error: expected ',' or ')', found "*"
    4 |         # define sizeof(void *) "MESON_GET_DEFINE_UNDEFINED_SENTINEL"
      |                              ^
-----------
Running compile:
Working directory:  /<<PKGBUILDDIR>>/obj-x86_64-linux-gnu/meson-private/tmpl1iuo5i7
Code:

        #include <stddef.h>
        int main(void) { static int a[1-2*!(sizeof(void *) >= 0)]; a[0]=0; return 0; }
-----------
Command line: `/usr/bin/x86_64-linux-gnu-gcc /<<PKGBUILDDIR>>/obj-x86_64-linux-gnu/meson-private/tmpl1iuo5i7/testfile.c -o /<<PKGBUILDDIR>>/obj-x86_64-linux-gnu/meson-private/tmpl1iuo5i7/output.obj -c -Wdate-time -D_FORTIFY_SOURCE=2 -g -O2 -Werror=implicit-function-declaration -ffile-prefix-map=/<<PKGBUILDDIR>>=. -fstack-protector-strong -fstack-clash-protection -Wformat -Werror=format-security -fcf-protection -D_FILE_OFFSET_BITS=64 -O0` -> 0
Running compile:
Working directory:  /<<PKGBUILDDIR>>/obj-x86_64-linux-gnu/meson-private/tmp4auph7jb
Code:

        #include <stddef.h>
        int main(void) { static int a[1-2*!(sizeof(void *) > 0)]; a[0]=0; return 0; }
-----------
Command line: `/usr/bin/x86_64-linux-gnu-gcc /<<PKGBUILDDIR>>/obj-x86_64-linux-gnu/meson-private/tmp4auph7jb/testfile.c -o /<<PKGBUILDDIR>>/obj-x86_64-linux-gnu/meson-private/tmp4auph7jb/output.obj -c -Wdate-time -D_FORTIFY_SOURCE=2 -g -O2 -Werror=implicit-function-declaration -ffile-prefix-map=/<<PKGBUILDDIR>>=. -fstack-protector-strong -fstack-clash-protection -Wformat -Werror=format-security -fcf-protection -D_FILE_OFFSET_BITS=64 -O0` -> 0
Running compile:
Working directory:  /<<PKGBUILDDIR>>/obj-x86_64-linux-gnu/meson-private/tmpqmjpewft
Code:

        #include <stddef.h>
        int main(void) { static int a[1-2*!(sizeof(void *) > 1)]; a[0]=0; return 0; }
-----------
Command line: `/usr/bin/x86_64-linux-gnu-gcc /<<PKGBUILDDIR>>/obj-x86_64-linux-gnu/meson-private/tmpqmjpewft/testfile.c -o /<<PKGBUILDDIR>>/obj-x86_64-linux-gnu/meson-private/tmpqmjpewft/output.obj -c -Wdate-time -D_FORTIFY_SOURCE=2 -g -O2 -Werror=implicit-function-declaration -ffile-prefix-map=/<<PKGBUILDDIR>>=. -fstack-protector-strong -fstack-clash-protection -Wformat -Werror=format-security -fcf-protection -D_FILE_OFFSET_BITS=64 -O0` -> 0
Running compile:
Working directory:  /<<PKGBUILDDIR>>/obj-x86_64-linux-gnu/meson-private/tmp4nff0gxj
Code:

        #include <stddef.h>
        int main(void) { static int a[1-2*!(sizeof(void *) > 3)]; a[0]=0; return 0; }
-----------
Command line: `/usr/bin/x86_64-linux-gnu-gcc /<<PKGBUILDDIR>>/obj-x86_64-linux-gnu/meson-private/tmp4nff0gxj/testfile.c -o /<<PKGBUILDDIR>>/obj-x86_64-linux-gnu/meson-private/tmp4nff0gxj/output.obj -c -Wdate-time -D_FORTIFY_SOURCE=2 -g -O2 -Werror=implicit-function-declaration -ffile-prefix-map=/<<PKGBUILDDIR>>=. -fstack-protector-strong -fstack-clash-protection -Wformat -Werror=format-security -fcf-protection -D_FILE_OFFSET_BITS=64 -O0` -> 0
Running compile:
Working directory:  /<<PKGBUILDDIR>>/obj-x86_64-linux-gnu/meson-private/tmpmrq0q6zr
Code:

        #include <stddef.h>
        int main(void) { static int a[1-2*!(sizeof(void *) > 7)]; a[0]=0; return 0; }
-----------
Command line: `/usr/bin/x86_64-linux-gnu-gcc /<<PKGBUILDDIR>>/obj-x86_64-linux-gnu/meson-private/tmpmrq0q6zr/testfile.c -o /<<PKGBUILDDIR>>/obj-x86_64-linux-gnu/meson-private/tmpmrq0q6zr/output.obj -c -Wdate-time -D_FORTIFY_SOURCE=2 -g -O2 -Werror=implicit-function-declaration -ffile-prefix-map=/<<PKGBUILDDIR>>=. -fstack-protector-strong -fstack-clash-protection -Wformat -Werror=format-security -fcf-protection -D_FILE_OFFSET_BITS=64 -O0` -> 0
Running compile:
Working directory:  /<<PKGBUILDDIR>>/obj-x86_64-linux-gnu/meson-private/tmp59zy1pv0
Code:

        #include <stddef.h>
        int main(void) { static int a[1-2*!(sizeof(void *) > 15)]; a[0]=0; return 0; }
-----------
Command line: `/usr/bin/x86_64-linux-gnu-gcc /<<PKGBUILDDIR>>/obj-x86_64-linux-gnu/meson-private/tmp59zy1pv0/testfile.c -o /<<PKGBUILDDIR>>/obj-x86_64-linux-gnu/meson-private/tmp59zy1pv0/output.obj -c -Wdate-time -D_FORTIFY_SOURCE=2 -g -O2 -Werror=implicit-function-declaration -ffile-prefix-map=/<<PKGBUILDDIR>>=. -fstack-protector-strong -fstack-clash-protection -Wformat -Werror=format-security -fcf-protection -D_FILE_OFFSET_BITS=64 -O0` -> 1
stderr:
/<<PKGBUILDDIR>>/obj-x86_64-linux-gnu/meson-private/tmp59zy1pv0/testfile.c: In function 'main':
/<<PKGBUILDDIR>>/obj-x86_64-linux-gnu/meson-private/tmp59zy1pv0/testfile.c:3:37: error: size of array 'a' is negative
    3 |         int main(void) { static int a[1-2*!(sizeof(void *) > 15)]; a[0]=0; return 0; }
      |                                     ^
-----------
Running compile:
Working directory:  /<<PKGBUILDDIR>>/obj-x86_64-linux-gnu/meson-private/tmpme0tvqhe
Code:

        #include <stddef.h>
        int main(void) { static int a[1-2*!(sizeof(void *) <= 11)]; a[0]=0; return 0; }
-----------
Command line: `/usr/bin/x86_64-linux-gnu-gcc /<<PKGBUILDDIR>>/obj-x86_64-linux-gnu/meson-private/tmpme0tvqhe/testfile.c -o /<<PKGBUILDDIR>>/obj-x86_64-linux-gnu/meson-private/tmpme0tvqhe/output.obj -c -Wdate-time -D_FORTIFY_SOURCE=2 -g -O2 -Werror=implicit-function-declaration -ffile-prefix-map=/<<PKGBUILDDIR>>=. -fstack-protector-strong -fstack-clash-protection -Wformat -Werror=format-security -fcf-protection -D_FILE_OFFSET_BITS=64 -O0` -> 0
Running compile:
Working directory:  /<<PKGBUILDDIR>>/obj-x86_64-linux-gnu/meson-private/tmpqe8zwu86
Code:

        #include <stddef.h>
        int main(void) { static int a[1-2*!(sizeof(void *) <= 9)]; a[0]=0; return 0; }
-----------
Command line: `/usr/bin/x86_64-linux-gnu-gcc /<<PKGBUILDDIR>>/obj-x86_64-linux-gnu/meson-private/tmpqe8zwu86/testfile.c -o /<<PKGBUILDDIR>>/obj-x86_64-linux-gnu/meson-private/tmpqe8zwu86/output.obj -c -Wdate-time -D_FORTIFY_SOURCE=2 -g -O2 -Werror=implicit-function-declaration -ffile-prefix-map=/<<PKGBUILDDIR>>=. -fstack-protector-strong -fstack-clash-protection -Wformat -Werror=format-security -fcf-protection -D_FILE_OFFSET_BITS=64 -O0` -> 0
Running compile:
Working directory:  /<<PKGBUILDDIR>>/obj-x86_64-linux-gnu/meson-private/tmp72gn4_a2
Code:

        #include <stddef.h>
        int main(void) { static int a[1-2*!(sizeof(void *) <= 8)]; a[0]=0; return 0; }
-----------
Command line: `/usr/bin/x86_64-linux-gnu-gcc /<<PKGBUILDDIR>>/obj-x86_64-linux-gnu/meson-private/tmp72gn4_a2/testfile.c -o /<<PKGBUILDDIR>>/obj-x86_64-linux-gnu/meson-private/tmp72gn4_a2/output.obj -c -Wdate-time -D_FORTIFY_SOURCE=2 -g -O2 -Werror=implicit-function-declaration -ffile-prefix-map=/<<PKGBUILDDIR>>=. -fstack-protector-strong -fstack-clash-protection -Wformat -Werror=format-security -fcf-protection -D_FILE_OFFSET_BITS=64 -O0` -> 0
Running compile:
Working directory:  /<<PKGBUILDDIR>>/obj-x86_64-linux-gnu/meson-private/tmpc8y_kjd7
Code:

-----------
Command line: `/usr/bin/x86_64-linux-gnu-gcc /<<PKGBUILDDIR>>/obj-x86_64-linux-gnu/meson-private/tmpc8y_kjd7/testfile.c -o /<<PKGBUILDDIR>>/obj-x86_64-linux-gnu/meson-private/tmpc8y_kjd7/output.obj -c -Wdate-time -D_FORTIFY_SOURCE=2 -g -O2 -Werror=implicit-function-declaration -ffile-prefix-map=/<<PKGBUILDDIR>>=. -fstack-protector-strong -fstack-clash-protection -Wformat -Werror=format-security -fcf-protection -D_FILE_OFFSET_BITS=64 -O0 --print-search-dirs` -> 0
stdout:
install: /usr/lib/gcc-cross/x86_64-linux-gnu/14/
programs: =/usr/libexec/gcc-cross/x86_64-linux-gnu/14/:/usr/libexec/gcc-cross/x86_64-linux-gnu/14/:/usr/libexec/gcc-cross/x86_64-linux-gnu/:/usr/lib/gcc-cross/x86_64-linux-gnu/14/:/usr/lib/gcc-cross/x86_64-linux-gnu/:/usr/lib/gcc-cross/x86_64-linux-gnu/14/../../../../x86_64-linux-gnu/bin/x86_64-linux-gnu/14/:/usr/lib/gcc-cross/x86_64-linux-gnu/14/../../../../x86_64-linux-gnu/bin/x86_64-linux-gnu/:/usr/lib/gcc-cross/x86_64-linux-gnu/14/../../../../x86_64-linux-gnu/bin/
libraries: =/usr/lib/gcc-cross/x86_64-linux-gnu/14/:/usr/lib/gcc-cross/x86_64-linux-gnu/14/../../../../x86_64-linux-gnu/lib/x86_64-linux-gnu/14/:/usr/lib/gcc-cross/x86_64-linux-gnu/14/../../../../x86_64-linux-gnu/lib/x86_64-linux-gnu/:/usr/lib/gcc-cross/x86_64-linux-gnu/14/../../../../x86_64-linux-gnu/lib/../lib/:/lib/x86_64-linux-gnu/14/:/lib/x86_64-linux-gnu/:/lib/../lib/:/usr/lib/x86_64-linux-gnu/14/:/usr/lib/x86_64-linux-gnu/:/usr/lib/../lib/:/usr/lib/gcc-cross/x86_64-linux-gnu/14/../../../../x86_64-linux-gnu/lib/:/lib/:/usr/lib/
-----------
Run-time dependency gio-2.0 found: YES 2.84.0
Message: linux
Determining dependency 'gio-unix-2.0' with pkg-config executable '/usr/bin/x86_64-linux-gnu-pkg-config'
env[PKG_CONFIG_PATH]: 
env[PKG_CONFIG]: /usr/bin/x86_64-linux-gnu-pkg-config
-----------
Called: `/usr/bin/x86_64-linux-gnu-pkg-config --modversion gio-unix-2.0` -> 0
stdout:
2.84.0
-----------
env[PKG_CONFIG_PATH]: 
env[PKG_CONFIG]: /usr/bin/x86_64-linux-gnu-pkg-config
-----------
Called: `/usr/bin/x86_64-linux-gnu-pkg-config --cflags gio-unix-2.0` -> 0
stdout:
-I/usr/include/gio-unix-2.0 -I/usr/include/glib-2.0 -I/usr/lib/x86_64-linux-gnu/glib-2.0/include -I/usr/include/sysprof-6 -I/usr/include/libmount -I/usr/include/blkid -pthread
-----------
env[PKG_CONFIG_ALLOW_SYSTEM_LIBS]: 1
env[PKG_CONFIG_PATH]: 
env[PKG_CONFIG]: /usr/bin/x86_64-linux-gnu-pkg-config
-----------
Called: `/usr/bin/x86_64-linux-gnu-pkg-config --libs gio-unix-2.0` -> 0
stdout:
-L/usr/lib/x86_64-linux-gnu -lgio-2.0 -lgobject-2.0 -lglib-2.0
-----------
env[PKG_CONFIG_PATH]: 
env[PKG_CONFIG]: /usr/bin/x86_64-linux-gnu-pkg-config
-----------
Called: `/usr/bin/x86_64-linux-gnu-pkg-config --libs gio-unix-2.0` -> 0
stdout:
-lgio-2.0 -lgobject-2.0 -lglib-2.0
-----------
Run-time dependency gio-unix-2.0 found: YES 2.84.0
Configuring config.h using configuration
Program msgfmt found: YES (/usr/bin/msgfmt)
Program msginit found: YES (/usr/bin/msginit)
Program msgmerge found: YES (/usr/bin/msgmerge)
Program xgettext found: YES (/usr/bin/xgettext)
Configuring lunar-date-version.h using configuration
Pkg-config binary missing from cross or native file, or env var undefined.
Trying a default Pkg-config fallback at pkg-config
Found pkg-config: YES (/usr/bin/pkg-config) 1.8.1
Determining dependency 'glib-2.0' with pkg-config executable '/usr/bin/pkg-config'
env[PKG_CONFIG_PATH]: 
env[PKG_CONFIG]: /usr/bin/pkg-config
-----------
Called: `/usr/bin/pkg-config --modversion glib-2.0` -> 1
stderr:
Package glib-2.0 was not found in the pkg-config search path.
Perhaps you should add the directory containing `glib-2.0.pc'
to the PKG_CONFIG_PATH environment variable
Package 'glib-2.0', required by 'virtual:world', not found
-----------
CMake binary for build machine is not cached
CMake binary missing from cross or native file, or env var undefined.
Trying a default CMake fallback at cmake
Did not find CMake 'cmake'
Found CMake: NO
CMake binary for machine build machine not found. Giving up.
Build-time dependency glib-2.0 found: NO (tried pkgconfig and cmake)
Program glib-mkenums found: YES (/usr/bin/glib-mkenums)
CMake binary for build machine is cached as not found
CMake binary for machine build machine not found. Giving up.
Build-time dependency glib-2.0 found: NO (tried pkgconfig and cmake)
Program glib-mkenums found: YES (/usr/bin/glib-mkenums)
WARNING: Could not detect glib version, assuming 2.54. You may get build errors if your glib is older.
Determining dependency 'gio-2.0' with pkg-config executable '/usr/bin/pkg-config'
env[PKG_CONFIG_PATH]: 
env[PKG_CONFIG]: /usr/bin/pkg-config
-----------
Called: `/usr/bin/pkg-config --modversion gio-2.0` -> 1
stderr:
Package gio-2.0 was not found in the pkg-config search path.
Perhaps you should add the directory containing `gio-2.0.pc'
to the PKG_CONFIG_PATH environment variable
Package 'gio-2.0', required by 'virtual:world', not found
-----------
CMake binary for build machine is cached as not found
CMake binary for machine build machine not found. Giving up.
Build-time dependency gio-2.0 found: NO (tried pkgconfig and cmake)
Program glib-compile-resources found: YES (/usr/bin/glib-compile-resources)
Determining dependency 'gobject-introspection-1.0' with pkg-config executable '/usr/bin/x86_64-linux-gnu-pkg-config'
env[PKG_CONFIG_PATH]: 
env[PKG_CONFIG]: /usr/bin/x86_64-linux-gnu-pkg-config
-----------
Called: `/usr/bin/x86_64-linux-gnu-pkg-config --modversion gobject-introspection-1.0` -> 0
stdout:
1.83.4
-----------
env[PKG_CONFIG_PATH]: 
env[PKG_CONFIG]: /usr/bin/x86_64-linux-gnu-pkg-config
-----------
Called: `/usr/bin/x86_64-linux-gnu-pkg-config --cflags gobject-introspection-1.0` -> 0
stdout:
-I/usr/include/gobject-introspection-1.0 -I/usr/include/glib-2.0 -I/usr/lib/x86_64-linux-gnu/glib-2.0/include -I/usr/include/sysprof-6 -pthread
-----------
env[PKG_CONFIG_ALLOW_SYSTEM_LIBS]: 1
env[PKG_CONFIG_PATH]: 
env[PKG_CONFIG]: /usr/bin/x86_64-linux-gnu-pkg-config
-----------
Called: `/usr/bin/x86_64-linux-gnu-pkg-config --libs gobject-introspection-1.0` -> 0
stdout:
-L/usr/lib/x86_64-linux-gnu -lgirepository-1.0 -lgobject-2.0 -lglib-2.0
-----------
env[PKG_CONFIG_PATH]: 
env[PKG_CONFIG]: /usr/bin/x86_64-linux-gnu-pkg-config
-----------
Called: `/usr/bin/x86_64-linux-gnu-pkg-config --libs gobject-introspection-1.0` -> 0
stdout:
-lgirepository-1.0 -lgobject-2.0 -lglib-2.0
-----------
Run-time dependency gobject-introspection-1.0 found: YES 1.83.4
Determining dependency 'gobject-introspection-1.0' with pkg-config executable '/usr/bin/pkg-config'
env[PKG_CONFIG_PATH]: 
env[PKG_CONFIG]: /usr/bin/pkg-config
-----------
Called: `/usr/bin/pkg-config --modversion gobject-introspection-1.0` -> 1
stderr:
Package gobject-introspection-1.0 was not found in the pkg-config search path.
Perhaps you should add the directory containing `gobject-introspection-1.0.pc'
to the PKG_CONFIG_PATH environment variable
Package 'gobject-introspection-1.0', required by 'virtual:world', not found
-----------
CMake binary for build machine is cached as not found
CMake binary for machine build machine not found. Giving up.
Build-time dependency gobject-introspection-1.0 found: NO (tried pkgconfig and cmake)
Program g-ir-scanner found: YES (/usr/bin/g-ir-scanner)
CMake binary for build machine is cached as not found
CMake binary for machine build machine not found. Giving up.
Build-time dependency gobject-introspection-1.0 found: NO (tried pkgconfig and cmake)
Program g-ir-compiler found: NO

../lunar-date/meson.build:61:28: ERROR: Program 'g-ir-compiler' not found or not executable
dh_auto_configure: error: cd obj-x86_64-linux-gnu && DEB_PYTHON_INSTALL_LAYOUT=deb LC_ALL=C.UTF-8 meson setup .. --wrap-mode=nodownload --buildtype=plain --prefix=/usr --sysconfdir=/etc --localstatedir=/var --libdir=lib/x86_64-linux-gnu -Dpython.bytecompile=-1 --cross-file /<<PKGBUILDDIR>>/debian/.debhelper/generated/_source/meson-cross-file.conf -Ddocs=true -Dintrospection=true -Dvapi=true -Dtests=true returned exit code 1
make[1]: *** [debian/rules:10: override_dh_auto_configure] Error 25
make[1]: Leaving directory '/<<PKGBUILDDIR>>'
make: *** [debian/rules:7: binary-arch] Error 2
dpkg-buildpackage: error: debian/rules binary-arch subprocess returned exit status 2
--------------------------------------------------------------------------------
Build finished at 2025-03-11T11:36:52Z

+------------------------------------------------------------------------------+
| Finished Timed Build Commands                                                |
+------------------------------------------------------------------------------+


rm -Rf /<<PKGBUILDDIR>>/
-------------------------------------------------


I: Finished running 'rm -Rf /<<PKGBUILDDIR>>/'.

Finished processing commands.
--------------------------------------------------------------------------------

Finished
--------


+------------------------------------------------------------------------------+
| Cleanup                                                                      |
+------------------------------------------------------------------------------+

Purging /<<BUILDDIR>>
Not cleaning session: cloned chroot in use
E: Build failure (dpkg-buildpackage died)

+------------------------------------------------------------------------------+
| Summary                                                                      |
+------------------------------------------------------------------------------+

Build Architecture: arm64
Build Profiles: cross nocheck
Build Type: any
Build-Space: n/a
Build-Time: 10
Distribution: unstable
Fail-Stage: build
Foreign Architectures: amd64
Host Architecture: amd64
Install-Time: 115
Job: lunar-date_3.0.1-2
Machine Architecture: arm64
Package: lunar-date
Package-Time: 175
Source-Version: 3.0.1-2
Space: n/a
Status: attempted
Version: 3.0.1-2
--------------------------------------------------------------------------------
Finished at 2025-03-11T11:36:52Z
Build needed 00:02:55, no disk space