sbuild (Debian sbuild) 0.85.0 (04 January 2023) on debian-ci-siliconvalley

+==============================================================================+
| mailsync 5.2.7-3.3 (arm64)                   Sat, 22 Mar 2025 01:47:06 +0000 |
+==============================================================================+

Package: mailsync
Version: 5.2.7-3.3
Source Version: 5.2.7-3.3
Distribution: unstable
Machine Architecture: amd64
Host Architecture: arm64
Build Architecture: amd64
Build Profiles: cross nocheck
Build Type: any

I: NOTICE: Log filtering will replace 'var/run/schroot/mount/sid-amd64-sbuild-12d4f360-252d-4cff-8f49-313b1c7dad83' with '<<CHROOT>>'
I: NOTICE: Log filtering will replace 'build/mailsync-FmkwHQ/resolver-XF7CYI' with '<<RESOLVERDIR>>'

+------------------------------------------------------------------------------+
| Update chroot                                                                |
+------------------------------------------------------------------------------+

Hit:1 http://localhost:3142/debian unstable InRelease
Get:2 http://localhost:3142/debian unstable/main arm64 Packages [10.0 MB]
Fetched 10.0 MB in 1s (10.1 MB/s)
Reading package lists...
Reading package lists...
Building dependency tree...
Reading state information...
Calculating upgrade...
0 upgraded, 0 newly installed, 0 to remove and 0 not upgraded.

+------------------------------------------------------------------------------+
| Fetch source files                                                           |
+------------------------------------------------------------------------------+


Check APT
---------

Checking available source versions...

Download source files with APT
------------------------------

Reading package lists...
Need to get 162 kB of source archives.
Get:1 http://localhost:3142/debian unstable/main mailsync 5.2.7-3.3 (dsc) [1489 B]
Get:2 http://localhost:3142/debian unstable/main mailsync 5.2.7-3.3 (tar) [153 kB]
Get:3 http://localhost:3142/debian unstable/main mailsync 5.2.7-3.3 (diff) [7056 B]
Fetched 162 kB in 1s (147 kB/s)
Download complete and in download only mode
I: NOTICE: Log filtering will replace 'build/mailsync-FmkwHQ/mailsync-5.2.7' with '<<PKGBUILDDIR>>'
I: NOTICE: Log filtering will replace 'build/mailsync-FmkwHQ' with '<<BUILDDIR>>'

+------------------------------------------------------------------------------+
| Install package build dependencies                                           |
+------------------------------------------------------------------------------+


Setup apt archive
-----------------

Merged Build-Depends: debhelper (>> 3.0.0), libc-client2007e-dev (>= 8:2007f~dfsg-1), automake, dpkg-dev (>= 1.16.0), libkrb5-dev, libc-dev, libstdc++-dev, build-essential:amd64, fakeroot:amd64, crossbuild-essential-arm64:amd64, libc-dev:arm64, libstdc++-dev:arm64
Filtered Build-Depends: debhelper (>> 3.0.0), libc-client2007e-dev (>= 8:2007f~dfsg-1), automake, dpkg-dev (>= 1.16.0), libkrb5-dev, libc-dev, libstdc++-dev, build-essential:amd64, fakeroot:amd64, crossbuild-essential-arm64:amd64, libc-dev:arm64, libstdc++-dev:arm64
dpkg-deb: warning: root directory /<<RESOLVERDIR>>/sbuild-build-depends-main-dummy has unusual owner or group 1000:119
dpkg-deb: hint: you might need to pass --root-owner-group, see <https://wiki.debian.org/Teams/Dpkg/RootlessBuilds> for further details
dpkg-deb: warning: ignoring 1 warning about the control file(s)
dpkg-deb: building package 'sbuild-build-depends-main-dummy' in '/<<RESOLVERDIR>>/apt_archive/sbuild-build-depends-main-dummy.deb'.
Ign:1 copy:/<<RESOLVERDIR>>/apt_archive ./ InRelease
Get:2 copy:/<<RESOLVERDIR>>/apt_archive ./ Release [609 B]
Ign:3 copy:/<<RESOLVERDIR>>/apt_archive ./ Release.gpg
Get:4 copy:/<<RESOLVERDIR>>/apt_archive ./ Sources [798 B]
Get:5 copy:/<<RESOLVERDIR>>/apt_archive ./ Packages [841 B]
Fetched 2248 B in 0s (0 B/s)
Reading package lists...
Reading package lists...

Install main build dependencies (apt-based resolver)
----------------------------------------------------

Installing build dependencies
Reading package lists...
Building dependency tree...
Reading state information...
Execute external solver...
The following additional packages will be installed:
  autoconf automake autopoint autotools-dev binutils-aarch64-linux-gnu
  bsdextrautils comerr-dev:arm64 cpp-14-aarch64-linux-gnu
  cpp-aarch64-linux-gnu crossbuild-essential-arm64 debhelper dh-autoreconf
  dh-strip-nondeterminism dwz fakeroot file g++-14-aarch64-linux-gnu
  g++-aarch64-linux-gnu gcc-14-aarch64-linux-gnu gcc-14-aarch64-linux-gnu-base
  gcc-14-base:arm64 gcc-14-cross-base gcc-aarch64-linux-gnu gettext
  gettext-base groff-base intltool-debian krb5-multidev:arm64
  libarchive-zip-perl libasan8:arm64 libasan8-arm64-cross libatomic1:arm64
  libatomic1-arm64-cross libaudit1:arm64 libc-client2007e:arm64
  libc-client2007e-dev:arm64 libc6:arm64 libc6-arm64-cross libc6-dev:arm64
  libc6-dev-arm64-cross libcap-ng0:arm64 libcap2:arm64 libcom-err2:arm64
  libcrypt-dev:arm64 libcrypt1:arm64 libdb5.3t64:arm64 libdebhelper-perl
  libelf1t64 libfakeroot libfile-stripnondeterminism-perl libgcc-14-dev:arm64
  libgcc-14-dev-arm64-cross libgcc-s1:arm64 libgcc-s1-arm64-cross
  libgomp1:arm64 libgomp1-arm64-cross libgssapi-krb5-2:arm64
  libgssrpc4t64:arm64 libhwasan0:arm64 libhwasan0-arm64-cross libicu76
  libitm1:arm64 libitm1-arm64-cross libk5crypto3:arm64
  libkadm5clnt-mit12:arm64 libkadm5srv-mit12:arm64 libkdb5-10t64:arm64
  libkeyutils1:arm64 libkrb5-3:arm64 libkrb5-dev:arm64 libkrb5support0:arm64
  liblsan0:arm64 liblsan0-arm64-cross libmagic-mgc libmagic1t64
  libpam-modules:arm64 libpam0g:arm64 libpam0g-dev:arm64 libpcre2-8-0:arm64
  libpipeline1 libselinux1:arm64 libssl-dev:arm64 libssl3t64:arm64
  libstdc++-14-dev:arm64 libstdc++-14-dev-arm64-cross libstdc++6:arm64
  libstdc++6-arm64-cross libsystemd0:arm64 libtool libtsan2:arm64
  libtsan2-arm64-cross libubsan1:arm64 libubsan1-arm64-cross libuchardet0
  libunistring5 libxml2 libzstd1:arm64 linux-libc-dev-arm64-cross m4 man-db
  mlock:arm64 po-debconf sensible-utils zlib1g:arm64
Suggested packages:
  autoconf-archive gnu-standards autoconf-doc binutils-doc doc-base:arm64
  gcc-14-locales cpp-14-doc cpp-doc dh-make gcc-14-doc manpages-dev flex bison
  gdb-aarch64-linux-gnu gcc-doc gettext-doc libasprintf-dev libgettextpo-dev
  groff krb5-doc:arm64 uw-mailutils:arm64 glibc-doc:arm64 libc-l10n:arm64
  locales:arm64 libnss-nis:arm64 libnss-nisplus:arm64 manpages-dev:arm64
  krb5-user:arm64 libpam-doc:arm64 libssl-doc:arm64 libstdc++-14-doc:arm64
  libgcrypt20:arm64 liblz4-1:arm64 liblzma5:arm64 libtool-doc gfortran
  | fortran95-compiler gcj-jdk m4-doc apparmor less www-browser
  libmail-box-perl
Recommended packages:
  curl | wget | lynx libidn2-0:arm64 libarchive-cpio-perl krb5-locales:arm64
  libpam-doc:arm64 libltdl-dev libmail-sendmail-perl
The following NEW packages will be installed:
  autoconf automake autopoint autotools-dev binutils-aarch64-linux-gnu
  bsdextrautils comerr-dev:arm64 cpp-14-aarch64-linux-gnu
  cpp-aarch64-linux-gnu crossbuild-essential-arm64 debhelper dh-autoreconf
  dh-strip-nondeterminism dwz fakeroot file g++-14-aarch64-linux-gnu
  g++-aarch64-linux-gnu gcc-14-aarch64-linux-gnu gcc-14-aarch64-linux-gnu-base
  gcc-14-base:arm64 gcc-14-cross-base gcc-aarch64-linux-gnu gettext
  gettext-base groff-base intltool-debian krb5-multidev:arm64
  libarchive-zip-perl libasan8:arm64 libasan8-arm64-cross libatomic1:arm64
  libatomic1-arm64-cross libaudit1:arm64 libc-client2007e:arm64
  libc-client2007e-dev:arm64 libc6:arm64 libc6-arm64-cross libc6-dev:arm64
  libc6-dev-arm64-cross libcap-ng0:arm64 libcap2:arm64 libcom-err2:arm64
  libcrypt-dev:arm64 libcrypt1:arm64 libdb5.3t64:arm64 libdebhelper-perl
  libelf1t64 libfakeroot libfile-stripnondeterminism-perl libgcc-14-dev:arm64
  libgcc-14-dev-arm64-cross libgcc-s1:arm64 libgcc-s1-arm64-cross
  libgomp1:arm64 libgomp1-arm64-cross libgssapi-krb5-2:arm64
  libgssrpc4t64:arm64 libhwasan0:arm64 libhwasan0-arm64-cross libicu76
  libitm1:arm64 libitm1-arm64-cross libk5crypto3:arm64
  libkadm5clnt-mit12:arm64 libkadm5srv-mit12:arm64 libkdb5-10t64:arm64
  libkeyutils1:arm64 libkrb5-3:arm64 libkrb5-dev:arm64 libkrb5support0:arm64
  liblsan0:arm64 liblsan0-arm64-cross libmagic-mgc libmagic1t64
  libpam-modules:arm64 libpam0g:arm64 libpam0g-dev:arm64 libpcre2-8-0:arm64
  libpipeline1 libselinux1:arm64 libssl-dev:arm64 libssl3t64:arm64
  libstdc++-14-dev:arm64 libstdc++-14-dev-arm64-cross libstdc++6:arm64
  libstdc++6-arm64-cross libsystemd0:arm64 libtool libtsan2:arm64
  libtsan2-arm64-cross libubsan1:arm64 libubsan1-arm64-cross libuchardet0
  libunistring5 libxml2 libzstd1:arm64 linux-libc-dev-arm64-cross m4 man-db
  mlock:arm64 po-debconf sbuild-build-depends-main-dummy:arm64 sensible-utils
  zlib1g:arm64
0 upgraded, 105 newly installed, 0 to remove and 0 not upgraded.
Need to get 109 MB of archives.
After this operation, 478 MB of additional disk space will be used.
Get:1 copy:/<<RESOLVERDIR>>/apt_archive ./ sbuild-build-depends-main-dummy 0.invalid.0 [964 B]
Get:2 http://localhost:3142/debian unstable/main arm64 gcc-14-base arm64 14.2.0-19 [49.4 kB]
Get:3 http://localhost:3142/debian unstable/main arm64 libgcc-s1 arm64 14.2.0-19 [54.1 kB]
Get:4 http://localhost:3142/debian unstable/main arm64 libc6 arm64 2.41-6 [2487 kB]
Get:5 http://localhost:3142/debian unstable/main arm64 libcap-ng0 arm64 0.8.5-4+b1 [17.0 kB]
Get:6 http://localhost:3142/debian unstable/main arm64 libaudit1 arm64 1:4.0.2-2+b2 [54.6 kB]
Get:7 http://localhost:3142/debian unstable/main arm64 libcrypt1 arm64 1:4.4.38-1 [91.8 kB]
Get:8 http://localhost:3142/debian unstable/main arm64 libdb5.3t64 arm64 5.3.28+dfsg2-9 [629 kB]
Get:9 http://localhost:3142/debian unstable/main arm64 libpam0g arm64 1.7.0-3 [68.6 kB]
Get:10 http://localhost:3142/debian unstable/main arm64 libpcre2-8-0 arm64 10.45-1 [262 kB]
Get:11 http://localhost:3142/debian unstable/main arm64 libselinux1 arm64 3.8.1-1 [79.4 kB]
Get:12 http://localhost:3142/debian unstable/main arm64 libcap2 arm64 1:2.75-3 [27.3 kB]
Get:13 http://localhost:3142/debian unstable/main arm64 libsystemd0 arm64 257.4-3 [419 kB]
Get:14 http://localhost:3142/debian unstable/main arm64 libpam-modules arm64 1.7.0-3 [170 kB]
Get:15 http://localhost:3142/debian unstable/main amd64 sensible-utils all 0.0.24 [24.8 kB]
Get:16 http://localhost:3142/debian unstable/main amd64 libmagic-mgc amd64 1:5.46-3 [337 kB]
Get:17 http://localhost:3142/debian unstable/main amd64 libmagic1t64 amd64 1:5.46-3 [109 kB]
Get:18 http://localhost:3142/debian unstable/main amd64 file amd64 1:5.46-3 [43.5 kB]
Get:19 http://localhost:3142/debian unstable/main amd64 gettext-base amd64 0.23.1-1 [243 kB]
Get:20 http://localhost:3142/debian unstable/main amd64 libuchardet0 amd64 0.0.8-1+b2 [68.9 kB]
Get:21 http://localhost:3142/debian unstable/main amd64 groff-base amd64 1.23.0-7 [1185 kB]
Get:22 http://localhost:3142/debian unstable/main amd64 bsdextrautils amd64 2.40.4-5 [92.4 kB]
Get:23 http://localhost:3142/debian unstable/main amd64 libpipeline1 amd64 1.5.8-1 [42.0 kB]
Get:24 http://localhost:3142/debian unstable/main amd64 man-db amd64 2.13.0-1 [1420 kB]
Get:25 http://localhost:3142/debian unstable/main amd64 m4 amd64 1.4.19-7 [294 kB]
Get:26 http://localhost:3142/debian unstable/main amd64 autoconf all 2.72-3 [493 kB]
Get:27 http://localhost:3142/debian unstable/main amd64 autotools-dev all 20220109.1 [51.6 kB]
Get:28 http://localhost:3142/debian unstable/main amd64 automake all 1:1.17-3 [862 kB]
Get:29 http://localhost:3142/debian unstable/main amd64 autopoint all 0.23.1-1 [770 kB]
Get:30 http://localhost:3142/debian unstable/main amd64 binutils-aarch64-linux-gnu amd64 2.44-3 [1687 kB]
Get:31 http://localhost:3142/debian unstable/main arm64 libcrypt-dev arm64 1:4.4.38-1 [123 kB]
Get:32 http://localhost:3142/debian unstable/main arm64 libc6-dev arm64 2.41-6 [1621 kB]
Get:33 http://localhost:3142/debian unstable/main arm64 libcom-err2 arm64 1.47.2-1+b1 [24.2 kB]
Get:34 http://localhost:3142/debian unstable/main arm64 comerr-dev arm64 2.1-1.47.2-1+b1 [56.2 kB]
Get:35 http://localhost:3142/debian unstable/main amd64 gcc-14-aarch64-linux-gnu-base amd64 14.2.0-19cross1 [49.7 kB]
Get:36 http://localhost:3142/debian unstable/main amd64 cpp-14-aarch64-linux-gnu amd64 14.2.0-19cross1 [11.2 MB]
Get:37 http://localhost:3142/debian unstable/main amd64 cpp-aarch64-linux-gnu amd64 4:14.2.0-1 [4844 B]
Get:38 http://localhost:3142/debian unstable/main amd64 gcc-14-cross-base all 14.2.0-19cross1 [44.9 kB]
Get:39 http://localhost:3142/debian unstable/main amd64 libc6-arm64-cross all 2.41-6cross2 [1165 kB]
Get:40 http://localhost:3142/debian unstable/main amd64 libgcc-s1-arm64-cross all 14.2.0-19cross1 [54.1 kB]
Get:41 http://localhost:3142/debian unstable/main amd64 libgomp1-arm64-cross all 14.2.0-19cross1 [91.7 kB]
Get:42 http://localhost:3142/debian unstable/main amd64 libitm1-arm64-cross all 14.2.0-19cross1 [26.0 kB]
Get:43 http://localhost:3142/debian unstable/main amd64 libatomic1-arm64-cross all 14.2.0-19cross1 [10.3 kB]
Get:44 http://localhost:3142/debian unstable/main amd64 libasan8-arm64-cross all 14.2.0-19cross1 [436 kB]
Get:45 http://localhost:3142/debian unstable/main amd64 liblsan0-arm64-cross all 14.2.0-19cross1 [201 kB]
Get:46 http://localhost:3142/debian unstable/main amd64 libtsan2-arm64-cross all 14.2.0-19cross1 [416 kB]
Get:47 http://localhost:3142/debian unstable/main amd64 libstdc++6-arm64-cross all 14.2.0-19cross1 [546 kB]
Get:48 http://localhost:3142/debian unstable/main amd64 libubsan1-arm64-cross all 14.2.0-19cross1 [186 kB]
Get:49 http://localhost:3142/debian unstable/main amd64 libhwasan0-arm64-cross all 14.2.0-19cross1 [256 kB]
Get:50 http://localhost:3142/debian unstable/main amd64 libgcc-14-dev-arm64-cross all 14.2.0-19cross1 [2452 kB]
Get:51 http://localhost:3142/debian unstable/main amd64 gcc-14-aarch64-linux-gnu amd64 14.2.0-19cross1 [21.6 MB]
Get:52 http://localhost:3142/debian unstable/main amd64 gcc-aarch64-linux-gnu amd64 4:14.2.0-1 [1448 B]
Get:53 http://localhost:3142/debian unstable/main amd64 linux-libc-dev-arm64-cross all 6.12.17-1cross2 [2345 kB]
Get:54 http://localhost:3142/debian unstable/main amd64 libc6-dev-arm64-cross all 2.41-6cross2 [1616 kB]
Get:55 http://localhost:3142/debian unstable/main amd64 libstdc++-14-dev-arm64-cross all 14.2.0-19cross1 [2552 kB]
Get:56 http://localhost:3142/debian unstable/main amd64 g++-14-aarch64-linux-gnu amd64 14.2.0-19cross1 [12.2 MB]
Get:57 http://localhost:3142/debian unstable/main amd64 g++-aarch64-linux-gnu amd64 4:14.2.0-1 [1200 B]
Get:58 http://localhost:3142/debian unstable/main amd64 crossbuild-essential-arm64 all 12.12 [3548 B]
Get:59 http://localhost:3142/debian unstable/main amd64 libdebhelper-perl all 13.24.1 [90.9 kB]
Get:60 http://localhost:3142/debian unstable/main amd64 libtool all 2.5.4-4 [539 kB]
Get:61 http://localhost:3142/debian unstable/main amd64 dh-autoreconf all 20 [17.1 kB]
Get:62 http://localhost:3142/debian unstable/main amd64 libarchive-zip-perl all 1.68-1 [104 kB]
Get:63 http://localhost:3142/debian unstable/main amd64 libfile-stripnondeterminism-perl all 1.14.1-2 [19.7 kB]
Get:64 http://localhost:3142/debian unstable/main amd64 dh-strip-nondeterminism all 1.14.1-2 [8620 B]
Get:65 http://localhost:3142/debian unstable/main amd64 libelf1t64 amd64 0.192-4 [189 kB]
Get:66 http://localhost:3142/debian unstable/main amd64 dwz amd64 0.15-1+b1 [110 kB]
Get:67 http://localhost:3142/debian unstable/main amd64 libunistring5 amd64 1.3-1 [476 kB]
Get:68 http://localhost:3142/debian unstable/main amd64 libicu76 amd64 76.1-3 [9721 kB]
Get:69 http://localhost:3142/debian unstable/main amd64 libxml2 amd64 2.12.7+dfsg+really2.9.14-0.3+b1 [699 kB]
Get:70 http://localhost:3142/debian unstable/main amd64 gettext amd64 0.23.1-1 [1680 kB]
Get:71 http://localhost:3142/debian unstable/main amd64 intltool-debian all 0.35.0+20060710.6 [22.9 kB]
Get:72 http://localhost:3142/debian unstable/main amd64 po-debconf all 1.0.21+nmu1 [248 kB]
Get:73 http://localhost:3142/debian unstable/main amd64 debhelper all 13.24.1 [920 kB]
Get:74 http://localhost:3142/debian unstable/main amd64 libfakeroot amd64 1.37.1-1 [29.5 kB]
Get:75 http://localhost:3142/debian unstable/main amd64 fakeroot amd64 1.37.1-1 [75.7 kB]
Get:76 http://localhost:3142/debian unstable/main arm64 libkrb5support0 arm64 1.21.3-5 [32.4 kB]
Get:77 http://localhost:3142/debian unstable/main arm64 libk5crypto3 arm64 1.21.3-5 [81.2 kB]
Get:78 http://localhost:3142/debian unstable/main arm64 libkeyutils1 arm64 1.6.3-4 [9352 B]
Get:79 http://localhost:3142/debian unstable/main arm64 libzstd1 arm64 1.5.7+dfsg-1 [266 kB]
Get:80 http://localhost:3142/debian unstable/main arm64 zlib1g arm64 1:1.3.dfsg+really1.3.1-1+b1 [85.1 kB]
Get:81 http://localhost:3142/debian unstable/main arm64 libssl3t64 arm64 3.4.1-1 [2636 kB]
Get:82 http://localhost:3142/debian unstable/main arm64 libkrb5-3 arm64 1.21.3-5 [308 kB]
Get:83 http://localhost:3142/debian unstable/main arm64 libgssapi-krb5-2 arm64 1.21.3-5 [127 kB]
Get:84 http://localhost:3142/debian unstable/main arm64 libgssrpc4t64 arm64 1.21.3-5 [57.2 kB]
Get:85 http://localhost:3142/debian unstable/main arm64 libkadm5clnt-mit12 arm64 1.21.3-5 [41.1 kB]
Get:86 http://localhost:3142/debian unstable/main arm64 libkdb5-10t64 arm64 1.21.3-5 [41.3 kB]
Get:87 http://localhost:3142/debian unstable/main arm64 libkadm5srv-mit12 arm64 1.21.3-5 [53.0 kB]
Get:88 http://localhost:3142/debian unstable/main arm64 krb5-multidev arm64 1.21.3-5 [126 kB]
Get:89 http://localhost:3142/debian unstable/main arm64 libasan8 arm64 14.2.0-19 [2578 kB]
Get:90 http://localhost:3142/debian unstable/main arm64 libatomic1 arm64 14.2.0-19 [10.1 kB]
Get:91 http://localhost:3142/debian unstable/main arm64 mlock arm64 8:2007f~dfsg-7.1 [8044 B]
Get:92 http://localhost:3142/debian unstable/main arm64 libc-client2007e arm64 8:2007f~dfsg-7.1 [551 kB]
Get:93 http://localhost:3142/debian unstable/main arm64 libpam0g-dev arm64 1.7.0-3 [69.4 kB]
Get:94 http://localhost:3142/debian unstable/main arm64 libssl-dev arm64 3.4.1-1 [3232 kB]
Get:95 http://localhost:3142/debian unstable/main arm64 libc-client2007e-dev arm64 8:2007f~dfsg-7.1 [491 kB]
Get:96 http://localhost:3142/debian unstable/main arm64 libgomp1 arm64 14.2.0-19 [124 kB]
Get:97 http://localhost:3142/debian unstable/main arm64 libitm1 arm64 14.2.0-19 [24.2 kB]
Get:98 http://localhost:3142/debian unstable/main arm64 liblsan0 arm64 14.2.0-19 [1161 kB]
Get:99 http://localhost:3142/debian unstable/main arm64 libtsan2 arm64 14.2.0-19 [2383 kB]
Get:100 http://localhost:3142/debian unstable/main arm64 libstdc++6 arm64 14.2.0-19 [638 kB]
Get:101 http://localhost:3142/debian unstable/main arm64 libubsan1 arm64 14.2.0-19 [1039 kB]
Get:102 http://localhost:3142/debian unstable/main arm64 libhwasan0 arm64 14.2.0-19 [1442 kB]
Get:103 http://localhost:3142/debian unstable/main arm64 libgcc-14-dev arm64 14.2.0-19 [2359 kB]
Get:104 http://localhost:3142/debian unstable/main arm64 libkrb5-dev arm64 1.21.3-5 [16.1 kB]
Get:105 http://localhost:3142/debian unstable/main arm64 libstdc++-14-dev arm64 14.2.0-19 [2295 kB]
Preconfiguring packages ...
Fetched 109 MB in 2s (51.8 MB/s)
Selecting previously unselected package gcc-14-base:arm64.
(Reading database ... 12837 files and directories currently installed.)
Preparing to unpack .../00-gcc-14-base_14.2.0-19_arm64.deb ...
Unpacking gcc-14-base:arm64 (14.2.0-19) ...
Selecting previously unselected package libgcc-s1:arm64.
Preparing to unpack .../01-libgcc-s1_14.2.0-19_arm64.deb ...
Unpacking libgcc-s1:arm64 (14.2.0-19) ...
Selecting previously unselected package libc6:arm64.
Preparing to unpack .../02-libc6_2.41-6_arm64.deb ...
Unpacking libc6:arm64 (2.41-6) ...
Selecting previously unselected package libcap-ng0:arm64.
Preparing to unpack .../03-libcap-ng0_0.8.5-4+b1_arm64.deb ...
Unpacking libcap-ng0:arm64 (0.8.5-4+b1) ...
Selecting previously unselected package libaudit1:arm64.
Preparing to unpack .../04-libaudit1_1%3a4.0.2-2+b2_arm64.deb ...
Unpacking libaudit1:arm64 (1:4.0.2-2+b2) ...
Selecting previously unselected package libcrypt1:arm64.
Preparing to unpack .../05-libcrypt1_1%3a4.4.38-1_arm64.deb ...
Unpacking libcrypt1:arm64 (1:4.4.38-1) ...
Selecting previously unselected package libdb5.3t64:arm64.
Preparing to unpack .../06-libdb5.3t64_5.3.28+dfsg2-9_arm64.deb ...
Unpacking libdb5.3t64:arm64 (5.3.28+dfsg2-9) ...
Selecting previously unselected package libpam0g:arm64.
Preparing to unpack .../07-libpam0g_1.7.0-3_arm64.deb ...
Unpacking libpam0g:arm64 (1.7.0-3) ...
Selecting previously unselected package libpcre2-8-0:arm64.
Preparing to unpack .../08-libpcre2-8-0_10.45-1_arm64.deb ...
Unpacking libpcre2-8-0:arm64 (10.45-1) ...
Selecting previously unselected package libselinux1:arm64.
Preparing to unpack .../09-libselinux1_3.8.1-1_arm64.deb ...
Unpacking libselinux1:arm64 (3.8.1-1) ...
Selecting previously unselected package libcap2:arm64.
Preparing to unpack .../10-libcap2_1%3a2.75-3_arm64.deb ...
Unpacking libcap2:arm64 (1:2.75-3) ...
Selecting previously unselected package libsystemd0:arm64.
Preparing to unpack .../11-libsystemd0_257.4-3_arm64.deb ...
Unpacking libsystemd0:arm64 (257.4-3) ...
Setting up gcc-14-base:arm64 (14.2.0-19) ...
Setting up libgcc-s1:arm64 (14.2.0-19) ...
Setting up libc6:arm64 (2.41-6) ...
Setting up libcap-ng0:arm64 (0.8.5-4+b1) ...
Setting up libaudit1:arm64 (1:4.0.2-2+b2) ...
Setting up libcrypt1:arm64 (1:4.4.38-1) ...
Setting up libdb5.3t64:arm64 (5.3.28+dfsg2-9) ...
Setting up libpam0g:arm64 (1.7.0-3) ...
Setting up libpcre2-8-0:arm64 (10.45-1) ...
Setting up libselinux1:arm64 (3.8.1-1) ...
Setting up libcap2:arm64 (1:2.75-3) ...
Setting up libsystemd0:arm64 (257.4-3) ...
Selecting previously unselected package libpam-modules:arm64.
(Reading database ... 13149 files and directories currently installed.)
Preparing to unpack .../00-libpam-modules_1.7.0-3_arm64.deb ...
Unpacking libpam-modules:arm64 (1.7.0-3) ...
Selecting previously unselected package sensible-utils.
Preparing to unpack .../01-sensible-utils_0.0.24_all.deb ...
Unpacking sensible-utils (0.0.24) ...
Selecting previously unselected package libmagic-mgc.
Preparing to unpack .../02-libmagic-mgc_1%3a5.46-3_amd64.deb ...
Unpacking libmagic-mgc (1:5.46-3) ...
Selecting previously unselected package libmagic1t64:amd64.
Preparing to unpack .../03-libmagic1t64_1%3a5.46-3_amd64.deb ...
Unpacking libmagic1t64:amd64 (1:5.46-3) ...
Selecting previously unselected package file.
Preparing to unpack .../04-file_1%3a5.46-3_amd64.deb ...
Unpacking file (1:5.46-3) ...
Selecting previously unselected package gettext-base.
Preparing to unpack .../05-gettext-base_0.23.1-1_amd64.deb ...
Unpacking gettext-base (0.23.1-1) ...
Selecting previously unselected package libuchardet0:amd64.
Preparing to unpack .../06-libuchardet0_0.0.8-1+b2_amd64.deb ...
Unpacking libuchardet0:amd64 (0.0.8-1+b2) ...
Selecting previously unselected package groff-base.
Preparing to unpack .../07-groff-base_1.23.0-7_amd64.deb ...
Unpacking groff-base (1.23.0-7) ...
Selecting previously unselected package bsdextrautils.
Preparing to unpack .../08-bsdextrautils_2.40.4-5_amd64.deb ...
Unpacking bsdextrautils (2.40.4-5) ...
Selecting previously unselected package libpipeline1:amd64.
Preparing to unpack .../09-libpipeline1_1.5.8-1_amd64.deb ...
Unpacking libpipeline1:amd64 (1.5.8-1) ...
Selecting previously unselected package man-db.
Preparing to unpack .../10-man-db_2.13.0-1_amd64.deb ...
Unpacking man-db (2.13.0-1) ...
Selecting previously unselected package m4.
Preparing to unpack .../11-m4_1.4.19-7_amd64.deb ...
Unpacking m4 (1.4.19-7) ...
Selecting previously unselected package autoconf.
Preparing to unpack .../12-autoconf_2.72-3_all.deb ...
Unpacking autoconf (2.72-3) ...
Selecting previously unselected package autotools-dev.
Preparing to unpack .../13-autotools-dev_20220109.1_all.deb ...
Unpacking autotools-dev (20220109.1) ...
Selecting previously unselected package automake.
Preparing to unpack .../14-automake_1%3a1.17-3_all.deb ...
Unpacking automake (1:1.17-3) ...
Selecting previously unselected package autopoint.
Preparing to unpack .../15-autopoint_0.23.1-1_all.deb ...
Unpacking autopoint (0.23.1-1) ...
Selecting previously unselected package binutils-aarch64-linux-gnu.
Preparing to unpack .../16-binutils-aarch64-linux-gnu_2.44-3_amd64.deb ...
Unpacking binutils-aarch64-linux-gnu (2.44-3) ...
Selecting previously unselected package libcrypt-dev:arm64.
Preparing to unpack .../17-libcrypt-dev_1%3a4.4.38-1_arm64.deb ...
Unpacking libcrypt-dev:arm64 (1:4.4.38-1) ...
Selecting previously unselected package libc6-dev:arm64.
Preparing to unpack .../18-libc6-dev_2.41-6_arm64.deb ...
Unpacking libc6-dev:arm64 (2.41-6) ...
Selecting previously unselected package libcom-err2:arm64.
Preparing to unpack .../19-libcom-err2_1.47.2-1+b1_arm64.deb ...
Unpacking libcom-err2:arm64 (1.47.2-1+b1) ...
Selecting previously unselected package comerr-dev:arm64.
Preparing to unpack .../20-comerr-dev_2.1-1.47.2-1+b1_arm64.deb ...
Unpacking comerr-dev:arm64 (2.1-1.47.2-1+b1) ...
Selecting previously unselected package gcc-14-aarch64-linux-gnu-base:amd64.
Preparing to unpack .../21-gcc-14-aarch64-linux-gnu-base_14.2.0-19cross1_amd64.deb ...
Unpacking gcc-14-aarch64-linux-gnu-base:amd64 (14.2.0-19cross1) ...
Selecting previously unselected package cpp-14-aarch64-linux-gnu.
Preparing to unpack .../22-cpp-14-aarch64-linux-gnu_14.2.0-19cross1_amd64.deb ...
Unpacking cpp-14-aarch64-linux-gnu (14.2.0-19cross1) ...
Selecting previously unselected package cpp-aarch64-linux-gnu.
Preparing to unpack .../23-cpp-aarch64-linux-gnu_4%3a14.2.0-1_amd64.deb ...
Unpacking cpp-aarch64-linux-gnu (4:14.2.0-1) ...
Selecting previously unselected package gcc-14-cross-base.
Preparing to unpack .../24-gcc-14-cross-base_14.2.0-19cross1_all.deb ...
Unpacking gcc-14-cross-base (14.2.0-19cross1) ...
Selecting previously unselected package libc6-arm64-cross.
Preparing to unpack .../25-libc6-arm64-cross_2.41-6cross2_all.deb ...
Unpacking libc6-arm64-cross (2.41-6cross2) ...
Selecting previously unselected package libgcc-s1-arm64-cross.
Preparing to unpack .../26-libgcc-s1-arm64-cross_14.2.0-19cross1_all.deb ...
Unpacking libgcc-s1-arm64-cross (14.2.0-19cross1) ...
Selecting previously unselected package libgomp1-arm64-cross.
Preparing to unpack .../27-libgomp1-arm64-cross_14.2.0-19cross1_all.deb ...
Unpacking libgomp1-arm64-cross (14.2.0-19cross1) ...
Selecting previously unselected package libitm1-arm64-cross.
Preparing to unpack .../28-libitm1-arm64-cross_14.2.0-19cross1_all.deb ...
Unpacking libitm1-arm64-cross (14.2.0-19cross1) ...
Selecting previously unselected package libatomic1-arm64-cross.
Preparing to unpack .../29-libatomic1-arm64-cross_14.2.0-19cross1_all.deb ...
Unpacking libatomic1-arm64-cross (14.2.0-19cross1) ...
Selecting previously unselected package libasan8-arm64-cross.
Preparing to unpack .../30-libasan8-arm64-cross_14.2.0-19cross1_all.deb ...
Unpacking libasan8-arm64-cross (14.2.0-19cross1) ...
Selecting previously unselected package liblsan0-arm64-cross.
Preparing to unpack .../31-liblsan0-arm64-cross_14.2.0-19cross1_all.deb ...
Unpacking liblsan0-arm64-cross (14.2.0-19cross1) ...
Selecting previously unselected package libtsan2-arm64-cross.
Preparing to unpack .../32-libtsan2-arm64-cross_14.2.0-19cross1_all.deb ...
Unpacking libtsan2-arm64-cross (14.2.0-19cross1) ...
Selecting previously unselected package libstdc++6-arm64-cross.
Preparing to unpack .../33-libstdc++6-arm64-cross_14.2.0-19cross1_all.deb ...
Unpacking libstdc++6-arm64-cross (14.2.0-19cross1) ...
Selecting previously unselected package libubsan1-arm64-cross.
Preparing to unpack .../34-libubsan1-arm64-cross_14.2.0-19cross1_all.deb ...
Unpacking libubsan1-arm64-cross (14.2.0-19cross1) ...
Selecting previously unselected package libhwasan0-arm64-cross.
Preparing to unpack .../35-libhwasan0-arm64-cross_14.2.0-19cross1_all.deb ...
Unpacking libhwasan0-arm64-cross (14.2.0-19cross1) ...
Selecting previously unselected package libgcc-14-dev-arm64-cross.
Preparing to unpack .../36-libgcc-14-dev-arm64-cross_14.2.0-19cross1_all.deb ...
Unpacking libgcc-14-dev-arm64-cross (14.2.0-19cross1) ...
Selecting previously unselected package gcc-14-aarch64-linux-gnu.
Preparing to unpack .../37-gcc-14-aarch64-linux-gnu_14.2.0-19cross1_amd64.deb ...
Unpacking gcc-14-aarch64-linux-gnu (14.2.0-19cross1) ...
Selecting previously unselected package gcc-aarch64-linux-gnu.
Preparing to unpack .../38-gcc-aarch64-linux-gnu_4%3a14.2.0-1_amd64.deb ...
Unpacking gcc-aarch64-linux-gnu (4:14.2.0-1) ...
Selecting previously unselected package linux-libc-dev-arm64-cross.
Preparing to unpack .../39-linux-libc-dev-arm64-cross_6.12.17-1cross2_all.deb ...
Unpacking linux-libc-dev-arm64-cross (6.12.17-1cross2) ...
Selecting previously unselected package libc6-dev-arm64-cross.
Preparing to unpack .../40-libc6-dev-arm64-cross_2.41-6cross2_all.deb ...
Unpacking libc6-dev-arm64-cross (2.41-6cross2) ...
Selecting previously unselected package libstdc++-14-dev-arm64-cross.
Preparing to unpack .../41-libstdc++-14-dev-arm64-cross_14.2.0-19cross1_all.deb ...
Unpacking libstdc++-14-dev-arm64-cross (14.2.0-19cross1) ...
Selecting previously unselected package g++-14-aarch64-linux-gnu.
Preparing to unpack .../42-g++-14-aarch64-linux-gnu_14.2.0-19cross1_amd64.deb ...
Unpacking g++-14-aarch64-linux-gnu (14.2.0-19cross1) ...
Selecting previously unselected package g++-aarch64-linux-gnu.
Preparing to unpack .../43-g++-aarch64-linux-gnu_4%3a14.2.0-1_amd64.deb ...
Unpacking g++-aarch64-linux-gnu (4:14.2.0-1) ...
Selecting previously unselected package crossbuild-essential-arm64.
Preparing to unpack .../44-crossbuild-essential-arm64_12.12_all.deb ...
Unpacking crossbuild-essential-arm64 (12.12) ...
Selecting previously unselected package libdebhelper-perl.
Preparing to unpack .../45-libdebhelper-perl_13.24.1_all.deb ...
Unpacking libdebhelper-perl (13.24.1) ...
Selecting previously unselected package libtool.
Preparing to unpack .../46-libtool_2.5.4-4_all.deb ...
Unpacking libtool (2.5.4-4) ...
Selecting previously unselected package dh-autoreconf.
Preparing to unpack .../47-dh-autoreconf_20_all.deb ...
Unpacking dh-autoreconf (20) ...
Selecting previously unselected package libarchive-zip-perl.
Preparing to unpack .../48-libarchive-zip-perl_1.68-1_all.deb ...
Unpacking libarchive-zip-perl (1.68-1) ...
Selecting previously unselected package libfile-stripnondeterminism-perl.
Preparing to unpack .../49-libfile-stripnondeterminism-perl_1.14.1-2_all.deb ...
Unpacking libfile-stripnondeterminism-perl (1.14.1-2) ...
Selecting previously unselected package dh-strip-nondeterminism.
Preparing to unpack .../50-dh-strip-nondeterminism_1.14.1-2_all.deb ...
Unpacking dh-strip-nondeterminism (1.14.1-2) ...
Selecting previously unselected package libelf1t64:amd64.
Preparing to unpack .../51-libelf1t64_0.192-4_amd64.deb ...
Unpacking libelf1t64:amd64 (0.192-4) ...
Selecting previously unselected package dwz.
Preparing to unpack .../52-dwz_0.15-1+b1_amd64.deb ...
Unpacking dwz (0.15-1+b1) ...
Selecting previously unselected package libunistring5:amd64.
Preparing to unpack .../53-libunistring5_1.3-1_amd64.deb ...
Unpacking libunistring5:amd64 (1.3-1) ...
Selecting previously unselected package libicu76:amd64.
Preparing to unpack .../54-libicu76_76.1-3_amd64.deb ...
Unpacking libicu76:amd64 (76.1-3) ...
Selecting previously unselected package libxml2:amd64.
Preparing to unpack .../55-libxml2_2.12.7+dfsg+really2.9.14-0.3+b1_amd64.deb ...
Unpacking libxml2:amd64 (2.12.7+dfsg+really2.9.14-0.3+b1) ...
Selecting previously unselected package gettext.
Preparing to unpack .../56-gettext_0.23.1-1_amd64.deb ...
Unpacking gettext (0.23.1-1) ...
Selecting previously unselected package intltool-debian.
Preparing to unpack .../57-intltool-debian_0.35.0+20060710.6_all.deb ...
Unpacking intltool-debian (0.35.0+20060710.6) ...
Selecting previously unselected package po-debconf.
Preparing to unpack .../58-po-debconf_1.0.21+nmu1_all.deb ...
Unpacking po-debconf (1.0.21+nmu1) ...
Selecting previously unselected package debhelper.
Preparing to unpack .../59-debhelper_13.24.1_all.deb ...
Unpacking debhelper (13.24.1) ...
Selecting previously unselected package libfakeroot:amd64.
Preparing to unpack .../60-libfakeroot_1.37.1-1_amd64.deb ...
Unpacking libfakeroot:amd64 (1.37.1-1) ...
Selecting previously unselected package fakeroot.
Preparing to unpack .../61-fakeroot_1.37.1-1_amd64.deb ...
Unpacking fakeroot (1.37.1-1) ...
Selecting previously unselected package libkrb5support0:arm64.
Preparing to unpack .../62-libkrb5support0_1.21.3-5_arm64.deb ...
Unpacking libkrb5support0:arm64 (1.21.3-5) ...
Selecting previously unselected package libk5crypto3:arm64.
Preparing to unpack .../63-libk5crypto3_1.21.3-5_arm64.deb ...
Unpacking libk5crypto3:arm64 (1.21.3-5) ...
Selecting previously unselected package libkeyutils1:arm64.
Preparing to unpack .../64-libkeyutils1_1.6.3-4_arm64.deb ...
Unpacking libkeyutils1:arm64 (1.6.3-4) ...
Selecting previously unselected package libzstd1:arm64.
Preparing to unpack .../65-libzstd1_1.5.7+dfsg-1_arm64.deb ...
Unpacking libzstd1:arm64 (1.5.7+dfsg-1) ...
Selecting previously unselected package zlib1g:arm64.
Preparing to unpack .../66-zlib1g_1%3a1.3.dfsg+really1.3.1-1+b1_arm64.deb ...
Unpacking zlib1g:arm64 (1:1.3.dfsg+really1.3.1-1+b1) ...
Selecting previously unselected package libssl3t64:arm64.
Preparing to unpack .../67-libssl3t64_3.4.1-1_arm64.deb ...
Unpacking libssl3t64:arm64 (3.4.1-1) ...
Selecting previously unselected package libkrb5-3:arm64.
Preparing to unpack .../68-libkrb5-3_1.21.3-5_arm64.deb ...
Unpacking libkrb5-3:arm64 (1.21.3-5) ...
Selecting previously unselected package libgssapi-krb5-2:arm64.
Preparing to unpack .../69-libgssapi-krb5-2_1.21.3-5_arm64.deb ...
Unpacking libgssapi-krb5-2:arm64 (1.21.3-5) ...
Selecting previously unselected package libgssrpc4t64:arm64.
Preparing to unpack .../70-libgssrpc4t64_1.21.3-5_arm64.deb ...
Unpacking libgssrpc4t64:arm64 (1.21.3-5) ...
Selecting previously unselected package libkadm5clnt-mit12:arm64.
Preparing to unpack .../71-libkadm5clnt-mit12_1.21.3-5_arm64.deb ...
Unpacking libkadm5clnt-mit12:arm64 (1.21.3-5) ...
Selecting previously unselected package libkdb5-10t64:arm64.
Preparing to unpack .../72-libkdb5-10t64_1.21.3-5_arm64.deb ...
Unpacking libkdb5-10t64:arm64 (1.21.3-5) ...
Selecting previously unselected package libkadm5srv-mit12:arm64.
Preparing to unpack .../73-libkadm5srv-mit12_1.21.3-5_arm64.deb ...
Unpacking libkadm5srv-mit12:arm64 (1.21.3-5) ...
Selecting previously unselected package krb5-multidev:arm64.
Preparing to unpack .../74-krb5-multidev_1.21.3-5_arm64.deb ...
Unpacking krb5-multidev:arm64 (1.21.3-5) ...
Selecting previously unselected package libasan8:arm64.
Preparing to unpack .../75-libasan8_14.2.0-19_arm64.deb ...
Unpacking libasan8:arm64 (14.2.0-19) ...
Selecting previously unselected package libatomic1:arm64.
Preparing to unpack .../76-libatomic1_14.2.0-19_arm64.deb ...
Unpacking libatomic1:arm64 (14.2.0-19) ...
Selecting previously unselected package mlock:arm64.
Preparing to unpack .../77-mlock_8%3a2007f~dfsg-7.1_arm64.deb ...
Unpacking mlock:arm64 (8:2007f~dfsg-7.1) ...
Selecting previously unselected package libc-client2007e:arm64.
Preparing to unpack .../78-libc-client2007e_8%3a2007f~dfsg-7.1_arm64.deb ...
Unpacking libc-client2007e:arm64 (8:2007f~dfsg-7.1) ...
Selecting previously unselected package libpam0g-dev:arm64.
Preparing to unpack .../79-libpam0g-dev_1.7.0-3_arm64.deb ...
Unpacking libpam0g-dev:arm64 (1.7.0-3) ...
Selecting previously unselected package libssl-dev:arm64.
Preparing to unpack .../80-libssl-dev_3.4.1-1_arm64.deb ...
Unpacking libssl-dev:arm64 (3.4.1-1) ...
Selecting previously unselected package libc-client2007e-dev:arm64.
Preparing to unpack .../81-libc-client2007e-dev_8%3a2007f~dfsg-7.1_arm64.deb ...
Unpacking libc-client2007e-dev:arm64 (8:2007f~dfsg-7.1) ...
Selecting previously unselected package libgomp1:arm64.
Preparing to unpack .../82-libgomp1_14.2.0-19_arm64.deb ...
Unpacking libgomp1:arm64 (14.2.0-19) ...
Selecting previously unselected package libitm1:arm64.
Preparing to unpack .../83-libitm1_14.2.0-19_arm64.deb ...
Unpacking libitm1:arm64 (14.2.0-19) ...
Selecting previously unselected package liblsan0:arm64.
Preparing to unpack .../84-liblsan0_14.2.0-19_arm64.deb ...
Unpacking liblsan0:arm64 (14.2.0-19) ...
Selecting previously unselected package libtsan2:arm64.
Preparing to unpack .../85-libtsan2_14.2.0-19_arm64.deb ...
Unpacking libtsan2:arm64 (14.2.0-19) ...
Selecting previously unselected package libstdc++6:arm64.
Preparing to unpack .../86-libstdc++6_14.2.0-19_arm64.deb ...
Unpacking libstdc++6:arm64 (14.2.0-19) ...
Selecting previously unselected package libubsan1:arm64.
Preparing to unpack .../87-libubsan1_14.2.0-19_arm64.deb ...
Unpacking libubsan1:arm64 (14.2.0-19) ...
Selecting previously unselected package libhwasan0:arm64.
Preparing to unpack .../88-libhwasan0_14.2.0-19_arm64.deb ...
Unpacking libhwasan0:arm64 (14.2.0-19) ...
Selecting previously unselected package libgcc-14-dev:arm64.
Preparing to unpack .../89-libgcc-14-dev_14.2.0-19_arm64.deb ...
Unpacking libgcc-14-dev:arm64 (14.2.0-19) ...
Selecting previously unselected package libkrb5-dev:arm64.
Preparing to unpack .../90-libkrb5-dev_1.21.3-5_arm64.deb ...
Unpacking libkrb5-dev:arm64 (1.21.3-5) ...
Selecting previously unselected package libstdc++-14-dev:arm64.
Preparing to unpack .../91-libstdc++-14-dev_14.2.0-19_arm64.deb ...
Unpacking libstdc++-14-dev:arm64 (14.2.0-19) ...
Selecting previously unselected package sbuild-build-depends-main-dummy:arm64.
Preparing to unpack .../92-sbuild-build-depends-main-dummy_0.invalid.0_arm64.deb ...
Unpacking sbuild-build-depends-main-dummy:arm64 (0.invalid.0) ...
Setting up libpipeline1:amd64 (1.5.8-1) ...
Setting up libzstd1:arm64 (1.5.7+dfsg-1) ...
Setting up libkeyutils1:arm64 (1.6.3-4) ...
Setting up bsdextrautils (2.40.4-5) ...
Setting up libpam-modules:arm64 (1.7.0-3) ...
Setting up libmagic-mgc (1:5.46-3) ...
Setting up libarchive-zip-perl (1.68-1) ...
Setting up mlock:arm64 (8:2007f~dfsg-7.1) ...
Setting up libdebhelper-perl (13.24.1) ...
Setting up libmagic1t64:amd64 (1:5.46-3) ...
Setting up gettext-base (0.23.1-1) ...
Setting up m4 (1.4.19-7) ...
Setting up binutils-aarch64-linux-gnu (2.44-3) ...
Setting up zlib1g:arm64 (1:1.3.dfsg+really1.3.1-1+b1) ...
Setting up gcc-14-cross-base (14.2.0-19cross1) ...
Setting up libcom-err2:arm64 (1.47.2-1+b1) ...
Setting up file (1:5.46-3) ...
Setting up libgomp1:arm64 (14.2.0-19) ...
Setting up libfakeroot:amd64 (1.37.1-1) ...
Setting up libelf1t64:amd64 (0.192-4) ...
Setting up libkrb5support0:arm64 (1.21.3-5) ...
Setting up fakeroot (1.37.1-1) ...
update-alternatives: using /usr/bin/fakeroot-sysv to provide /usr/bin/fakeroot (fakeroot) in auto mode
Setting up autotools-dev (20220109.1) ...
Setting up libc6-arm64-cross (2.41-6cross2) ...
Setting up libunistring5:amd64 (1.3-1) ...
Setting up libatomic1:arm64 (14.2.0-19) ...
Setting up autopoint (0.23.1-1) ...
Setting up libitm1-arm64-cross (14.2.0-19cross1) ...
Setting up libk5crypto3:arm64 (1.21.3-5) ...
Setting up autoconf (2.72-3) ...
Setting up linux-libc-dev-arm64-cross (6.12.17-1cross2) ...
Setting up dwz (0.15-1+b1) ...
Setting up sensible-utils (0.0.24) ...
Setting up libhwasan0:arm64 (14.2.0-19) ...
Setting up libcrypt-dev:arm64 (1:4.4.38-1) ...
Setting up libasan8:arm64 (14.2.0-19) ...
Setting up libuchardet0:amd64 (0.0.8-1+b2) ...
Setting up libc6-dev:arm64 (2.41-6) ...
Setting up libicu76:amd64 (76.1-3) ...
Setting up libtsan2:arm64 (14.2.0-19) ...
Setting up gcc-14-aarch64-linux-gnu-base:amd64 (14.2.0-19cross1) ...
Setting up libxml2:amd64 (2.12.7+dfsg+really2.9.14-0.3+b1) ...
Setting up libstdc++6:arm64 (14.2.0-19) ...
Setting up liblsan0:arm64 (14.2.0-19) ...
Setting up libitm1:arm64 (14.2.0-19) ...
Setting up libgcc-s1-arm64-cross (14.2.0-19cross1) ...
Setting up libatomic1-arm64-cross (14.2.0-19cross1) ...
Setting up automake (1:1.17-3) ...
update-alternatives: using /usr/bin/automake-1.17 to provide /usr/bin/automake (automake) in auto mode
Setting up libfile-stripnondeterminism-perl (1.14.1-2) ...
Setting up liblsan0-arm64-cross (14.2.0-19cross1) ...
Setting up libgomp1-arm64-cross (14.2.0-19cross1) ...
Setting up gettext (0.23.1-1) ...
Setting up libtool (2.5.4-4) ...
Setting up libpam0g-dev:arm64 (1.7.0-3) ...
Setting up libssl3t64:arm64 (3.4.1-1) ...
Setting up libhwasan0-arm64-cross (14.2.0-19cross1) ...
Setting up libc6-dev-arm64-cross (2.41-6cross2) ...
Setting up intltool-debian (0.35.0+20060710.6) ...
Setting up libstdc++6-arm64-cross (14.2.0-19cross1) ...
Setting up dh-autoreconf (20) ...
Setting up comerr-dev:arm64 (2.1-1.47.2-1+b1) ...
Setting up libssl-dev:arm64 (3.4.1-1) ...
Setting up libubsan1:arm64 (14.2.0-19) ...
Setting up dh-strip-nondeterminism (1.14.1-2) ...
Setting up cpp-14-aarch64-linux-gnu (14.2.0-19cross1) ...
Setting up groff-base (1.23.0-7) ...
Setting up libkrb5-3:arm64 (1.21.3-5) ...
Setting up libasan8-arm64-cross (14.2.0-19cross1) ...
Setting up libgcc-14-dev:arm64 (14.2.0-19) ...
Setting up libstdc++-14-dev:arm64 (14.2.0-19) ...
Setting up libtsan2-arm64-cross (14.2.0-19cross1) ...
Setting up libubsan1-arm64-cross (14.2.0-19cross1) ...
Setting up po-debconf (1.0.21+nmu1) ...
Setting up man-db (2.13.0-1) ...
Not building database; man-db/auto-update is not 'true'.
Setting up cpp-aarch64-linux-gnu (4:14.2.0-1) ...
Setting up libgssapi-krb5-2:arm64 (1.21.3-5) ...
Setting up libgcc-14-dev-arm64-cross (14.2.0-19cross1) ...
Setting up libstdc++-14-dev-arm64-cross (14.2.0-19cross1) ...
Setting up gcc-14-aarch64-linux-gnu (14.2.0-19cross1) ...
Setting up libc-client2007e:arm64 (8:2007f~dfsg-7.1) ...
Setting up gcc-aarch64-linux-gnu (4:14.2.0-1) ...
Setting up g++-14-aarch64-linux-gnu (14.2.0-19cross1) ...
Setting up debhelper (13.24.1) ...
Setting up libgssrpc4t64:arm64 (1.21.3-5) ...
Setting up g++-aarch64-linux-gnu (4:14.2.0-1) ...
Setting up libkadm5clnt-mit12:arm64 (1.21.3-5) ...
Setting up libkdb5-10t64:arm64 (1.21.3-5) ...
Setting up crossbuild-essential-arm64 (12.12) ...
Setting up libkadm5srv-mit12:arm64 (1.21.3-5) ...
Setting up krb5-multidev:arm64 (1.21.3-5) ...
Setting up libc-client2007e-dev:arm64 (8:2007f~dfsg-7.1) ...
Setting up libkrb5-dev:arm64 (1.21.3-5) ...
Setting up sbuild-build-depends-main-dummy:arm64 (0.invalid.0) ...
Processing triggers for libc-bin (2.41-6) ...

+------------------------------------------------------------------------------+
| Check architectures                                                          |
+------------------------------------------------------------------------------+

Arch check ok (arm64 included in any)

+------------------------------------------------------------------------------+
| Build environment                                                            |
+------------------------------------------------------------------------------+

Kernel: Linux 6.1.0-31-amd64 #1 SMP PREEMPT_DYNAMIC Debian 6.1.128-1 (2025-02-07) amd64 (x86_64)
Toolchain package versions: binutils_2.44-3 dpkg-dev_1.22.18 g++-14_14.2.0-19 gcc-14_14.2.0-19 libc6-dev_2.41-6 libstdc++-14-dev_14.2.0-19 libstdc++-14-dev-arm64-cross_14.2.0-19cross1 libstdc++6_14.2.0-19 libstdc++6-arm64-cross_14.2.0-19cross1 linux-libc-dev_6.12.19-1
Package versions: apt_2.9.34 apt-utils_2.9.34 autoconf_2.72-3 automake_1:1.17-3 autopoint_0.23.1-1 autotools-dev_20220109.1 base-files_13.7 base-passwd_3.6.6 bash_5.2.37-1.1+b1 binutils_2.44-3 binutils-aarch64-linux-gnu_2.44-3 binutils-common_2.44-3 binutils-x86-64-linux-gnu_2.44-3 bsdextrautils_2.40.4-5 bsdutils_1:2.40.4-5 build-essential_12.12 bzip2_1.0.8-6 comerr-dev_2.1-1.47.2-1+b1 coreutils_9.5-1+b1 cpp_4:14.2.0-1 cpp-14_14.2.0-19 cpp-14-aarch64-linux-gnu_14.2.0-19cross1 cpp-14-x86-64-linux-gnu_14.2.0-19 cpp-aarch64-linux-gnu_4:14.2.0-1 cpp-x86-64-linux-gnu_4:14.2.0-1 crossbuild-essential-arm64_12.12 dash_0.5.12-12 debconf_1.5.91 debhelper_13.24.1 debian-archive-keyring_2023.4 debianutils_5.21 dh-autoreconf_20 dh-strip-nondeterminism_1.14.1-2 diffutils_1:3.10-3 dpkg_1.22.18 dpkg-dev_1.22.18 dwz_0.15-1+b1 fakeroot_1.37.1-1 file_1:5.46-3 findutils_4.10.0-3 g++_4:14.2.0-1 g++-14_14.2.0-19 g++-14-aarch64-linux-gnu_14.2.0-19cross1 g++-14-x86-64-linux-gnu_14.2.0-19 g++-aarch64-linux-gnu_4:14.2.0-1 g++-x86-64-linux-gnu_4:14.2.0-1 gcc_4:14.2.0-1 gcc-14_14.2.0-19 gcc-14-aarch64-linux-gnu_14.2.0-19cross1 gcc-14-aarch64-linux-gnu-base_14.2.0-19cross1 gcc-14-base_14.2.0-19 gcc-14-cross-base_14.2.0-19cross1 gcc-14-x86-64-linux-gnu_14.2.0-19 gcc-aarch64-linux-gnu_4:14.2.0-1 gcc-x86-64-linux-gnu_4:14.2.0-1 gettext_0.23.1-1 gettext-base_0.23.1-1 grep_3.11-4 groff-base_1.23.0-7 gzip_1.13-1 hostname_3.25 init-system-helpers_1.68 intltool-debian_0.35.0+20060710.6 krb5-multidev_1.21.3-5 libacl1_2.3.2-2+b1 libapt-pkg7.0_2.9.34 libarchive-zip-perl_1.68-1 libasan8_14.2.0-19 libasan8-arm64-cross_14.2.0-19cross1 libatomic1_14.2.0-19 libatomic1-arm64-cross_14.2.0-19cross1 libattr1_1:2.5.2-3 libaudit-common_1:4.0.2-2 libaudit1_1:4.0.2-2+b2 libbinutils_2.44-3 libblkid1_2.40.4-5 libbsd0_0.12.2-2 libbz2-1.0_1.0.8-6 libc-bin_2.41-6 libc-client2007e_8:2007f~dfsg-7.1 libc-client2007e-dev_8:2007f~dfsg-7.1 libc-dev-bin_2.41-6 libc6_2.41-6 libc6-arm64-cross_2.41-6cross2 libc6-dev_2.41-6 libc6-dev-arm64-cross_2.41-6cross2 libcap-ng0_0.8.5-4+b1 libcap2_1:2.75-3 libcc1-0_14.2.0-19 libcom-err2_1.47.2-1+b1 libcrypt-dev_1:4.4.38-1 libcrypt1_1:4.4.38-1 libctf-nobfd0_2.44-3 libctf0_2.44-3 libdb5.3t64_5.3.28+dfsg2-9 libdebconfclient0_0.277 libdebhelper-perl_13.24.1 libdpkg-perl_1.22.18 libelf1t64_0.192-4 libfakeroot_1.37.1-1 libfile-stripnondeterminism-perl_1.14.1-2 libgcc-14-dev_14.2.0-19 libgcc-14-dev-arm64-cross_14.2.0-19cross1 libgcc-s1_14.2.0-19 libgcc-s1-arm64-cross_14.2.0-19cross1 libgdbm-compat4t64_1.24-2 libgdbm6t64_1.24-2 libgmp10_2:6.3.0+dfsg-3 libgomp1_14.2.0-19 libgomp1-arm64-cross_14.2.0-19cross1 libgprofng0_2.44-3 libgssapi-krb5-2_1.21.3-5 libgssrpc4t64_1.21.3-5 libhogweed6t64_3.10.1-1 libhwasan0_14.2.0-19 libhwasan0-arm64-cross_14.2.0-19cross1 libicu76_76.1-3 libisl23_0.27-1 libitm1_14.2.0-19 libitm1-arm64-cross_14.2.0-19cross1 libjansson4_2.14-2+b3 libk5crypto3_1.21.3-5 libkadm5clnt-mit12_1.21.3-5 libkadm5srv-mit12_1.21.3-5 libkdb5-10t64_1.21.3-5 libkeyutils1_1.6.3-4 libkrb5-3_1.21.3-5 libkrb5-dev_1.21.3-5 libkrb5support0_1.21.3-5 liblsan0_14.2.0-19 liblsan0-arm64-cross_14.2.0-19cross1 liblz4-1_1.10.0-4 liblzma5_5.6.4-1 libmagic-mgc_1:5.46-3 libmagic1t64_1:5.46-3 libmd0_1.1.0-2+b1 libmount1_2.40.4-5 libmpc3_1.3.1-1+b3 libmpfr6_4.2.1-1+b2 libnettle8t64_3.10.1-1 libpam-modules_1.7.0-3 libpam-modules-bin_1.7.0-3 libpam-runtime_1.7.0-3 libpam0g_1.7.0-3 libpam0g-dev_1.7.0-3 libpcre2-8-0_10.45-1 libperl5.40_5.40.1-2 libpipeline1_1.5.8-1 libquadmath0_14.2.0-19 libseccomp2_2.6.0-2 libselinux1_3.8.1-1 libsemanage-common_3.8.1-1 libsemanage2_3.8.1-1 libsepol2_3.8.1-1 libsframe1_2.44-3 libsmartcols1_2.40.4-5 libssl-dev_3.4.1-1 libssl3t64_3.4.1-1 libstdc++-14-dev_14.2.0-19 libstdc++-14-dev-arm64-cross_14.2.0-19cross1 libstdc++6_14.2.0-19 libstdc++6-arm64-cross_14.2.0-19cross1 libsystemd0_257.4-3 libtinfo6_6.5+20250216-2 libtool_2.5.4-4 libtsan2_14.2.0-19 libtsan2-arm64-cross_14.2.0-19cross1 libubsan1_14.2.0-19 libubsan1-arm64-cross_14.2.0-19cross1 libuchardet0_0.0.8-1+b2 libudev1_257.4-3 libunistring5_1.3-1 libuuid1_2.40.4-5 libxml2_2.12.7+dfsg+really2.9.14-0.3+b1 libxxhash0_0.8.3-2 libzstd1_1.5.7+dfsg-1 linux-libc-dev_6.12.19-1 linux-libc-dev-arm64-cross_6.12.17-1cross2 login_1:4.16.0-2+really2.40.4-5 login.defs_1:4.17.3-2 m4_1.4.19-7 make_4.4.1-1 man-db_2.13.0-1 mawk_1.3.4.20250131-1 mlock_8:2007f~dfsg-7.1 mount_2.40.4-5 ncurses-base_6.5+20250216-2 ncurses-bin_6.5+20250216-2 openssl-provider-legacy_3.4.1-1 passwd_1:4.17.3-2 patch_2.7.6-7 perl_5.40.1-2 perl-base_5.40.1-2 perl-modules-5.40_5.40.1-2 po-debconf_1.0.21+nmu1 rpcsvc-proto_1.4.3-1 sbuild-build-depends-main-dummy_0.invalid.0 sed_4.9-2 sensible-utils_0.0.24 sqv_1.2.1-6+b1 sysvinit-utils_3.14-4 tar_1.35+dfsg-3.1 tzdata_2025a-2 util-linux_2.40.4-5 xz-utils_5.6.4-1 zlib1g_1:1.3.dfsg+really1.3.1-1+b1

+------------------------------------------------------------------------------+
| Build                                                                        |
+------------------------------------------------------------------------------+


Unpack source
-------------

-----BEGIN PGP SIGNED MESSAGE-----
Hash: SHA512

Format: 3.0 (quilt)
Source: mailsync
Binary: mailsync
Architecture: any
Version: 5.2.7-3.3
Maintainer: Tomas Pospisek <tpo_deb@sourcepole.ch>
Homepage: http://mailsync.sourceforge.net/
Standards-Version: 3.9.3.1
Build-Depends: debhelper (>> 3.0.0), libc-client2007e-dev (>= 8:2007f~dfsg-1), automake, dpkg-dev (>= 1.16.0), libkrb5-dev
Package-List:
 mailsync deb mail optional arch=any
Checksums-Sha1:
 1360037daba55801fb3fcff11b790ed68a5df92f 153417 mailsync_5.2.7.orig.tar.gz
 dfdc3aeb070decfe44ac4ae1491b193180d271bf 7056 mailsync_5.2.7-3.3.debian.tar.xz
Checksums-Sha256:
 1d81575e8ef75f1f65d680dcb8c8472cb6e50f132a4af26ebf97e11bae9577a0 153417 mailsync_5.2.7.orig.tar.gz
 3e1ba607d60ace4782bd50edbc53bbcde54a4f9ffcdf855a00bca5dd36b3081f 7056 mailsync_5.2.7-3.3.debian.tar.xz
Files:
 494486ed6c97db9efe6a403a7f2319a3 153417 mailsync_5.2.7.orig.tar.gz
 8cdf9dec9f25f287826d5e28ed6eaae3 7056 mailsync_5.2.7-3.3.debian.tar.xz

-----BEGIN PGP SIGNATURE-----

iQFGBAEBCgAwFiEE9ecZmu9eXGflVYc/dA1oiINl0okFAmd1izoSHG5pZWxzQHRo
eWtpZXIubmV0AAoJEHQNaIiDZdKJ63sIAK0lqNDEHyMLAlGfVpmtpU6RBQsE2foJ
B+GdNoFYFsUnJ+6vmQl7elnTENSCN7q8joQF3/wclb0WuI3JwX6SD2aF+ENGmBwZ
4ZoOCzyAZ4L3S0i4ifDjcp3DnrOXXCQ6UvHOMxWC+gQYL5up7X0LQycTu8BdD+pQ
pV9l5Yf3u2rlTDeMcbGMd4sIvWzQ3Fv0Ki96DSMi14/HI8oIijPFAUnaWBDHVB/E
wyda2T3Q9mxaBZkmnoVijNSehPGxvR+H5Ak+wGgT1H37yejRRh438vD97eCZ5e71
lisCc5D1QulISki2vnkoekUdIhk94eF9t0n5I2jOny8Qi4jezPPIVwQ=
=kgmZ
-----END PGP SIGNATURE-----

dpkg-source: warning: cannot verify inline signature for ./mailsync_5.2.7-3.3.dsc: unsupported subcommand
dpkg-source: info: extracting mailsync in /<<PKGBUILDDIR>>
dpkg-source: info: unpacking mailsync_5.2.7.orig.tar.gz
dpkg-source: info: unpacking mailsync_5.2.7-3.3.debian.tar.xz

Check disk space
----------------

Sufficient free space for build

User Environment
----------------

APT_CONFIG=/var/lib/sbuild/apt.conf
CONFIG_SITE=/etc/dpkg-cross/cross-config.arm64
DEB_BUILD_OPTIONS=nocheck
HOME=/sbuild-nonexistent
LANG=en_US.UTF-8
LC_ALL=C.UTF-8
LOGNAME=crossqa
OLDPWD=/home/crossqa
PATH=/usr/local/sbin:/usr/local/bin:/usr/sbin:/usr/bin:/sbin:/bin:/usr/games
SBUILD_CONFIG=/tmp/tmp.5X0WbX7rAO/sbuild.conf
SCHROOT_ALIAS_NAME=unstable-amd64-sbuild
SCHROOT_CHROOT_NAME=sid-amd64-sbuild
SCHROOT_COMMAND=env
SCHROOT_GID=1000
SCHROOT_GROUP=crossqa
SCHROOT_SESSION_ID=sid-amd64-sbuild-12d4f360-252d-4cff-8f49-313b1c7dad83
SCHROOT_UID=1000
SCHROOT_USER=crossqa
SHELL=/bin/sh
USER=crossqa
XDG_SESSION_CLASS=user

dpkg-buildpackage
-----------------

Command: dpkg-buildpackage --sanitize-env -aarm64 -Pcross,nocheck -us -uc -B -rfakeroot --jobs-try=1
dpkg-buildpackage: info: source package mailsync
dpkg-buildpackage: info: source version 5.2.7-3.3
dpkg-buildpackage: info: source distribution unstable
dpkg-buildpackage: info: source changed by Niels Thykier <niels@thykier.net>
dpkg-architecture: warning: specified GNU system type aarch64-linux-gnu does not match CC system type x86_64-linux-gnu, try setting a correct CC environment variable
 dpkg-source --before-build .
dpkg-buildpackage: info: host architecture arm64
dpkg-source: info: using options from mailsync-5.2.7/debian/source/options: --tar-ignore
 debian/rules clean
dh_testdir
rm -f build-stamp configure-stamp
/usr/bin/make distclean
make[1]: Entering directory '/<<PKGBUILDDIR>>'
make[1]: *** No rule to make target 'distclean'.  Stop.
make[1]: Leaving directory '/<<PKGBUILDDIR>>'
make: [debian/rules:44: clean] Error 2 (ignored)
rm -f core
rm install-sh mkinstalldirs missing depcomp
rm: cannot remove 'install-sh': No such file or directory
rm: cannot remove 'mkinstalldirs': No such file or directory
rm: cannot remove 'missing': No such file or directory
rm: cannot remove 'depcomp': No such file or directory
make: [debian/rules:47: clean] Error 1 (ignored)
dh_clean
dh_clean: warning: Compatibility levels before 10 are deprecated (level 7 in use)
 debian/rules binary-arch
dh_testdir
autoreconf -fi
configure.ac:3: warning: 'AM_CONFIG_HEADER': this macro is obsolete.
configure.ac:3: You should use the 'AC_CONFIG_HEADERS' macro instead.
aclocal.m4:707: AM_CONFIG_HEADER is expanded from...
configure.ac:3: the top level
configure.ac:13: warning: The macro 'AC_HEADER_STDC' is obsolete.
configure.ac:13: You should run autoupdate.
./lib/autoconf/headers.m4:663: AC_HEADER_STDC is expanded from...
configure.ac:13: the top level
configure.ac:23: warning: The macro 'AC_HELP_STRING' is obsolete.
configure.ac:23: You should run autoupdate.
./lib/autoconf/general.m4:204: AC_HELP_STRING is expanded from...
acinclude/ac_with_cclient.m4:5: AC_WITH_CCLIENT is expanded from...
configure.ac:23: the top level
configure.ac:18: installing './config.guess'
configure.ac:18: installing './config.sub'
configure.ac:2: installing './install-sh'
configure.ac:2: installing './missing'
src/Makefile.am:4: warning: 'INCLUDES' is the old name for 'AM_CPPFLAGS' (or '*_CPPFLAGS')
src/Makefile.am: installing './depcomp'
automake -a
src/Makefile.am:4: warning: 'INCLUDES' is the old name for 'AM_CPPFLAGS' (or '*_CPPFLAGS')
./configure --prefix=/usr
checking for a BSD-compatible install... /usr/bin/install -c
checking whether sleep supports fractional seconds... yes
checking filesystem timestamp resolution... 0.01
checking whether build environment is sane... yes
checking for a race-free mkdir -p... /usr/bin/mkdir -p
checking for gawk... no
checking for mawk... mawk
checking whether make sets $(MAKE)... yes
checking whether make supports nested variables... yes
checking xargs -n works... yes
checking for gcc... gcc
checking whether the C compiler works... yes
checking for C compiler default output file name... a.out
checking for suffix of executables... 
checking whether we are cross compiling... no
checking for suffix of object files... o
checking whether the compiler supports GNU C... yes
checking whether gcc accepts -g... yes
checking for gcc option to enable C11 features... none needed
checking whether gcc understands -c and -o together... yes
checking whether make supports the include directive... yes (GNU style)
checking dependency style of gcc... gcc3
checking for g++... g++
checking whether the compiler supports GNU C++... yes
checking whether g++ accepts -g... yes
checking for g++ option to enable C++11 features... none needed
checking dependency style of g++... gcc3
checking for gawk... (cached) mawk
checking how to run the C preprocessor... gcc -E
checking for stdio.h... yes
checking for stdlib.h... yes
checking for string.h... yes
checking for inttypes.h... yes
checking for stdint.h... yes
checking for strings.h... yes
checking for sys/stat.h... yes
checking for sys/types.h... yes
checking for unistd.h... yes
checking for grep that handles long lines and -e... /usr/bin/grep
checking for egrep... /usr/bin/grep -E
checking for string.h... (cached) yes
checking for an ANSI C-conforming const... yes
checking build system type... x86_64-pc-linux-gnu
checking host system type... x86_64-pc-linux-gnu
checking whether lstat correctly handles trailing slash... yes
checking whether stat accepts an empty string... no
checking for getpass... yes
checking for memset... yes
checking for strchr... yes
checking for strdup... yes
checking for strerror... yes
checking for strtoul... yes
checking for crypt in -lcrypt... yes
checking for c-client.h... found in /usr/include/c-client
checking for c-client library... found /usr/lib/libc-client.so
checking if c-client works without -fno-operator-names in c++... no
checking if adding -fno-operator-names helps... yes
checking if c-client includes md5 support... no
checking that generated files are newer than configure... done
configure: creating ./config.status
config.status: creating Makefile
config.status: creating src/Makefile
config.status: creating config.h
config.status: executing depfiles commands
touch configure-stamp
dh_testdir
/usr/bin/make
make[1]: Entering directory '/<<PKGBUILDDIR>>'
/usr/bin/make  all-recursive
make[2]: Entering directory '/<<PKGBUILDDIR>>'
Making all in src
make[3]: Entering directory '/<<PKGBUILDDIR>>/src'
g++ -DHAVE_CONFIG_H -I. -I.. -I/usr/include/c-client   -fno-operator-names -g -O2 -MT main.o -MD -MP -MF .deps/main.Tpo -c -o main.o main.cc
In file included from /usr/include/c-client/c-client.h:41,
                 from c-client-header.h:8,
                 from main.cc:23:
/usr/include/c-client/linkage.c: In function ‘int main(int, const char**)’:
/usr/include/c-client/mail.h:29:24: warning: ISO C++ forbids converting a string constant to ‘char*’ [-Wwrite-strings]
   29 | #define CCLIENTVERSION "2007f"
      |                        ^~~~~~~
/usr/include/c-client/linkage.c:21:22: note: in expansion of macro ‘CCLIENTVERSION’
   21 |   mail_versioncheck (CCLIENTVERSION);
      |                      ^~~~~~~~~~~~~~
mv -f .deps/main.Tpo .deps/main.Po
g++ -DHAVE_CONFIG_H -I. -I.. -I/usr/include/c-client   -fno-operator-names -g -O2 -MT commandline.o -MD -MP -MF .deps/commandline.Tpo -c -o commandline.o commandline.cc
mv -f .deps/commandline.Tpo .deps/commandline.Po
g++ -DHAVE_CONFIG_H -I. -I.. -I/usr/include/c-client   -fno-operator-names -g -O2 -MT configuration.o -MD -MP -MF .deps/configuration.Tpo -c -o configuration.o configuration.cc
mv -f .deps/configuration.Tpo .deps/configuration.Po
g++ -DHAVE_CONFIG_H -I. -I.. -I/usr/include/c-client   -fno-operator-names -g -O2 -MT types.o -MD -MP -MF .deps/types.Tpo -c -o types.o types.cc
mv -f .deps/types.Tpo .deps/types.Po
g++ -DHAVE_CONFIG_H -I. -I.. -I/usr/include/c-client   -fno-operator-names -g -O2 -MT mail_handling.o -MD -MP -MF .deps/mail_handling.Tpo -c -o mail_handling.o mail_handling.cc
mv -f .deps/mail_handling.Tpo .deps/mail_handling.Po
g++ -DHAVE_CONFIG_H -I. -I.. -I/usr/include/c-client   -fno-operator-names -g -O2 -MT c-client_callbacks.o -MD -MP -MF .deps/c-client_callbacks.Tpo -c -o c-client_callbacks.o c-client_callbacks.cc
mv -f .deps/c-client_callbacks.Tpo .deps/c-client_callbacks.Po
g++ -DHAVE_CONFIG_H -I. -I.. -I/usr/include/c-client   -fno-operator-names -g -O2 -MT utils.o -MD -MP -MF .deps/utils.Tpo -c -o utils.o utils.cc
mv -f .deps/utils.Tpo .deps/utils.Po
g++ -DHAVE_CONFIG_H -I. -I.. -I/usr/include/c-client   -fno-operator-names -g -O2 -MT store.o -MD -MP -MF .deps/store.Tpo -c -o store.o store.cc
In file included from /usr/include/c-client/c-client.h:41,
                 from c-client-header.h:8,
                 from store.h:7,
                 from store.cc:4:
store.cc: In member function ‘bool Store::flag_message_for_removal(long unsigned int, const MsgId&, const char*)’:
store.cc:398:63: warning: ISO C++ forbids converting a string constant to ‘char*’ [-Wwrite-strings]
  398 |     if (! options.simulate ) mail_setflag( this->stream, seq, "\\Deleted" );
      |                                                               ^~~~~~~~~~~
/usr/include/c-client/mail.h:1563:30: note: in definition of macro ‘mail_setflag’
 1563 |   mail_flag (stream,sequence,flag,ST_SET)
      |                              ^~~~
store.cc: In member function ‘char* Store::driver_name()’:
store.cc:432:37: warning: ISO C++ forbids converting a string constant to ‘char*’ [-Wwrite-strings]
  432 |     drv = mail_valid( this->stream, "", NIL);
      |                                     ^~
mv -f .deps/store.Tpo .deps/store.Po
g++ -DHAVE_CONFIG_H -I. -I.. -I/usr/include/c-client   -fno-operator-names -g -O2 -MT channel.o -MD -MP -MF .deps/channel.Tpo -c -o channel.o channel.cc
In file included from /usr/include/c-client/c-client.h:41,
                 from c-client-header.h:8,
                 from types.h:7,
                 from channel.h:5,
                 from channel.cc:2:
channel.cc: In member function ‘bool Channel::write_seen_this_time(const MailboxMap&, MsgIdsPerMailbox&)’:
channel.cc:428:40: warning: ISO C++ forbids converting a string constant to ‘char*’ [-Wwrite-strings]
  428 |       mail_setflag(msinfo_stream, seq, "\\Deleted");
      |                                        ^~~~~~~~~~~
/usr/include/c-client/mail.h:1563:30: note: in definition of macro ‘mail_setflag’
 1563 |   mail_flag (stream,sequence,flag,ST_SET)
      |                              ^~~~
mv -f .deps/channel.Tpo .deps/channel.Po
g++ -DHAVE_CONFIG_H -I. -I.. -I/usr/include/c-client   -fno-operator-names -g -O2 -MT msgid.o -MD -MP -MF .deps/msgid.Tpo -c -o msgid.o msgid.cc
mv -f .deps/msgid.Tpo .deps/msgid.Po
gcc -DHAVE_CONFIG_H -I. -I.. -I/usr/include/c-client    -g -O2 -MT msgstring.o -MD -MP -MF .deps/msgstring.Tpo -c -o msgstring.o msgstring.c
mv -f .deps/msgstring.Tpo .deps/msgstring.Po
g++ -DHAVE_CONFIG_H -I. -I.. -I/usr/include/c-client   -fno-operator-names -g -O2 -MT password.o -MD -MP -MF .deps/password.Tpo -c -o password.o password.cc
mv -f .deps/password.Tpo .deps/password.Po
g++ -fno-operator-names -g -O2   -o mailsync main.o commandline.o configuration.o types.o mail_handling.o c-client_callbacks.o utils.o store.o channel.o msgid.o msgstring.o password.o /usr/lib/libc-client.so -lcrypt 
/usr/bin/ld: /usr/lib/libc-client.so: error adding symbols: file in wrong format
collect2: error: ld returned 1 exit status
make[3]: *** [Makefile:394: mailsync] Error 1
make[3]: Leaving directory '/<<PKGBUILDDIR>>/src'
make[2]: *** [Makefile:435: all-recursive] Error 1
make[2]: Leaving directory '/<<PKGBUILDDIR>>'
make[1]: *** [Makefile:355: all] Error 2
make[1]: Leaving directory '/<<PKGBUILDDIR>>'
make: *** [debian/rules:34: build-stamp] Error 2
dpkg-buildpackage: error: debian/rules binary-arch subprocess returned exit status 2
--------------------------------------------------------------------------------
Build finished at 2025-03-22T01:47:39Z

+------------------------------------------------------------------------------+
| Finished Timed Build Commands                                                |
+------------------------------------------------------------------------------+


rm -Rf /<<PKGBUILDDIR>>/
---------------------------------------------


I: Finished running 'rm -Rf /<<PKGBUILDDIR>>/'.

Finished processing commands.
--------------------------------------------------------------------------------

Finished
--------


+------------------------------------------------------------------------------+
| Cleanup                                                                      |
+------------------------------------------------------------------------------+

Purging /<<BUILDDIR>>
Not cleaning session: cloned chroot in use
E: Build failure (dpkg-buildpackage died)

+------------------------------------------------------------------------------+
| Summary                                                                      |
+------------------------------------------------------------------------------+

Build Architecture: amd64
Build Profiles: cross nocheck
Build Type: any
Build-Space: n/a
Build-Time: 12
Distribution: unstable
Fail-Stage: build
Foreign Architectures: arm64
Host Architecture: arm64
Install-Time: 12
Job: mailsync_5.2.7-3.3
Machine Architecture: amd64
Package: mailsync
Package-Time: 33
Source-Version: 5.2.7-3.3
Space: n/a
Status: attempted
Version: 5.2.7-3.3
--------------------------------------------------------------------------------
Finished at 2025-03-22T01:47:39Z
Build needed 00:00:33, no disk space