sbuild (Debian sbuild) 0.85.0 (04 January 2023) on mjolnir.einval.org

+==============================================================================+
| nn 6.7.3-16 (i386)                           Wed, 30 Apr 2025 16:34:05 +0000 |
+==============================================================================+

Package: nn
Version: 6.7.3-16
Source Version: 6.7.3-16
Distribution: unstable
Machine Architecture: arm64
Host Architecture: i386
Build Architecture: arm64
Build Profiles: cross nocheck
Build Type: any

Unpacking /home/helmut/.cache/sbuild/unstable-arm64-sbuild.tar.zst to /tmp/tmp.sbuild.AguUq1bf0R...
I: NOTICE: Log filtering will replace 'sbuild-unshare-dummy-location' with '<<CHROOT>>'
I: NOTICE: Log filtering will replace 'build/nn-gCA5bx/resolver-ml0761' with '<<RESOLVERDIR>>'

+------------------------------------------------------------------------------+
| Update chroot                                                                |
+------------------------------------------------------------------------------+

Get:1 http://mirror.einval.org/debian unstable InRelease [205 kB]
Get:2 http://mirror.einval.org/debian unstable/main Sources [11.0 MB]
Get:3 http://mirror.einval.org/debian unstable/main arm64 Packages [10.1 MB]
Get:4 http://mirror.einval.org/debian unstable/main i386 Packages [9877 kB]
Fetched 31.1 MB in 7s (4349 kB/s)
Reading package lists...
Reading package lists...
Building dependency tree...
Reading state information...
Calculating upgrade...
0 upgraded, 0 newly installed, 0 to remove and 0 not upgraded.

+------------------------------------------------------------------------------+
| Fetch source files                                                           |
+------------------------------------------------------------------------------+


Check APT
---------

Checking available source versions...

Download source files with APT
------------------------------

Reading package lists...
Need to get 508 kB of source archives.
Get:1 http://mirror.einval.org/debian unstable/main nn 6.7.3-16 (dsc) [1679 B]
Get:2 http://mirror.einval.org/debian unstable/main nn 6.7.3-16 (tar) [475 kB]
Get:3 http://mirror.einval.org/debian unstable/main nn 6.7.3-16 (diff) [31.1 kB]
Fetched 508 kB in 0s (1768 kB/s)
Download complete and in download only mode
I: NOTICE: Log filtering will replace 'build/nn-gCA5bx/nn-6.7.3' with '<<PKGBUILDDIR>>'
I: NOTICE: Log filtering will replace 'build/nn-gCA5bx' with '<<BUILDDIR>>'

+------------------------------------------------------------------------------+
| Install package build dependencies                                           |
+------------------------------------------------------------------------------+


Setup apt archive
-----------------

Merged Build-Depends: debhelper-compat (= 13), po-debconf, libncurses-dev, libc-dev, libstdc++-dev, build-essential:arm64, fakeroot:arm64, crossbuild-essential-i386:arm64, libc-dev:i386, libstdc++-dev:i386
Filtered Build-Depends: debhelper-compat (= 13), po-debconf, libncurses-dev, libc-dev, libstdc++-dev, build-essential:arm64, fakeroot:arm64, crossbuild-essential-i386:arm64, libc-dev:i386, libstdc++-dev:i386
dpkg-deb: warning: root directory /<<RESOLVERDIR>>/sbuild-build-depends-main-dummy has unusual owner or group 998:999
dpkg-deb: hint: you might need to pass --root-owner-group, see <https://wiki.debian.org/Teams/Dpkg/RootlessBuilds> for further details
dpkg-deb: warning: ignoring 1 warning about the control file(s)
dpkg-deb: building package 'sbuild-build-depends-main-dummy' in '/<<RESOLVERDIR>>/apt_archive/sbuild-build-depends-main-dummy.deb'.
Ign:1 copy:/<<RESOLVERDIR>>/apt_archive ./ InRelease
Get:2 copy:/<<RESOLVERDIR>>/apt_archive ./ Release [609 B]
Ign:3 copy:/<<RESOLVERDIR>>/apt_archive ./ Release.gpg
Get:4 copy:/<<RESOLVERDIR>>/apt_archive ./ Sources [739 B]
Get:5 copy:/<<RESOLVERDIR>>/apt_archive ./ Packages [781 B]
Fetched 2129 B in 0s (86.4 kB/s)
Reading package lists...
Reading package lists...

Install main build dependencies (apt-based resolver)
----------------------------------------------------

Installing build dependencies
Reading package lists...
Building dependency tree...
Reading state information...
Execute external solver...
The following additional packages will be installed:
  autoconf automake autopoint autotools-dev binutils-i686-linux-gnu
  bsdextrautils cpp-14-i686-linux-gnu cpp-i686-linux-gnu
  crossbuild-essential-i386 debhelper dh-autoreconf dh-strip-nondeterminism
  dwz fakeroot file g++-14-i686-linux-gnu g++-i686-linux-gnu gcc-14-base:i386
  gcc-14-cross-base gcc-14-i686-linux-gnu gcc-14-i686-linux-gnu-base
  gcc-i686-linux-gnu gettext gettext-base groff-base intltool-debian
  libarchive-zip-perl libasan8:i386 libasan8-i386-cross libatomic1:i386
  libatomic1-i386-cross libc6:i386 libc6-dev:i386 libc6-dev-i386-cross
  libc6-i386-cross libcrypt-dev:i386 libcrypt1:i386 libdebhelper-perl
  libelf1t64 libfakeroot libfile-stripnondeterminism-perl libgcc-14-dev:i386
  libgcc-14-dev-i386-cross libgcc-s1:i386 libgcc-s1-i386-cross libgomp1:i386
  libgomp1-i386-cross libitm1:i386 libitm1-i386-cross libmagic-mgc
  libmagic1t64 libncurses-dev:i386 libncurses6:i386 libncursesw6:i386
  libpipeline1 libquadmath0:i386 libquadmath0-i386-cross libstdc++-14-dev:i386
  libstdc++-14-dev-i386-cross libstdc++6:i386 libstdc++6-i386-cross
  libtinfo6:i386 libtool libubsan1:i386 libubsan1-i386-cross libuchardet0
  libunistring5 libxml2 linux-libc-dev-i386-cross m4 man-db po-debconf
  sensible-utils
Suggested packages:
  autoconf-archive gnu-standards autoconf-doc binutils-doc gcc-14-locales
  cpp-14-doc cpp-doc dh-make gcc-14-doc manpages-dev flex bison
  gdb-i686-linux-gnu gcc-doc gettext-doc libasprintf-dev libgettextpo-dev
  gnulib-l10n groff glibc-doc:i386 libc-l10n:i386 locales:i386 libnss-nis:i386
  libnss-nisplus:i386 manpages-dev:i386 ncurses-doc:i386 libstdc++-14-doc:i386
  libtool-doc gfortran | fortran95-compiler gcj-jdk m4-doc apparmor less
  www-browser libmail-box-perl
Recommended packages:
  curl | wget | lynx libidn2-0:i386 libarchive-cpio-perl libgpm2:i386
  libltdl-dev libmail-sendmail-perl
The following NEW packages will be installed:
  autoconf automake autopoint autotools-dev binutils-i686-linux-gnu
  bsdextrautils cpp-14-i686-linux-gnu cpp-i686-linux-gnu
  crossbuild-essential-i386 debhelper dh-autoreconf dh-strip-nondeterminism
  dwz fakeroot file g++-14-i686-linux-gnu g++-i686-linux-gnu gcc-14-base:i386
  gcc-14-cross-base gcc-14-i686-linux-gnu gcc-14-i686-linux-gnu-base
  gcc-i686-linux-gnu gettext gettext-base groff-base intltool-debian
  libarchive-zip-perl libasan8:i386 libasan8-i386-cross libatomic1:i386
  libatomic1-i386-cross libc6:i386 libc6-dev:i386 libc6-dev-i386-cross
  libc6-i386-cross libcrypt-dev:i386 libcrypt1:i386 libdebhelper-perl
  libelf1t64 libfakeroot libfile-stripnondeterminism-perl libgcc-14-dev:i386
  libgcc-14-dev-i386-cross libgcc-s1:i386 libgcc-s1-i386-cross libgomp1:i386
  libgomp1-i386-cross libitm1:i386 libitm1-i386-cross libmagic-mgc
  libmagic1t64 libncurses-dev:i386 libncurses6:i386 libncursesw6:i386
  libpipeline1 libquadmath0:i386 libquadmath0-i386-cross libstdc++-14-dev:i386
  libstdc++-14-dev-i386-cross libstdc++6:i386 libstdc++6-i386-cross
  libtinfo6:i386 libtool libubsan1:i386 libubsan1-i386-cross libuchardet0
  libunistring5 libxml2 linux-libc-dev-i386-cross m4 man-db po-debconf
  sbuild-build-depends-main-dummy:i386 sensible-utils
0 upgraded, 74 newly installed, 0 to remove and 0 not upgraded.
Need to get 85.5 MB of archives.
After this operation, 346 MB of additional disk space will be used.
Get:1 copy:/<<RESOLVERDIR>>/apt_archive ./ sbuild-build-depends-main-dummy 0.invalid.0 [928 B]
Get:2 http://mirror.einval.org/debian unstable/main arm64 sensible-utils all 0.0.25 [25.0 kB]
Get:3 http://mirror.einval.org/debian unstable/main arm64 libmagic-mgc arm64 1:5.46-5 [338 kB]
Get:4 http://mirror.einval.org/debian unstable/main arm64 libmagic1t64 arm64 1:5.46-5 [103 kB]
Get:5 http://mirror.einval.org/debian unstable/main arm64 file arm64 1:5.46-5 [43.7 kB]
Get:6 http://mirror.einval.org/debian unstable/main arm64 gettext-base arm64 0.23.1-2 [241 kB]
Get:7 http://mirror.einval.org/debian unstable/main arm64 libuchardet0 arm64 0.0.8-1+b2 [69.2 kB]
Get:8 http://mirror.einval.org/debian unstable/main arm64 groff-base arm64 1.23.0-7 [1129 kB]
Get:9 http://mirror.einval.org/debian unstable/main arm64 bsdextrautils arm64 2.41-4 [93.9 kB]
Get:10 http://mirror.einval.org/debian unstable/main arm64 libpipeline1 arm64 1.5.8-1 [40.2 kB]
Get:11 http://mirror.einval.org/debian unstable/main arm64 man-db arm64 2.13.0-1 [1404 kB]
Get:12 http://mirror.einval.org/debian unstable/main arm64 m4 arm64 1.4.19-8 [285 kB]
Get:13 http://mirror.einval.org/debian unstable/main arm64 autoconf all 2.72-3.1 [494 kB]
Get:14 http://mirror.einval.org/debian unstable/main arm64 autotools-dev all 20240727.1 [60.2 kB]
Get:15 http://mirror.einval.org/debian unstable/main arm64 automake all 1:1.17-4 [862 kB]
Get:16 http://mirror.einval.org/debian unstable/main arm64 autopoint all 0.23.1-2 [770 kB]
Get:17 http://mirror.einval.org/debian unstable/main arm64 gcc-14-i686-linux-gnu-base arm64 14.2.0-19cross1 [49.6 kB]
Get:18 http://mirror.einval.org/debian unstable/main arm64 cpp-14-i686-linux-gnu arm64 14.2.0-19cross1 [10.4 MB]
Get:19 http://mirror.einval.org/debian unstable/main arm64 cpp-i686-linux-gnu arm64 4:14.2.0-1 [4840 B]
Get:20 http://mirror.einval.org/debian unstable/main arm64 binutils-i686-linux-gnu arm64 2.44-3 [1479 kB]
Get:21 http://mirror.einval.org/debian unstable/main arm64 gcc-14-cross-base all 14.2.0-19cross1 [44.9 kB]
Get:22 http://mirror.einval.org/debian unstable/main arm64 libc6-i386-cross all 2.41-6cross2 [1423 kB]
Get:23 http://mirror.einval.org/debian unstable/main arm64 libgcc-s1-i386-cross all 14.2.0-19cross1 [88.2 kB]
Get:24 http://mirror.einval.org/debian unstable/main arm64 libgomp1-i386-cross all 14.2.0-19cross1 [136 kB]
Get:25 http://mirror.einval.org/debian unstable/main arm64 libitm1-i386-cross all 14.2.0-19cross1 [26.9 kB]
Get:26 http://mirror.einval.org/debian unstable/main arm64 libatomic1-i386-cross all 14.2.0-19cross1 [7384 B]
Get:27 http://mirror.einval.org/debian unstable/main arm64 libasan8-i386-cross all 14.2.0-19cross1 [2597 kB]
Get:28 http://mirror.einval.org/debian unstable/main arm64 libstdc++6-i386-cross all 14.2.0-19cross1 [719 kB]
Get:29 http://mirror.einval.org/debian unstable/main arm64 libubsan1-i386-cross all 14.2.0-19cross1 [1052 kB]
Get:30 http://mirror.einval.org/debian unstable/main arm64 libquadmath0-i386-cross all 14.2.0-19cross1 [231 kB]
Get:31 http://mirror.einval.org/debian unstable/main arm64 libgcc-14-dev-i386-cross all 14.2.0-19cross1 [2583 kB]
Get:32 http://mirror.einval.org/debian unstable/main arm64 gcc-14-i686-linux-gnu arm64 14.2.0-19cross1 [20.0 MB]
Get:33 http://mirror.einval.org/debian unstable/main arm64 gcc-i686-linux-gnu arm64 4:14.2.0-1 [1444 B]
Get:34 http://mirror.einval.org/debian unstable/main arm64 linux-libc-dev-i386-cross all 6.12.17-1cross2 [2369 kB]
Get:35 http://mirror.einval.org/debian unstable/main arm64 libc6-dev-i386-cross all 2.41-6cross2 [1804 kB]
Get:36 http://mirror.einval.org/debian unstable/main arm64 libstdc++-14-dev-i386-cross all 14.2.0-19cross1 [2426 kB]
Get:37 http://mirror.einval.org/debian unstable/main arm64 g++-14-i686-linux-gnu arm64 14.2.0-19cross1 [11.2 MB]
Get:38 http://mirror.einval.org/debian unstable/main arm64 g++-i686-linux-gnu arm64 4:14.2.0-1 [1200 B]
Get:39 http://mirror.einval.org/debian unstable/main arm64 crossbuild-essential-i386 all 12.12 [3544 B]
Get:40 http://mirror.einval.org/debian unstable/main arm64 libdebhelper-perl all 13.24.2 [90.9 kB]
Get:41 http://mirror.einval.org/debian unstable/main arm64 libtool all 2.5.4-4 [539 kB]
Get:42 http://mirror.einval.org/debian unstable/main arm64 dh-autoreconf all 20 [17.1 kB]
Get:43 http://mirror.einval.org/debian unstable/main arm64 libarchive-zip-perl all 1.68-1 [104 kB]
Get:44 http://mirror.einval.org/debian unstable/main arm64 libfile-stripnondeterminism-perl all 1.14.1-2 [19.7 kB]
Get:45 http://mirror.einval.org/debian unstable/main arm64 dh-strip-nondeterminism all 1.14.1-2 [8620 B]
Get:46 http://mirror.einval.org/debian unstable/main arm64 libelf1t64 arm64 0.192-4 [189 kB]
Get:47 http://mirror.einval.org/debian unstable/main arm64 dwz arm64 0.15-1+b1 [102 kB]
Get:48 http://mirror.einval.org/debian unstable/main arm64 libunistring5 arm64 1.3-2 [453 kB]
Get:49 http://mirror.einval.org/debian unstable/main arm64 libxml2 arm64 2.12.7+dfsg+really2.9.14-0.4 [629 kB]
Get:50 http://mirror.einval.org/debian unstable/main arm64 gettext arm64 0.23.1-2 [1611 kB]
Get:51 http://mirror.einval.org/debian unstable/main arm64 intltool-debian all 0.35.0+20060710.6 [22.9 kB]
Get:52 http://mirror.einval.org/debian unstable/main arm64 po-debconf all 1.0.21+nmu1 [248 kB]
Get:53 http://mirror.einval.org/debian unstable/main arm64 debhelper all 13.24.2 [919 kB]
Get:54 http://mirror.einval.org/debian unstable/main arm64 libfakeroot arm64 1.37.1.1-1 [29.6 kB]
Get:55 http://mirror.einval.org/debian unstable/main arm64 fakeroot arm64 1.37.1.1-1 [75.4 kB]
Get:56 http://mirror.einval.org/debian unstable/main i386 gcc-14-base i386 14.2.0-19 [49.4 kB]
Get:57 http://mirror.einval.org/debian unstable/main i386 libgcc-s1 i386 14.2.0-19 [88.2 kB]
Get:58 http://mirror.einval.org/debian unstable/main i386 libc6 i386 2.41-7 [2721 kB]
Get:59 http://mirror.einval.org/debian unstable/main i386 libasan8 i386 14.2.0-19 [2605 kB]
Get:60 http://mirror.einval.org/debian unstable/main i386 libatomic1 i386 14.2.0-19 [7648 B]
Get:61 http://mirror.einval.org/debian unstable/main i386 libcrypt1 i386 1:4.4.38-1 [95.7 kB]
Get:62 http://mirror.einval.org/debian unstable/main i386 libcrypt-dev i386 1:4.4.38-1 [126 kB]
Get:63 http://mirror.einval.org/debian unstable/main i386 libc6-dev i386 2.41-7 [1808 kB]
Get:64 http://mirror.einval.org/debian unstable/main i386 libgomp1 i386 14.2.0-19 [138 kB]
Get:65 http://mirror.einval.org/debian unstable/main i386 libitm1 i386 14.2.0-19 [27.4 kB]
Get:66 http://mirror.einval.org/debian unstable/main i386 libstdc++6 i386 14.2.0-19 [765 kB]
Get:67 http://mirror.einval.org/debian unstable/main i386 libubsan1 i386 14.2.0-19 [1054 kB]
Get:68 http://mirror.einval.org/debian unstable/main i386 libquadmath0 i386 14.2.0-19 [231 kB]
Get:69 http://mirror.einval.org/debian unstable/main i386 libgcc-14-dev i386 14.2.0-19 [2581 kB]
Get:70 http://mirror.einval.org/debian unstable/main i386 libtinfo6 i386 6.5+20250216-2 [350 kB]
Get:71 http://mirror.einval.org/debian unstable/main i386 libncurses6 i386 6.5+20250216-2 [112 kB]
Get:72 http://mirror.einval.org/debian unstable/main i386 libncursesw6 i386 6.5+20250216-2 [148 kB]
Get:73 http://mirror.einval.org/debian unstable/main i386 libncurses-dev i386 6.5+20250216-2 [505 kB]
Get:74 http://mirror.einval.org/debian unstable/main i386 libstdc++-14-dev i386 14.2.0-19 [2443 kB]
Preconfiguring packages ...
Fetched 85.5 MB in 1s (96.5 MB/s)
Selecting previously unselected package sensible-utils.
(Reading database ... 12032 files and directories currently installed.)
Preparing to unpack .../00-sensible-utils_0.0.25_all.deb ...
Unpacking sensible-utils (0.0.25) ...
Selecting previously unselected package libmagic-mgc.
Preparing to unpack .../01-libmagic-mgc_1%3a5.46-5_arm64.deb ...
Unpacking libmagic-mgc (1:5.46-5) ...
Selecting previously unselected package libmagic1t64:arm64.
Preparing to unpack .../02-libmagic1t64_1%3a5.46-5_arm64.deb ...
Unpacking libmagic1t64:arm64 (1:5.46-5) ...
Selecting previously unselected package file.
Preparing to unpack .../03-file_1%3a5.46-5_arm64.deb ...
Unpacking file (1:5.46-5) ...
Selecting previously unselected package gettext-base.
Preparing to unpack .../04-gettext-base_0.23.1-2_arm64.deb ...
Unpacking gettext-base (0.23.1-2) ...
Selecting previously unselected package libuchardet0:arm64.
Preparing to unpack .../05-libuchardet0_0.0.8-1+b2_arm64.deb ...
Unpacking libuchardet0:arm64 (0.0.8-1+b2) ...
Selecting previously unselected package groff-base.
Preparing to unpack .../06-groff-base_1.23.0-7_arm64.deb ...
Unpacking groff-base (1.23.0-7) ...
Selecting previously unselected package bsdextrautils.
Preparing to unpack .../07-bsdextrautils_2.41-4_arm64.deb ...
Unpacking bsdextrautils (2.41-4) ...
Selecting previously unselected package libpipeline1:arm64.
Preparing to unpack .../08-libpipeline1_1.5.8-1_arm64.deb ...
Unpacking libpipeline1:arm64 (1.5.8-1) ...
Selecting previously unselected package man-db.
Preparing to unpack .../09-man-db_2.13.0-1_arm64.deb ...
Unpacking man-db (2.13.0-1) ...
Selecting previously unselected package m4.
Preparing to unpack .../10-m4_1.4.19-8_arm64.deb ...
Unpacking m4 (1.4.19-8) ...
Selecting previously unselected package autoconf.
Preparing to unpack .../11-autoconf_2.72-3.1_all.deb ...
Unpacking autoconf (2.72-3.1) ...
Selecting previously unselected package autotools-dev.
Preparing to unpack .../12-autotools-dev_20240727.1_all.deb ...
Unpacking autotools-dev (20240727.1) ...
Selecting previously unselected package automake.
Preparing to unpack .../13-automake_1%3a1.17-4_all.deb ...
Unpacking automake (1:1.17-4) ...
Selecting previously unselected package autopoint.
Preparing to unpack .../14-autopoint_0.23.1-2_all.deb ...
Unpacking autopoint (0.23.1-2) ...
Selecting previously unselected package gcc-14-i686-linux-gnu-base:arm64.
Preparing to unpack .../15-gcc-14-i686-linux-gnu-base_14.2.0-19cross1_arm64.deb ...
Unpacking gcc-14-i686-linux-gnu-base:arm64 (14.2.0-19cross1) ...
Selecting previously unselected package cpp-14-i686-linux-gnu.
Preparing to unpack .../16-cpp-14-i686-linux-gnu_14.2.0-19cross1_arm64.deb ...
Unpacking cpp-14-i686-linux-gnu (14.2.0-19cross1) ...
Selecting previously unselected package cpp-i686-linux-gnu.
Preparing to unpack .../17-cpp-i686-linux-gnu_4%3a14.2.0-1_arm64.deb ...
Unpacking cpp-i686-linux-gnu (4:14.2.0-1) ...
Selecting previously unselected package binutils-i686-linux-gnu.
Preparing to unpack .../18-binutils-i686-linux-gnu_2.44-3_arm64.deb ...
Unpacking binutils-i686-linux-gnu (2.44-3) ...
Selecting previously unselected package gcc-14-cross-base.
Preparing to unpack .../19-gcc-14-cross-base_14.2.0-19cross1_all.deb ...
Unpacking gcc-14-cross-base (14.2.0-19cross1) ...
Selecting previously unselected package libc6-i386-cross.
Preparing to unpack .../20-libc6-i386-cross_2.41-6cross2_all.deb ...
Unpacking libc6-i386-cross (2.41-6cross2) ...
Selecting previously unselected package libgcc-s1-i386-cross.
Preparing to unpack .../21-libgcc-s1-i386-cross_14.2.0-19cross1_all.deb ...
Unpacking libgcc-s1-i386-cross (14.2.0-19cross1) ...
Selecting previously unselected package libgomp1-i386-cross.
Preparing to unpack .../22-libgomp1-i386-cross_14.2.0-19cross1_all.deb ...
Unpacking libgomp1-i386-cross (14.2.0-19cross1) ...
Selecting previously unselected package libitm1-i386-cross.
Preparing to unpack .../23-libitm1-i386-cross_14.2.0-19cross1_all.deb ...
Unpacking libitm1-i386-cross (14.2.0-19cross1) ...
Selecting previously unselected package libatomic1-i386-cross.
Preparing to unpack .../24-libatomic1-i386-cross_14.2.0-19cross1_all.deb ...
Unpacking libatomic1-i386-cross (14.2.0-19cross1) ...
Selecting previously unselected package libasan8-i386-cross.
Preparing to unpack .../25-libasan8-i386-cross_14.2.0-19cross1_all.deb ...
Unpacking libasan8-i386-cross (14.2.0-19cross1) ...
Selecting previously unselected package libstdc++6-i386-cross.
Preparing to unpack .../26-libstdc++6-i386-cross_14.2.0-19cross1_all.deb ...
Unpacking libstdc++6-i386-cross (14.2.0-19cross1) ...
Selecting previously unselected package libubsan1-i386-cross.
Preparing to unpack .../27-libubsan1-i386-cross_14.2.0-19cross1_all.deb ...
Unpacking libubsan1-i386-cross (14.2.0-19cross1) ...
Selecting previously unselected package libquadmath0-i386-cross.
Preparing to unpack .../28-libquadmath0-i386-cross_14.2.0-19cross1_all.deb ...
Unpacking libquadmath0-i386-cross (14.2.0-19cross1) ...
Selecting previously unselected package libgcc-14-dev-i386-cross.
Preparing to unpack .../29-libgcc-14-dev-i386-cross_14.2.0-19cross1_all.deb ...
Unpacking libgcc-14-dev-i386-cross (14.2.0-19cross1) ...
Selecting previously unselected package gcc-14-i686-linux-gnu.
Preparing to unpack .../30-gcc-14-i686-linux-gnu_14.2.0-19cross1_arm64.deb ...
Unpacking gcc-14-i686-linux-gnu (14.2.0-19cross1) ...
Selecting previously unselected package gcc-i686-linux-gnu.
Preparing to unpack .../31-gcc-i686-linux-gnu_4%3a14.2.0-1_arm64.deb ...
Unpacking gcc-i686-linux-gnu (4:14.2.0-1) ...
Selecting previously unselected package linux-libc-dev-i386-cross.
Preparing to unpack .../32-linux-libc-dev-i386-cross_6.12.17-1cross2_all.deb ...
Unpacking linux-libc-dev-i386-cross (6.12.17-1cross2) ...
Selecting previously unselected package libc6-dev-i386-cross.
Preparing to unpack .../33-libc6-dev-i386-cross_2.41-6cross2_all.deb ...
Unpacking libc6-dev-i386-cross (2.41-6cross2) ...
Selecting previously unselected package libstdc++-14-dev-i386-cross.
Preparing to unpack .../34-libstdc++-14-dev-i386-cross_14.2.0-19cross1_all.deb ...
Unpacking libstdc++-14-dev-i386-cross (14.2.0-19cross1) ...
Selecting previously unselected package g++-14-i686-linux-gnu.
Preparing to unpack .../35-g++-14-i686-linux-gnu_14.2.0-19cross1_arm64.deb ...
Unpacking g++-14-i686-linux-gnu (14.2.0-19cross1) ...
Selecting previously unselected package g++-i686-linux-gnu.
Preparing to unpack .../36-g++-i686-linux-gnu_4%3a14.2.0-1_arm64.deb ...
Unpacking g++-i686-linux-gnu (4:14.2.0-1) ...
Selecting previously unselected package crossbuild-essential-i386.
Preparing to unpack .../37-crossbuild-essential-i386_12.12_all.deb ...
Unpacking crossbuild-essential-i386 (12.12) ...
Selecting previously unselected package libdebhelper-perl.
Preparing to unpack .../38-libdebhelper-perl_13.24.2_all.deb ...
Unpacking libdebhelper-perl (13.24.2) ...
Selecting previously unselected package libtool.
Preparing to unpack .../39-libtool_2.5.4-4_all.deb ...
Unpacking libtool (2.5.4-4) ...
Selecting previously unselected package dh-autoreconf.
Preparing to unpack .../40-dh-autoreconf_20_all.deb ...
Unpacking dh-autoreconf (20) ...
Selecting previously unselected package libarchive-zip-perl.
Preparing to unpack .../41-libarchive-zip-perl_1.68-1_all.deb ...
Unpacking libarchive-zip-perl (1.68-1) ...
Selecting previously unselected package libfile-stripnondeterminism-perl.
Preparing to unpack .../42-libfile-stripnondeterminism-perl_1.14.1-2_all.deb ...
Unpacking libfile-stripnondeterminism-perl (1.14.1-2) ...
Selecting previously unselected package dh-strip-nondeterminism.
Preparing to unpack .../43-dh-strip-nondeterminism_1.14.1-2_all.deb ...
Unpacking dh-strip-nondeterminism (1.14.1-2) ...
Selecting previously unselected package libelf1t64:arm64.
Preparing to unpack .../44-libelf1t64_0.192-4_arm64.deb ...
Unpacking libelf1t64:arm64 (0.192-4) ...
Selecting previously unselected package dwz.
Preparing to unpack .../45-dwz_0.15-1+b1_arm64.deb ...
Unpacking dwz (0.15-1+b1) ...
Selecting previously unselected package libunistring5:arm64.
Preparing to unpack .../46-libunistring5_1.3-2_arm64.deb ...
Unpacking libunistring5:arm64 (1.3-2) ...
Selecting previously unselected package libxml2:arm64.
Preparing to unpack .../47-libxml2_2.12.7+dfsg+really2.9.14-0.4_arm64.deb ...
Unpacking libxml2:arm64 (2.12.7+dfsg+really2.9.14-0.4) ...
Selecting previously unselected package gettext.
Preparing to unpack .../48-gettext_0.23.1-2_arm64.deb ...
Unpacking gettext (0.23.1-2) ...
Selecting previously unselected package intltool-debian.
Preparing to unpack .../49-intltool-debian_0.35.0+20060710.6_all.deb ...
Unpacking intltool-debian (0.35.0+20060710.6) ...
Selecting previously unselected package po-debconf.
Preparing to unpack .../50-po-debconf_1.0.21+nmu1_all.deb ...
Unpacking po-debconf (1.0.21+nmu1) ...
Selecting previously unselected package debhelper.
Preparing to unpack .../51-debhelper_13.24.2_all.deb ...
Unpacking debhelper (13.24.2) ...
Selecting previously unselected package libfakeroot:arm64.
Preparing to unpack .../52-libfakeroot_1.37.1.1-1_arm64.deb ...
Unpacking libfakeroot:arm64 (1.37.1.1-1) ...
Selecting previously unselected package fakeroot.
Preparing to unpack .../53-fakeroot_1.37.1.1-1_arm64.deb ...
Unpacking fakeroot (1.37.1.1-1) ...
Selecting previously unselected package gcc-14-base:i386.
Preparing to unpack .../54-gcc-14-base_14.2.0-19_i386.deb ...
Unpacking gcc-14-base:i386 (14.2.0-19) ...
Selecting previously unselected package libgcc-s1:i386.
Preparing to unpack .../55-libgcc-s1_14.2.0-19_i386.deb ...
Unpacking libgcc-s1:i386 (14.2.0-19) ...
Selecting previously unselected package libc6:i386.
Preparing to unpack .../56-libc6_2.41-7_i386.deb ...
Unpacking libc6:i386 (2.41-7) ...
Selecting previously unselected package libasan8:i386.
Preparing to unpack .../57-libasan8_14.2.0-19_i386.deb ...
Unpacking libasan8:i386 (14.2.0-19) ...
Selecting previously unselected package libatomic1:i386.
Preparing to unpack .../58-libatomic1_14.2.0-19_i386.deb ...
Unpacking libatomic1:i386 (14.2.0-19) ...
Selecting previously unselected package libcrypt1:i386.
Preparing to unpack .../59-libcrypt1_1%3a4.4.38-1_i386.deb ...
Unpacking libcrypt1:i386 (1:4.4.38-1) ...
Selecting previously unselected package libcrypt-dev:i386.
Preparing to unpack .../60-libcrypt-dev_1%3a4.4.38-1_i386.deb ...
Unpacking libcrypt-dev:i386 (1:4.4.38-1) ...
Selecting previously unselected package libc6-dev:i386.
Preparing to unpack .../61-libc6-dev_2.41-7_i386.deb ...
Unpacking libc6-dev:i386 (2.41-7) ...
Selecting previously unselected package libgomp1:i386.
Preparing to unpack .../62-libgomp1_14.2.0-19_i386.deb ...
Unpacking libgomp1:i386 (14.2.0-19) ...
Selecting previously unselected package libitm1:i386.
Preparing to unpack .../63-libitm1_14.2.0-19_i386.deb ...
Unpacking libitm1:i386 (14.2.0-19) ...
Selecting previously unselected package libstdc++6:i386.
Preparing to unpack .../64-libstdc++6_14.2.0-19_i386.deb ...
Unpacking libstdc++6:i386 (14.2.0-19) ...
Selecting previously unselected package libubsan1:i386.
Preparing to unpack .../65-libubsan1_14.2.0-19_i386.deb ...
Unpacking libubsan1:i386 (14.2.0-19) ...
Selecting previously unselected package libquadmath0:i386.
Preparing to unpack .../66-libquadmath0_14.2.0-19_i386.deb ...
Unpacking libquadmath0:i386 (14.2.0-19) ...
Selecting previously unselected package libgcc-14-dev:i386.
Preparing to unpack .../67-libgcc-14-dev_14.2.0-19_i386.deb ...
Unpacking libgcc-14-dev:i386 (14.2.0-19) ...
Selecting previously unselected package libtinfo6:i386.
Preparing to unpack .../68-libtinfo6_6.5+20250216-2_i386.deb ...
Unpacking libtinfo6:i386 (6.5+20250216-2) ...
Selecting previously unselected package libncurses6:i386.
Preparing to unpack .../69-libncurses6_6.5+20250216-2_i386.deb ...
Unpacking libncurses6:i386 (6.5+20250216-2) ...
Selecting previously unselected package libncursesw6:i386.
Preparing to unpack .../70-libncursesw6_6.5+20250216-2_i386.deb ...
Unpacking libncursesw6:i386 (6.5+20250216-2) ...
Selecting previously unselected package libncurses-dev:i386.
Preparing to unpack .../71-libncurses-dev_6.5+20250216-2_i386.deb ...
Unpacking libncurses-dev:i386 (6.5+20250216-2) ...
Selecting previously unselected package libstdc++-14-dev:i386.
Preparing to unpack .../72-libstdc++-14-dev_14.2.0-19_i386.deb ...
Unpacking libstdc++-14-dev:i386 (14.2.0-19) ...
Selecting previously unselected package sbuild-build-depends-main-dummy:i386.
Preparing to unpack .../73-sbuild-build-depends-main-dummy_0.invalid.0_i386.deb ...
Unpacking sbuild-build-depends-main-dummy:i386 (0.invalid.0) ...
Setting up libpipeline1:arm64 (1.5.8-1) ...
Setting up bsdextrautils (2.41-4) ...
Setting up libmagic-mgc (1:5.46-5) ...
Setting up gcc-14-base:i386 (14.2.0-19) ...
Setting up libarchive-zip-perl (1.68-1) ...
Setting up binutils-i686-linux-gnu (2.44-3) ...
Setting up libdebhelper-perl (13.24.2) ...
Setting up libmagic1t64:arm64 (1:5.46-5) ...
Setting up gettext-base (0.23.1-2) ...
Setting up m4 (1.4.19-8) ...
Setting up gcc-14-i686-linux-gnu-base:arm64 (14.2.0-19cross1) ...
Setting up gcc-14-cross-base (14.2.0-19cross1) ...
Setting up file (1:5.46-5) ...
Setting up libfakeroot:arm64 (1.37.1.1-1) ...
Setting up libelf1t64:arm64 (0.192-4) ...
Setting up fakeroot (1.37.1.1-1) ...
update-alternatives: using /usr/bin/fakeroot-sysv to provide /usr/bin/fakeroot (fakeroot) in auto mode
Setting up linux-libc-dev-i386-cross (6.12.17-1cross2) ...
Setting up autotools-dev (20240727.1) ...
Setting up libunistring5:arm64 (1.3-2) ...
Setting up autopoint (0.23.1-2) ...
Setting up autoconf (2.72-3.1) ...
Setting up dwz (0.15-1+b1) ...
Setting up sensible-utils (0.0.25) ...
Setting up libuchardet0:arm64 (0.0.8-1+b2) ...
Setting up libc6-i386-cross (2.41-6cross2) ...
Setting up cpp-14-i686-linux-gnu (14.2.0-19cross1) ...
Setting up libquadmath0-i386-cross (14.2.0-19cross1) ...
Setting up libxml2:arm64 (2.12.7+dfsg+really2.9.14-0.4) ...
Setting up automake (1:1.17-4) ...
update-alternatives: using /usr/bin/automake-1.17 to provide /usr/bin/automake (automake) in auto mode
Setting up libfile-stripnondeterminism-perl (1.14.1-2) ...
Setting up gettext (0.23.1-2) ...
Setting up libtool (2.5.4-4) ...
Setting up libatomic1-i386-cross (14.2.0-19cross1) ...
Setting up libgomp1-i386-cross (14.2.0-19cross1) ...
Setting up libc6-dev-i386-cross (2.41-6cross2) ...
Setting up intltool-debian (0.35.0+20060710.6) ...
Setting up libgcc-s1-i386-cross (14.2.0-19cross1) ...
Setting up dh-autoreconf (20) ...
Setting up libitm1-i386-cross (14.2.0-19cross1) ...
Setting up dh-strip-nondeterminism (1.14.1-2) ...
Setting up groff-base (1.23.0-7) ...
Setting up cpp-i686-linux-gnu (4:14.2.0-1) ...
Setting up po-debconf (1.0.21+nmu1) ...
Setting up man-db (2.13.0-1) ...
Not building database; man-db/auto-update is not 'true'.
Setting up libasan8-i386-cross (14.2.0-19cross1) ...
Setting up libstdc++6-i386-cross (14.2.0-19cross1) ...
Setting up debhelper (13.24.2) ...
Setting up libubsan1-i386-cross (14.2.0-19cross1) ...
Setting up libgcc-14-dev-i386-cross (14.2.0-19cross1) ...
Setting up gcc-14-i686-linux-gnu (14.2.0-19cross1) ...
Setting up gcc-i686-linux-gnu (4:14.2.0-1) ...
Setting up libstdc++-14-dev-i386-cross (14.2.0-19cross1) ...
Setting up g++-14-i686-linux-gnu (14.2.0-19cross1) ...
Setting up g++-i686-linux-gnu (4:14.2.0-1) ...
Setting up crossbuild-essential-i386 (12.12) ...
Setting up libgcc-s1:i386 (14.2.0-19) ...
Setting up libc6:i386 (2.41-7) ...
Setting up libasan8:i386 (14.2.0-19) ...
Setting up libstdc++6:i386 (14.2.0-19) ...
Setting up libitm1:i386 (14.2.0-19) ...
Setting up libtinfo6:i386 (6.5+20250216-2) ...
Setting up libcrypt1:i386 (1:4.4.38-1) ...
Setting up libgomp1:i386 (14.2.0-19) ...
Setting up libncurses6:i386 (6.5+20250216-2) ...
Setting up libquadmath0:i386 (14.2.0-19) ...
Setting up libatomic1:i386 (14.2.0-19) ...
Setting up libncursesw6:i386 (6.5+20250216-2) ...
Setting up libubsan1:i386 (14.2.0-19) ...
Setting up libcrypt-dev:i386 (1:4.4.38-1) ...
Setting up libc6-dev:i386 (2.41-7) ...
Setting up libgcc-14-dev:i386 (14.2.0-19) ...
Setting up libstdc++-14-dev:i386 (14.2.0-19) ...
Setting up libncurses-dev:i386 (6.5+20250216-2) ...
Setting up sbuild-build-depends-main-dummy:i386 (0.invalid.0) ...
Processing triggers for libc-bin (2.41-7) ...

+------------------------------------------------------------------------------+
| Check architectures                                                          |
+------------------------------------------------------------------------------+

Arch check ok (i386 included in any)

+------------------------------------------------------------------------------+
| Build environment                                                            |
+------------------------------------------------------------------------------+

Kernel: Linux 6.1.0-28-arm64 #1 SMP Debian 6.1.119-1 (2024-11-22) arm64 (aarch64)
Toolchain package versions: binutils_2.44-3 dpkg-dev_1.22.18 g++-14_14.2.0-19 gcc-14_14.2.0-19 libc6-dev_2.41-7 libstdc++-14-dev_14.2.0-19 libstdc++-14-dev-i386-cross_14.2.0-19cross1 libstdc++6_14.2.0-19 libstdc++6-i386-cross_14.2.0-19cross1 linux-libc-dev_6.12.25-1
Package versions: apt_3.0.1 apt-utils_3.0.1 autoconf_2.72-3.1 automake_1:1.17-4 autopoint_0.23.1-2 autotools-dev_20240727.1 base-files_13.7 base-passwd_3.6.7 bash_5.2.37-2 binutils_2.44-3 binutils-aarch64-linux-gnu_2.44-3 binutils-common_2.44-3 binutils-i686-linux-gnu_2.44-3 bsdextrautils_2.41-4 bsdutils_1:2.41-4 build-essential_12.12 bzip2_1.0.8-6 coreutils_9.7-2 cpp_4:14.2.0-1 cpp-14_14.2.0-19 cpp-14-aarch64-linux-gnu_14.2.0-19 cpp-14-i686-linux-gnu_14.2.0-19cross1 cpp-aarch64-linux-gnu_4:14.2.0-1 cpp-i686-linux-gnu_4:14.2.0-1 crossbuild-essential-i386_12.12 dash_0.5.12-12 debconf_1.5.91 debhelper_13.24.2 debian-archive-keyring_2025.1 debianutils_5.22 dh-autoreconf_20 dh-strip-nondeterminism_1.14.1-2 diffutils_1:3.10-4 dpkg_1.22.18 dpkg-dev_1.22.18 dwz_0.15-1+b1 fakeroot_1.37.1.1-1 file_1:5.46-5 findutils_4.10.0-3 g++_4:14.2.0-1 g++-14_14.2.0-19 g++-14-aarch64-linux-gnu_14.2.0-19 g++-14-i686-linux-gnu_14.2.0-19cross1 g++-aarch64-linux-gnu_4:14.2.0-1 g++-i686-linux-gnu_4:14.2.0-1 gcc_4:14.2.0-1 gcc-14_14.2.0-19 gcc-14-aarch64-linux-gnu_14.2.0-19 gcc-14-base_14.2.0-19 gcc-14-cross-base_14.2.0-19cross1 gcc-14-i686-linux-gnu_14.2.0-19cross1 gcc-14-i686-linux-gnu-base_14.2.0-19cross1 gcc-aarch64-linux-gnu_4:14.2.0-1 gcc-i686-linux-gnu_4:14.2.0-1 gettext_0.23.1-2 gettext-base_0.23.1-2 grep_3.11-4+b1 groff-base_1.23.0-7 gzip_1.13-1 hostname_3.25 init-system-helpers_1.68 intltool-debian_0.35.0+20060710.6 libacl1_2.3.2-2+b1 libapt-pkg7.0_3.0.1 libarchive-zip-perl_1.68-1 libasan8_14.2.0-19 libasan8-i386-cross_14.2.0-19cross1 libatomic1_14.2.0-19 libatomic1-i386-cross_14.2.0-19cross1 libattr1_1:2.5.2-3 libaudit-common_1:4.0.2-2 libaudit1_1:4.0.2-2+b2 libbinutils_2.44-3 libblkid1_2.41-4 libbz2-1.0_1.0.8-6 libc-bin_2.41-7 libc-dev-bin_2.41-7 libc6_2.41-7 libc6-dev_2.41-7 libc6-dev-i386-cross_2.41-6cross2 libc6-i386-cross_2.41-6cross2 libcap-ng0_0.8.5-4+b1 libcap2_1:2.75-7 libcc1-0_14.2.0-19 libcrypt-dev_1:4.4.38-1 libcrypt1_1:4.4.38-1 libctf-nobfd0_2.44-3 libctf0_2.44-3 libdb5.3t64_5.3.28+dfsg2-9 libdebconfclient0_0.278 libdebhelper-perl_13.24.2 libdpkg-perl_1.22.18 libelf1t64_0.192-4 libfakeroot_1.37.1.1-1 libfile-stripnondeterminism-perl_1.14.1-2 libgcc-14-dev_14.2.0-19 libgcc-14-dev-i386-cross_14.2.0-19cross1 libgcc-s1_14.2.0-19 libgcc-s1-i386-cross_14.2.0-19cross1 libgdbm-compat4t64_1.24-2 libgdbm6t64_1.24-2 libgmp10_2:6.3.0+dfsg-3 libgomp1_14.2.0-19 libgomp1-i386-cross_14.2.0-19cross1 libgprofng0_2.44-3 libhogweed6t64_3.10.1-1 libhwasan0_14.2.0-19 libisl23_0.27-1 libitm1_14.2.0-19 libitm1-i386-cross_14.2.0-19cross1 libjansson4_2.14-2+b3 liblastlog2-2_2.41-4 liblsan0_14.2.0-19 liblz4-1_1.10.0-4 liblzma5_5.8.1-1 libmagic-mgc_1:5.46-5 libmagic1t64_1:5.46-5 libmd0_1.1.0-2+b1 libmount1_2.41-4 libmpc3_1.3.1-1+b3 libmpfr6_4.2.2-1 libncurses-dev_6.5+20250216-2 libncurses6_6.5+20250216-2 libncursesw6_6.5+20250216-2 libnettle8t64_3.10.1-1 libpam-modules_1.7.0-3 libpam-modules-bin_1.7.0-3 libpam-runtime_1.7.0-3 libpam0g_1.7.0-3 libpcre2-8-0_10.45-1 libperl5.40_5.40.1-3 libpipeline1_1.5.8-1 libquadmath0_14.2.0-19 libquadmath0-i386-cross_14.2.0-19cross1 libseccomp2_2.6.0-2 libselinux1_3.8.1-1 libsframe1_2.44-3 libsmartcols1_2.41-4 libsqlite3-0_3.46.1-3 libssl3t64_3.5.0-1 libstdc++-14-dev_14.2.0-19 libstdc++-14-dev-i386-cross_14.2.0-19cross1 libstdc++6_14.2.0-19 libstdc++6-i386-cross_14.2.0-19cross1 libsystemd0_257.5-2 libtinfo6_6.5+20250216-2 libtool_2.5.4-4 libtsan2_14.2.0-19 libubsan1_14.2.0-19 libubsan1-i386-cross_14.2.0-19cross1 libuchardet0_0.0.8-1+b2 libudev1_257.5-2 libunistring5_1.3-2 libuuid1_2.41-4 libxml2_2.12.7+dfsg+really2.9.14-0.4 libxxhash0_0.8.3-2 libzstd1_1.5.7+dfsg-1 linux-libc-dev_6.12.25-1 linux-libc-dev-i386-cross_6.12.17-1cross2 login_1:4.16.0-2+really2.41-4 login.defs_1:4.17.4-2 m4_1.4.19-8 make_4.4.1-2 man-db_2.13.0-1 mawk_1.3.4.20250131-1 ncurses-base_6.5+20250216-2 ncurses-bin_6.5+20250216-2 openssl-provider-legacy_3.5.0-1 patch_2.8-1 perl_5.40.1-3 perl-base_5.40.1-3 perl-modules-5.40_5.40.1-3 po-debconf_1.0.21+nmu1 rpcsvc-proto_1.4.3-1+b1 sbuild-build-depends-main-dummy_0.invalid.0 sed_4.9-2+b1 sensible-utils_0.0.25 sqv_1.3.0-1 sysvinit-utils_3.14-4 tar_1.35+dfsg-3.1 util-linux_2.41-4 xz-utils_5.8.1-1 zlib1g_1:1.3.dfsg+really1.3.1-1+b1

+------------------------------------------------------------------------------+
| Build                                                                        |
+------------------------------------------------------------------------------+


Unpack source
-------------

-----BEGIN PGP SIGNED MESSAGE-----
Hash: SHA512

Format: 3.0 (quilt)
Source: nn
Binary: nn
Architecture: any
Version: 6.7.3-16
Maintainer: Cord Beermann <cord@debian.org>
Homepage: http://www.nndev.org
Standards-Version: 4.7.2
Build-Depends: debhelper-compat (= 13), po-debconf, libncurses-dev
Package-List:
 nn deb news optional arch=any
Checksums-Sha1:
 114caf94bff0053a7406c430f217d51e0668e125 474945 nn_6.7.3.orig.tar.gz
 0280129f6a11148ff9d26151ad77184befff5acb 31072 nn_6.7.3-16.debian.tar.xz
Checksums-Sha256:
 f696e9e2115ea4019398fc06aadcf07c43822559210cd05daf20801ea733f3ba 474945 nn_6.7.3.orig.tar.gz
 0af585d2aa3876b4e8b298d66681668d5ceca75399f48b12d2dfbaa2d590fabe 31072 nn_6.7.3-16.debian.tar.xz
Files:
 98e9cafed68509b44cf8c8acaf373eff 474945 nn_6.7.3.orig.tar.gz
 ee90067771bf31662d85377def858aaf 31072 nn_6.7.3-16.debian.tar.xz


-----BEGIN PGP SIGNATURE-----

iQIzBAEBCgAdFiEEEs9WBfeo2KZ4m5tTmFYdLSUC/jkFAmfe8koACgkQmFYdLSUC
/jn+mhAAiGVM9NEbV0i0qDDIFHTn+A0jcwJ1nmagc+VNJjv7RA916fRmswqw0gA/
K9SfRb/tOeunKSdJFAMfG6GYei2cJUxqC8BGiTEHEuOwwCukF+zVD8a75lJJA8No
I99H/OtJESzdYEXCrPa/eiOm/xB7wzWPB7RK4vxneqN3tfexyZGXSCmrZGm9dzab
r/UvdeviruGh28WpP/as0tY+eY4wjcmD+MCerXhGQI9BzXcM7958slOt+ICA7qhl
Ko35jtpSN4kvDsdxLzBbqQ4l5OgwQJSi8JX/Us5M5HPRiOxdmi9ThXx95jnGmJ7T
Wd7AUnXQ3Id7G2be5/1NM0Rc3sRad9j+B75gfdNIg1r6o+D1Yc6AG0PYvV8g6SMo
CplgJRJXh5j/Yj8sq0J8Tbsozqq0hJ7knjPglPXYtM4BbcgCQa+tJIuPJ2mePxp4
AXi9niiCzsguo3LDJ+Asg8t05PnafYJZvHmnydpsc75IEjVkNWE/KD/MSjmvQj5m
x5f3aVd7timiYiNWU84RI9SHrbZCghcIXwNufDa0VVs9MKEq4fh+1DpBeCyJSBiF
lSK4iK+KKyN9IlLOAjmihUYdixrL5k5LcllLKKm8CNMMfvE/MYL+GF+X5TwMAM/p
s4k4mqRFPM84spnRDBXKcU0V46vYuCOCK7FAu01TR1NawZJgsmw=
=af+K
-----END PGP SIGNATURE-----

dpkg-source: warning: cannot verify inline signature for ./nn_6.7.3-16.dsc: unsupported subcommand
dpkg-source: info: extracting nn in /<<PKGBUILDDIR>>
dpkg-source: info: unpacking nn_6.7.3.orig.tar.gz
dpkg-source: info: unpacking nn_6.7.3-16.debian.tar.xz
dpkg-source: info: using patch list from debian/patches/series
dpkg-source: info: applying 00-makefile.diff
dpkg-source: info: applying 01-getline.diff
dpkg-source: info: applying 02-stropts.diff
dpkg-source: info: applying 03-installation.diff
dpkg-source: info: applying 04-spelling.diff
dpkg-source: info: applying 05-fix-compile.diff
dpkg-source: info: applying 06-maintainers-additions.diff
dpkg-source: info: applying 07-gcc-10.diff

Check disk space
----------------

Sufficient free space for build

User Environment
----------------

APT_CONFIG=/var/lib/sbuild/apt.conf
CONFIG_SITE=/etc/dpkg-cross/cross-config.i386
DEB_BUILD_OPTIONS=nocheck
HOME=/var/lib/sbuild
LANG=en_GB.UTF-8
LC_ALL=C.UTF-8
LOGNAME=helmut
OLDPWD=/
PATH=/usr/local/sbin:/usr/local/bin:/usr/sbin:/usr/bin:/sbin:/bin:/usr/games
PWD=/<<PKGBUILDDIR>>
SHELL=/bin/sh
USER=helmut

dpkg-buildpackage
-----------------

Command: dpkg-buildpackage --sanitize-env -ai386 -Pcross,nocheck -us -uc -B -rfakeroot --jobs-try=1
dpkg-buildpackage: info: source package nn
dpkg-buildpackage: info: source version 6.7.3-16
dpkg-buildpackage: info: source distribution unstable
dpkg-buildpackage: info: source changed by Cord Beermann <cord@debian.org>
dpkg-architecture: warning: specified GNU system type i686-linux-gnu does not match CC system type aarch64-linux-gnu, try setting a correct CC environment variable
 dpkg-source --before-build .
dpkg-buildpackage: info: host architecture i386
 debian/rules clean
dh clean
   debian/rules override_dh_auto_clean
make[1]: Entering directory '/<<PKGBUILDDIR>>'
cp -f debian/config.h .
dh_auto_clean
	make -j1 clean
make[2]: Entering directory '/<<PKGBUILDDIR>>'
cp xmakefile MF.c
cc -E -DCOMPILER="cc" -DPREPROC="cc -E" \
       -DLDEBUG="-Wl,-z,relro -Wl,-z,now" \
       -DCDEBUG="-O " -Iconf MF.c | \
sed -e '1,/MAKE WILL CUT HERE/d' \
    -e '/^#/d' \
    -e 's/^  */	/' \
    -e '/^[ \f	]$/d' \
    -e '/^[ \/]*[*]/d' | \
sed -n -e '/^..*$/p' > ymakefile
rm -f MF.c
make -f ymakefile clean
make[3]: Entering directory '/<<PKGBUILDDIR>>'
rm -f nn nnusage nngrab nnstats aux upgrade_rc back_act nnspew cvt-help usercheck
rm -f prefix mkprefix inst
rm -f man/nn.1
make[3]: Leaving directory '/<<PKGBUILDDIR>>'
rm -f *.o *~ ymakefile
make[2]: Leaving directory '/<<PKGBUILDDIR>>'
rm config.h
make[1]: Leaving directory '/<<PKGBUILDDIR>>'
   debian/rules override_dh_clean
make[1]: Entering directory '/<<PKGBUILDDIR>>'
dh_clean
	rm -f debian/debhelper-build-stamp
	rm -rf debian/.debhelper/
	rm -f -- debian/nn.substvars debian/files
	rm -fr -- debian/nn/ debian/tmp/
	find .  \( \( \
		\( -path .\*/.git -o -path .\*/.svn -o -path .\*/.bzr -o -path .\*/.hg -o -path .\*/CVS -o -path .\*/.pc -o -path .\*/_darcs \) -prune -o -type f -a \
	        \( -name '#*#' -o -name '.*~' -o -name '*~' -o -name DEADJOE \
		 -o -name '*.orig' -o -name '*.rej' -o -name '*.bak' \
		 -o -name '.*.orig' -o -name .*.rej -o -name '.SUMS' \
		 -o -name TAGS -o \( -path '*/.deps/*' -a -name '*.P' \) \
		\) -exec rm -f {} + \) -o \
		\( -type d -a \( -name autom4te.cache -o -name __pycache__ \) -prune -exec rm -rf {} + \) \)
rm -f update.h
debconf-updatepo
make[1]: Leaving directory '/<<PKGBUILDDIR>>'
 debian/rules binary-arch
dh binary-arch
   dh_update_autotools_config -a
   dh_autoreconf -a
   debian/rules override_dh_auto_configure
make[1]: Entering directory '/<<PKGBUILDDIR>>'
cp -f debian/config.h .
make[1]: Leaving directory '/<<PKGBUILDDIR>>'
   debian/rules override_dh_auto_build
make[1]: Entering directory '/<<PKGBUILDDIR>>'
dh_auto_build -- \
	CFLAGS="-g -O2 -Werror=implicit-function-declaration -ffile-prefix-map=/<<PKGBUILDDIR>>=. -fstack-protector-strong -Wformat -Werror=format-security" \
                CPPFLAGS="-Wdate-time -D_FORTIFY_SOURCE=2" \
                LDFLAGS="-Wl,-z,relro -Wl,-z,now" \
                LOCALCC=aarch64-linux-gnu-gcc
	make -j1 "INSTALL=install --strip-program=true" PKG_CONFIG=i686-linux-gnu-pkg-config CXX=i686-linux-gnu-g\+\+ CC=i686-linux-gnu-gcc "CFLAGS=-g -O2 -Werror=implicit-function-declaration -ffile-prefix-map=/<<PKGBUILDDIR>>=. -fstack-protector-strong -Wformat -Werror=format-security" "CPPFLAGS=-Wdate-time -D_FORTIFY_SOURCE=2" "LDFLAGS=-Wl,-z,relro -Wl,-z,now" LOCALCC=aarch64-linux-gnu-gcc
make[2]: Entering directory '/<<PKGBUILDDIR>>'
cp xmakefile MF.c
i686-linux-gnu-gcc -E -DCOMPILER="i686-linux-gnu-gcc" -DPREPROC="i686-linux-gnu-gcc -E" \
       -DLDEBUG="-Wl,-z,relro -Wl,-z,now" \
       -DCDEBUG="-g -O2 -Werror=implicit-function-declaration -ffile-prefix-map=/<<PKGBUILDDIR>>=. -fstack-protector-strong -Wformat -Werror=format-security" -Iconf MF.c | \
sed -e '1,/MAKE WILL CUT HERE/d' \
    -e '/^#/d' \
    -e 's/^  */	/' \
    -e '/^[ \f	]$/d' \
    -e '/^[ \/]*[*]/d' | \
sed -n -e '/^..*$/p' > ymakefile
rm -f MF.c
make -j1 -f ymakefile all
make[3]: Entering directory '/<<PKGBUILDDIR>>'
i686-linux-gnu-gcc -g -O2 -Werror=implicit-function-declaration -ffile-prefix-map=/<<PKGBUILDDIR>>=. -fstack-protector-strong -Wformat -Werror=format-security -Wdate-time -D_FORTIFY_SOURCE=2  -c -o nn.o nn.c
i686-linux-gnu-gcc -g -O2 -Werror=implicit-function-declaration -ffile-prefix-map=/<<PKGBUILDDIR>>=. -fstack-protector-strong -Wformat -Werror=format-security -Wdate-time -D_FORTIFY_SOURCE=2  -c -o admin.o admin.c
admin.c: In function ‘find_files’:
admin.c:215:5: warning: ignoring return value of ‘system’ declared with attribute ‘warn_unused_result’ [-Wunused-result]
  215 |     system(command);
      |     ^~~~~~~~~~~~~~~
admin.c: In function ‘get_entry’:
admin.c:115:5: warning: ignoring return value of ‘fgets’ declared with attribute ‘warn_unused_result’ [-Wunused-result]
  115 |     fgets(buf, sizeof(buf), stdin);
      |     ^~~~~~~~~~~~~~~~~~~~~~~~~~~~~~
admin.c: In function ‘rmgroup’:
admin.c:905:5: warning: ignoring return value of ‘system’ declared with attribute ‘warn_unused_result’ [-Wunused-result]
  905 |     system(command);
      |     ^~~~~~~~~~~~~~~
admin.c: In function ‘log_admin’:
admin.c:782:9: warning: ignoring return value of ‘system’ declared with attribute ‘warn_unused_result’ [-Wunused-result]
  782 |         system(command);
      |         ^~~~~~~~~~~~~~~
admin.c:792:9: warning: ignoring return value of ‘system’ declared with attribute ‘warn_unused_result’ [-Wunused-result]
  792 |         system(command);
      |         ^~~~~~~~~~~~~~~
admin.c:799:5: warning: ignoring return value of ‘system’ declared with attribute ‘warn_unused_result’ [-Wunused-result]
  799 |     system(command);
      |     ^~~~~~~~~~~~~~~
i686-linux-gnu-gcc -g -O2 -Werror=implicit-function-declaration -ffile-prefix-map=/<<PKGBUILDDIR>>=. -fstack-protector-strong -Wformat -Werror=format-security -Wdate-time -D_FORTIFY_SOURCE=2  -c -o proto.o proto.c
proto.c: In function ‘read_lock’:
proto.c:85:5: warning: ignoring return value of ‘fgets’ declared with attribute ‘warn_unused_result’ [-Wunused-result]
   85 |     fgets(pid, 10, m_pid);
      |     ^~~~~~~~~~~~~~~~~~~~~
proto.c:86:5: warning: ignoring return value of ‘fgets’ declared with attribute ‘warn_unused_result’ [-Wunused-result]
   86 |     fgets(proto_host, HOSTBUF, m_pid);
      |     ^~~~~~~~~~~~~~~~~~~~~~~~~~~~~~~~~
configuration number updated to 1
i686-linux-gnu-gcc -g -O2 -Werror=implicit-function-declaration -ffile-prefix-map=/<<PKGBUILDDIR>>=. -fstack-protector-strong -Wformat -Werror=format-security -Wdate-time -D_FORTIFY_SOURCE=2  -c -o global.o global.c
i686-linux-gnu-gcc -g -O2 -Werror=implicit-function-declaration -ffile-prefix-map=/<<PKGBUILDDIR>>=. -fstack-protector-strong -Wformat -Werror=format-security -Wdate-time -D_FORTIFY_SOURCE=2  -c -o options.o options.c
i686-linux-gnu-gcc -g -O2 -Werror=implicit-function-declaration -ffile-prefix-map=/<<PKGBUILDDIR>>=. -fstack-protector-strong -Wformat -Werror=format-security -Wdate-time -D_FORTIFY_SOURCE=2  -c -o db.o db.c
i686-linux-gnu-gcc -g -O2 -Werror=implicit-function-declaration -ffile-prefix-map=/<<PKGBUILDDIR>>=. -fstack-protector-strong -Wformat -Werror=format-security -Wdate-time -D_FORTIFY_SOURCE=2  -c -o nntp.o nntp.c
nntp.c: In function ‘nntp_doauth’:
nntp.c:1438:16: warning: ignoring return value of ‘fgets’ declared with attribute ‘warn_unused_result’ [-Wunused-result]
 1438 |         (void) fgets(line + len, sizeof(line) - len, stdin);
      |                ^~~~~~~~~~~~~~~~~~~~~~~~~~~~~~~~~~~~~~~~~~~~
i686-linux-gnu-gcc -g -O2 -Werror=implicit-function-declaration -ffile-prefix-map=/<<PKGBUILDDIR>>=. -fstack-protector-strong -Wformat -Werror=format-security -Wdate-time -D_FORTIFY_SOURCE=2  -c -o init.o init.c
i686-linux-gnu-gcc -g -O2 -Werror=implicit-function-declaration -ffile-prefix-map=/<<PKGBUILDDIR>>=. -fstack-protector-strong -Wformat -Werror=format-security -Wdate-time -D_FORTIFY_SOURCE=2  -c -o variable.o variable.c
i686-linux-gnu-gcc -g -O2 -Werror=implicit-function-declaration -ffile-prefix-map=/<<PKGBUILDDIR>>=. -fstack-protector-strong -Wformat -Werror=format-security -Wdate-time -D_FORTIFY_SOURCE=2  -c -o term.o term.c
term.c: In function ‘get_c’:
term.c:1738:25: warning: comparison between pointer and zero character constant [-Wpointer-compare]
 1738 |         if (mk->cur_key == NUL)
      |                         ^~
term.c:1738:13: note: did you mean to dereference the pointer?
 1738 |         if (mk->cur_key == NUL)
      |             ^
i686-linux-gnu-gcc -g -O2 -Werror=implicit-function-declaration -ffile-prefix-map=/<<PKGBUILDDIR>>=. -fstack-protector-strong -Wformat -Werror=format-security -Wdate-time -D_FORTIFY_SOURCE=2  -c -o keymap.o keymap.c
i686-linux-gnu-gcc -g -O2 -Werror=implicit-function-declaration -ffile-prefix-map=/<<PKGBUILDDIR>>=. -fstack-protector-strong -Wformat -Werror=format-security -Wdate-time -D_FORTIFY_SOURCE=2  -c -o macro.o macro.c
macro.c: In function ‘m_define’:
macro.c:265:29: warning: ‘%s’ directive writing up to 1023 bytes into a region of size 65 [-Wformat-overflow=]
  265 |     m_error("Unknown word >>%s<<", w);
      |                             ^~
In file included from /usr/i686-linux-gnu/include/stdio.h:970,
                 from global.h:11,
                 from macro.c:12:
In function ‘sprintf’,
    inlined from ‘m_error’ at macro.c:111:2,
    inlined from ‘parse_word’ at macro.c:265:5,
    inlined from ‘parse_line’ at macro.c:337:6,
    inlined from ‘m_define’ at macro.c:399:15:
/usr/i686-linux-gnu/include/bits/stdio2.h:30:10: note: ‘__builtin___sprintf_chk’ output between 18 and 1041 bytes into a destination of size 80
   30 |   return __builtin___sprintf_chk (__s, __USE_FORTIFY_LEVEL - 1,
      |          ^~~~~~~~~~~~~~~~~~~~~~~~~~~~~~~~~~~~~~~~~~~~~~~~~~~~~~
   31 |                                   __glibc_objsize (__s), __fmt,
      |                                   ~~~~~~~~~~~~~~~~~~~~~~~~~~~~~
   32 |                                   __va_arg_pack ());
      |                                   ~~~~~~~~~~~~~~~~~
i686-linux-gnu-gcc -g -O2 -Werror=implicit-function-declaration -ffile-prefix-map=/<<PKGBUILDDIR>>=. -fstack-protector-strong -Wformat -Werror=format-security -Wdate-time -D_FORTIFY_SOURCE=2  -c -o regexp.o regexp.c
i686-linux-gnu-gcc -g -O2 -Werror=implicit-function-declaration -ffile-prefix-map=/<<PKGBUILDDIR>>=. -fstack-protector-strong -Wformat -Werror=format-security -Wdate-time -D_FORTIFY_SOURCE=2  -c -o menu.o menu.c
menu.c: In function ‘show_articles’:
menu.c:814:45: warning: format ‘%ld’ expects argument of type ‘long int’, but argument 3 has type ‘int’ [-Wformat=]
  814 |             sprintf(delayed_msg, "Showing %ld articles again", again);
      |                                           ~~^                  ~~~~~
      |                                             |                  |
      |                                             long int           int
      |                                           %d
menu.c: In function ‘closed_attr’:
menu.c:296:23: warning: ‘%d’ directive writing between 1 and 11 bytes into a region of size 10 [-Wformat-overflow=]
  296 |         sprintf(lft, "%d,", mi->mi_left);
      |                       ^~
menu.c:296:22: note: directive argument in the range [-2147483648, 2147483646]
  296 |         sprintf(lft, "%d,", mi->mi_left);
      |                      ^~~~~
In file included from /usr/i686-linux-gnu/include/stdio.h:970,
                 from global.h:11,
                 from menu.c:11:
In function ‘sprintf’,
    inlined from ‘closed_attr’ at menu.c:296:2:
/usr/i686-linux-gnu/include/bits/stdio2.h:30:10: note: ‘__builtin___sprintf_chk’ output between 3 and 13 bytes into a destination of size 10
   30 |   return __builtin___sprintf_chk (__s, __USE_FORTIFY_LEVEL - 1,
      |          ^~~~~~~~~~~~~~~~~~~~~~~~~~~~~~~~~~~~~~~~~~~~~~~~~~~~~~
   31 |                                   __glibc_objsize (__s), __fmt,
      |                                   ~~~~~~~~~~~~~~~~~~~~~~~~~~~~~
   32 |                                   __va_arg_pack ());
      |                                   ~~~~~~~~~~~~~~~~~
menu.c: In function ‘closed_attr’:
menu.c:298:23: warning: ‘%d’ directive writing between 1 and 11 bytes into a region of size 10 [-Wformat-overflow=]
  298 |         sprintf(sel, "%d/", mi->mi_selected);
      |                       ^~
menu.c:298:22: note: directive argument in the range [-2147483648, 2147483646]
  298 |         sprintf(sel, "%d/", mi->mi_selected);
      |                      ^~~~~
In function ‘sprintf’,
    inlined from ‘closed_attr’ at menu.c:298:2:
/usr/i686-linux-gnu/include/bits/stdio2.h:30:10: note: ‘__builtin___sprintf_chk’ output between 3 and 13 bytes into a destination of size 10
   30 |   return __builtin___sprintf_chk (__s, __USE_FORTIFY_LEVEL - 1,
      |          ^~~~~~~~~~~~~~~~~~~~~~~~~~~~~~~~~~~~~~~~~~~~~~~~~~~~~~
   31 |                                   __glibc_objsize (__s), __fmt,
      |                                   ~~~~~~~~~~~~~~~~~~~~~~~~~~~~~
   32 |                                   __va_arg_pack ());
      |                                   ~~~~~~~~~~~~~~~~~
menu.c: In function ‘closed_attr’:
menu.c:300:23: warning: ‘%d’ directive writing between 1 and 11 bytes into a region of size 10 [-Wformat-overflow=]
  300 |         sprintf(unr, "%d:", mi->mi_unread);
      |                       ^~
menu.c:300:22: note: directive argument in the range [-2147483648, 2147483646]
  300 |         sprintf(unr, "%d:", mi->mi_unread);
      |                      ^~~~~
In function ‘sprintf’,
    inlined from ‘closed_attr’ at menu.c:300:2:
/usr/i686-linux-gnu/include/bits/stdio2.h:30:10: note: ‘__builtin___sprintf_chk’ output between 3 and 13 bytes into a destination of size 10
   30 |   return __builtin___sprintf_chk (__s, __USE_FORTIFY_LEVEL - 1,
      |          ^~~~~~~~~~~~~~~~~~~~~~~~~~~~~~~~~~~~~~~~~~~~~~~~~~~~~~
   31 |                                   __glibc_objsize (__s), __fmt,
      |                                   ~~~~~~~~~~~~~~~~~~~~~~~~~~~~~
   32 |                                   __va_arg_pack ());
      |                                   ~~~~~~~~~~~~~~~~~
i686-linux-gnu-gcc -g -O2 -Werror=implicit-function-declaration -ffile-prefix-map=/<<PKGBUILDDIR>>=. -fstack-protector-strong -Wformat -Werror=format-security -Wdate-time -D_FORTIFY_SOURCE=2  -c -o more.o more.c
i686-linux-gnu-gcc -g -O2 -Werror=implicit-function-declaration -ffile-prefix-map=/<<PKGBUILDDIR>>=. -fstack-protector-strong -Wformat -Werror=format-security -Wdate-time -D_FORTIFY_SOURCE=2  -c -o newsrc.o newsrc.c
newsrc.c: In function ‘visit_rc_file’:
newsrc.c:399:9: warning: ignoring return value of ‘system’ declared with attribute ‘warn_unused_result’ [-Wunused-result]
  399 |         system(bak);
      |         ^~~~~~~~~~~
i686-linux-gnu-gcc -g -O2 -Werror=implicit-function-declaration -ffile-prefix-map=/<<PKGBUILDDIR>>=. -fstack-protector-strong -Wformat -Werror=format-security -Wdate-time -D_FORTIFY_SOURCE=2  -c -o group.o group.c
i686-linux-gnu-gcc -g -O2 -Werror=implicit-function-declaration -ffile-prefix-map=/<<PKGBUILDDIR>>=. -fstack-protector-strong -Wformat -Werror=format-security -Wdate-time -D_FORTIFY_SOURCE=2  -c -o folder.o folder.c
i686-linux-gnu-gcc -g -O2 -Werror=implicit-function-declaration -ffile-prefix-map=/<<PKGBUILDDIR>>=. -fstack-protector-strong -Wformat -Werror=format-security -Wdate-time -D_FORTIFY_SOURCE=2  -c -o dir.o dir.c
i686-linux-gnu-gcc -g -O2 -Werror=implicit-function-declaration -ffile-prefix-map=/<<PKGBUILDDIR>>=. -fstack-protector-strong -Wformat -Werror=format-security -Wdate-time -D_FORTIFY_SOURCE=2  -c -o aux.o aux.c
aux.c: In function ‘aux_sh’:
aux.c:456:17: warning: ignoring return value of ‘system’ declared with attribute ‘warn_unused_result’ [-Wunused-result]
  456 |                 system(buf);
      |                 ^~~~~~~~~~~
aux.c:498:21: warning: ignoring return value of ‘system’ declared with attribute ‘warn_unused_result’ [-Wunused-result]
  498 |                     system(buf);
      |                     ^~~~~~~~~~~
aux.c:549:17: warning: ignoring return value of ‘system’ declared with attribute ‘warn_unused_result’ [-Wunused-result]
  549 |                 system(buf);
      |                 ^~~~~~~~~~~
aux.c:572:17: warning: ignoring return value of ‘system’ declared with attribute ‘warn_unused_result’ [-Wunused-result]
  572 |                 system(buf);
      |                 ^~~~~~~~~~~
aux.c:574:17: warning: ignoring return value of ‘system’ declared with attribute ‘warn_unused_result’ [-Wunused-result]
  574 |                 system(buf);
      |                 ^~~~~~~~~~~
aux.c:583:21: warning: ignoring return value of ‘system’ declared with attribute ‘warn_unused_result’ [-Wunused-result]
  583 |                     system(buf);
      |                     ^~~~~~~~~~~
aux.c:585:21: warning: ignoring return value of ‘system’ declared with attribute ‘warn_unused_result’ [-Wunused-result]
  585 |                     system(buf);
      |                     ^~~~~~~~~~~
aux.c:603:13: warning: ignoring return value of ‘system’ declared with attribute ‘warn_unused_result’ [-Wunused-result]
  603 |             system(buf);
      |             ^~~~~~~~~~~
aux.c:673:13: warning: ignoring return value of ‘system’ declared with attribute ‘warn_unused_result’ [-Wunused-result]
  673 |             system(buf);
      |             ^~~~~~~~~~~
aux.c:681:13: warning: ignoring return value of ‘system’ declared with attribute ‘warn_unused_result’ [-Wunused-result]
  681 |             system(buf);
      |             ^~~~~~~~~~~
i686-linux-gnu-gcc -g -O2 -Werror=implicit-function-declaration -ffile-prefix-map=/<<PKGBUILDDIR>>=. -fstack-protector-strong -Wformat -Werror=format-security -Wdate-time -D_FORTIFY_SOURCE=2  -c -o sort.o sort.c
i686-linux-gnu-gcc -g -O2 -Werror=implicit-function-declaration -ffile-prefix-map=/<<PKGBUILDDIR>>=. -fstack-protector-strong -Wformat -Werror=format-security -Wdate-time -D_FORTIFY_SOURCE=2  -c -o articles.o articles.c
i686-linux-gnu-gcc -g -O2 -Werror=implicit-function-declaration -ffile-prefix-map=/<<PKGBUILDDIR>>=. -fstack-protector-strong -Wformat -Werror=format-security -Wdate-time -D_FORTIFY_SOURCE=2  -c -o sequence.o sequence.c
i686-linux-gnu-gcc -g -O2 -Werror=implicit-function-declaration -ffile-prefix-map=/<<PKGBUILDDIR>>=. -fstack-protector-strong -Wformat -Werror=format-security -Wdate-time -D_FORTIFY_SOURCE=2  -c -o kill.o kill.c
i686-linux-gnu-gcc -g -O2 -Werror=implicit-function-declaration -ffile-prefix-map=/<<PKGBUILDDIR>>=. -fstack-protector-strong -Wformat -Werror=format-security -Wdate-time -D_FORTIFY_SOURCE=2  -c -o active.o active.c
i686-linux-gnu-gcc -g -O2 -Werror=implicit-function-declaration -ffile-prefix-map=/<<PKGBUILDDIR>>=. -fstack-protector-strong -Wformat -Werror=format-security -Wdate-time -D_FORTIFY_SOURCE=2  -c -o fullname.o fullname.c
i686-linux-gnu-gcc -g -O2 -Werror=implicit-function-declaration -ffile-prefix-map=/<<PKGBUILDDIR>>=. -fstack-protector-strong -Wformat -Werror=format-security -Wdate-time -D_FORTIFY_SOURCE=2  -c -o answer.o answer.c
i686-linux-gnu-gcc -g -O2 -Werror=implicit-function-declaration -ffile-prefix-map=/<<PKGBUILDDIR>>=. -fstack-protector-strong -Wformat -Werror=format-security -Wdate-time -D_FORTIFY_SOURCE=2  -c -o reroute.o reroute.c
i686-linux-gnu-gcc -g -O2 -Werror=implicit-function-declaration -ffile-prefix-map=/<<PKGBUILDDIR>>=. -fstack-protector-strong -Wformat -Werror=format-security -Wdate-time -D_FORTIFY_SOURCE=2  -c -o hostname.o hostname.c
i686-linux-gnu-gcc -g -O2 -Werror=implicit-function-declaration -ffile-prefix-map=/<<PKGBUILDDIR>>=. -fstack-protector-strong -Wformat -Werror=format-security -Wdate-time -D_FORTIFY_SOURCE=2  -c -o save.o save.c
save.c: In function ‘init_save’:
save.c:290:47: warning: ‘%s’ directive writing up to 511 bytes into a region of size 256 [-Wformat-overflow=]
  272 |             save_name = name_buf;
      |                         ~~~~~~~~               
......
  290 |                         sprintf(uniq_format, "%s%%ld%s", save_name, np + 2);
      |                                               ^~
In file included from /usr/i686-linux-gnu/include/stdio.h:970,
                 from save.c:13:
In function ‘sprintf’,
    inlined from ‘init_save’ at save.c:290:4:
/usr/i686-linux-gnu/include/bits/stdio2.h:30:10: note: ‘__builtin___sprintf_chk’ output 4 or more bytes (assuming 515) into a destination of size 256
   30 |   return __builtin___sprintf_chk (__s, __USE_FORTIFY_LEVEL - 1,
      |          ^~~~~~~~~~~~~~~~~~~~~~~~~~~~~~~~~~~~~~~~~~~~~~~~~~~~~~
   31 |                                   __glibc_objsize (__s), __fmt,
      |                                   ~~~~~~~~~~~~~~~~~~~~~~~~~~~~~
   32 |                                   __va_arg_pack ());
      |                                   ~~~~~~~~~~~~~~~~~
save.c: In function ‘init_save’:
save.c:278:43: warning: ‘%s’ directive writing up to 511 bytes into a region of size 256 [-Wformat-overflow=]
  272 |             save_name = name_buf;
      |                         ~~~~~~~~           
......
  278 |                     sprintf(uniq_format, "%s%s%s",
      |                                           ^~
In function ‘sprintf’,
    inlined from ‘init_save’ at save.c:278:7:
/usr/i686-linux-gnu/include/bits/stdio2.h:30:10: note: ‘__builtin___sprintf_chk’ output 1 or more bytes (assuming 512) into a destination of size 256
   30 |   return __builtin___sprintf_chk (__s, __USE_FORTIFY_LEVEL - 1,
      |          ^~~~~~~~~~~~~~~~~~~~~~~~~~~~~~~~~~~~~~~~~~~~~~~~~~~~~~
   31 |                                   __glibc_objsize (__s), __fmt,
      |                                   ~~~~~~~~~~~~~~~~~~~~~~~~~~~~~
   32 |                                   __va_arg_pack ());
      |                                   ~~~~~~~~~~~~~~~~~
i686-linux-gnu-gcc -g -O2 -Werror=implicit-function-declaration -ffile-prefix-map=/<<PKGBUILDDIR>>=. -fstack-protector-strong -Wformat -Werror=format-security -Wdate-time -D_FORTIFY_SOURCE=2  -c -o unshar.o unshar.c
i686-linux-gnu-gcc -g -O2 -Werror=implicit-function-declaration -ffile-prefix-map=/<<PKGBUILDDIR>>=. -fstack-protector-strong -Wformat -Werror=format-security -Wdate-time -D_FORTIFY_SOURCE=2  -c -o decode.o decode.c
i686-linux-gnu-gcc -g -O2 -Werror=implicit-function-declaration -ffile-prefix-map=/<<PKGBUILDDIR>>=. -fstack-protector-strong -Wformat -Werror=format-security -Wdate-time -D_FORTIFY_SOURCE=2  -c -o execute.o execute.c
execute.c: In function ‘execute’:
execute.c:69:13: warning: ignoring return value of ‘chdir’ declared with attribute ‘warn_unused_result’ [-Wunused-result]
   69 |             chdir(exec_chdir_to);
      |             ^~~~~~~~~~~~~~~~~~~~
i686-linux-gnu-gcc -g -O2 -Werror=implicit-function-declaration -ffile-prefix-map=/<<PKGBUILDDIR>>=. -fstack-protector-strong -Wformat -Werror=format-security -Wdate-time -D_FORTIFY_SOURCE=2  -c -o pack_date.o pack_date.c
pack_date.c: In function ‘numeric_zone’:
pack_date.c:313:12: warning: writing 1 byte into a region of size 0 [-Wstringop-overflow=]
  313 |     num[n] = '\0';
      |     ~~~~~~~^~~~~~
pack_date.c:296:21: note: at offset 6 into destination object ‘num’ of size 6
  296 |     static char     num[MAXZ];
      |                     ^~~
i686-linux-gnu-gcc -g -O2 -Werror=implicit-function-declaration -ffile-prefix-map=/<<PKGBUILDDIR>>=. -fstack-protector-strong -Wformat -Werror=format-security -Wdate-time -D_FORTIFY_SOURCE=2  -c -o pack_name.o pack_name.c
i686-linux-gnu-gcc -g -O2 -Werror=implicit-function-declaration -ffile-prefix-map=/<<PKGBUILDDIR>>=. -fstack-protector-strong -Wformat -Werror=format-security -Wdate-time -D_FORTIFY_SOURCE=2  -c -o pack_subject.o pack_subject.c
i686-linux-gnu-gcc -g -O2 -Werror=implicit-function-declaration -ffile-prefix-map=/<<PKGBUILDDIR>>=. -fstack-protector-strong -Wformat -Werror=format-security -Wdate-time -D_FORTIFY_SOURCE=2  -c -o news.o news.c
i686-linux-gnu-gcc -g -O2 -Werror=implicit-function-declaration -ffile-prefix-map=/<<PKGBUILDDIR>>=. -fstack-protector-strong -Wformat -Werror=format-security -Wdate-time -D_FORTIFY_SOURCE=2  -c -o digest.o digest.c
i686-linux-gnu-gcc -g -O2 -Werror=implicit-function-declaration -ffile-prefix-map=/<<PKGBUILDDIR>>=. -fstack-protector-strong -Wformat -Werror=format-security -Wdate-time -D_FORTIFY_SOURCE=2  -c -o match.o match.c
i686-linux-gnu-gcc -g -O2 -Werror=implicit-function-declaration -ffile-prefix-map=/<<PKGBUILDDIR>>=. -fstack-protector-strong -Wformat -Werror=format-security -Wdate-time -D_FORTIFY_SOURCE=2  -c -o chset.o chset.c
i686-linux-gnu-gcc -g -O2 -Werror=implicit-function-declaration -ffile-prefix-map=/<<PKGBUILDDIR>>=. -fstack-protector-strong -Wformat -Werror=format-security -Wdate-time -D_FORTIFY_SOURCE=2  -c -o printconf.o printconf.c
i686-linux-gnu-gcc -g -O2 -Werror=implicit-function-declaration -ffile-prefix-map=/<<PKGBUILDDIR>>=. -fstack-protector-strong -Wformat -Werror=format-security -Wdate-time -D_FORTIFY_SOURCE=2  -c -o awksplit.o awksplit.c
i686-linux-gnu-gcc -g -O2 -Werror=implicit-function-declaration -ffile-prefix-map=/<<PKGBUILDDIR>>=. -fstack-protector-strong -Wformat -Werror=format-security -Wdate-time -D_FORTIFY_SOURCE=2  -c -o hash.o hash.c
i686-linux-gnu-gcc -g -O2 -Werror=implicit-function-declaration -ffile-prefix-map=/<<PKGBUILDDIR>>=. -fstack-protector-strong -Wformat -Werror=format-security -Wdate-time -D_FORTIFY_SOURCE=2  -c -o hdbm.o hdbm.c
i686-linux-gnu-gcc -g -O2 -Werror=implicit-function-declaration -ffile-prefix-map=/<<PKGBUILDDIR>>=. -fstack-protector-strong -Wformat -Werror=format-security -Wdate-time -D_FORTIFY_SOURCE=2  -c -o libnov.o libnov.c
i686-linux-gnu-gcc -g -O2 -Werror=implicit-function-declaration -ffile-prefix-map=/<<PKGBUILDDIR>>=. -fstack-protector-strong -Wformat -Werror=format-security -Wdate-time -D_FORTIFY_SOURCE=2  -c -o split.o split.c
linking nn
/usr/lib/gcc-cross/i686-linux-gnu/14/../../../../i686-linux-gnu/bin/ld: global.o: in function `new_temp_file':
././global.c:372:(.text+0x243): warning: the use of `mktemp' is dangerous, better use `mkstemp' or `mkdtemp'
i686-linux-gnu-gcc -g -O2 -Werror=implicit-function-declaration -ffile-prefix-map=/<<PKGBUILDDIR>>=. -fstack-protector-strong -Wformat -Werror=format-security -Wdate-time -D_FORTIFY_SOURCE=2  -c -o prefix.o prefix.c
i686-linux-gnu-gcc -o mkprefix -g -O2 -Werror=implicit-function-declaration -ffile-prefix-map=/<<PKGBUILDDIR>>=. -fstack-protector-strong -Wformat -Werror=format-security prefix.o global.o -Wl,-z,relro -Wl,-z,now
/usr/lib/gcc-cross/i686-linux-gnu/14/../../../../i686-linux-gnu/bin/ld: global.o: in function `new_temp_file':
././global.c:372:(.text+0x243): warning: the use of `mktemp' is dangerous, better use `mkstemp' or `mkdtemp'
./mkprefix prefix < /dev/null > prefix
/bin/sh: 1: ./mkprefix: Exec format error
make[3]: *** [ymakefile:50: prefix] Error 126
make[3]: Leaving directory '/<<PKGBUILDDIR>>'
make[2]: *** [Makefile:36: all] Error 2
make[2]: Leaving directory '/<<PKGBUILDDIR>>'
dh_auto_build: error: make -j1 "INSTALL=install --strip-program=true" PKG_CONFIG=i686-linux-gnu-pkg-config CXX=i686-linux-gnu-g\+\+ CC=i686-linux-gnu-gcc "CFLAGS=-g -O2 -Werror=implicit-function-declaration -ffile-prefix-map=/<<PKGBUILDDIR>>=. -fstack-protector-strong -Wformat -Werror=format-security" "CPPFLAGS=-Wdate-time -D_FORTIFY_SOURCE=2" "LDFLAGS=-Wl,-z,relro -Wl,-z,now" LOCALCC=aarch64-linux-gnu-gcc returned exit code 2
make[1]: *** [debian/rules:19: override_dh_auto_build] Error 25
make[1]: Leaving directory '/<<PKGBUILDDIR>>'
make: *** [debian/rules:13: binary-arch] Error 2
dpkg-buildpackage: error: debian/rules binary-arch subprocess returned exit status 2
--------------------------------------------------------------------------------
Build finished at 2025-04-30T16:36:32Z

+------------------------------------------------------------------------------+
| Finished Timed Build Commands                                                |
+------------------------------------------------------------------------------+


rm -Rf /<<PKGBUILDDIR>>/
---------------------------------


I: Finished running 'rm -Rf /<<PKGBUILDDIR>>/'.

Finished processing commands.
--------------------------------------------------------------------------------

Finished
--------


+------------------------------------------------------------------------------+
| Cleanup                                                                      |
+------------------------------------------------------------------------------+

Purging /<<BUILDDIR>>
Not cleaning session: cloned chroot in use
E: Build failure (dpkg-buildpackage died)

+------------------------------------------------------------------------------+
| Summary                                                                      |
+------------------------------------------------------------------------------+

Build Architecture: arm64
Build Profiles: cross nocheck
Build Type: any
Build-Space: n/a
Build-Time: 67
Distribution: unstable
Fail-Stage: build
Foreign Architectures: i386
Host Architecture: i386
Install-Time: 43
Job: nn_6.7.3-16
Machine Architecture: arm64
Package: nn
Package-Time: 147
Source-Version: 6.7.3-16
Space: n/a
Status: attempted
Version: 6.7.3-16
--------------------------------------------------------------------------------
Finished at 2025-04-30T16:36:32Z
Build needed 00:02:27, no disk space