sbuild (Debian sbuild) 0.85.0 (04 January 2023) on debian-ci-siliconvalley

+==============================================================================+
| pam-p11 0.6.0-1 (ppc64el)                    Sun, 19 May 2024 09:09:49 +0000 |
+==============================================================================+

Package: pam-p11
Version: 0.6.0-1
Source Version: 0.6.0-1
Distribution: unstable
Machine Architecture: amd64
Host Architecture: ppc64el
Build Architecture: amd64
Build Profiles: cross nocheck
Build Type: any

I: NOTICE: Log filtering will replace 'var/run/schroot/mount/sid-amd64-sbuild-f4485ab5-4a7b-479b-ab67-30bcc72bad14' with '<<CHROOT>>'
I: NOTICE: Log filtering will replace 'build/pam-p11-qz5lrT/resolver-ElUwT4' with '<<RESOLVERDIR>>'

+------------------------------------------------------------------------------+
| Update chroot                                                                |
+------------------------------------------------------------------------------+

Get:1 http://localhost:3142/debian sid InRelease [198 kB]
Get:2 http://localhost:3142/debian sid/main Sources.diff/Index [63.6 kB]
Get:3 http://localhost:3142/debian sid/main amd64 Packages.diff/Index [63.6 kB]
Get:4 http://localhost:3142/debian sid/main Sources T-2024-05-19-0804.22-F-2024-05-19-0204.51.pdiff [6748 B]
Get:5 http://localhost:3142/debian sid/main amd64 Packages T-2024-05-19-0804.22-F-2024-05-19-0204.51.pdiff [23.2 kB]
Get:4 http://localhost:3142/debian sid/main Sources T-2024-05-19-0804.22-F-2024-05-19-0204.51.pdiff [6748 B]
Get:6 http://localhost:3142/debian sid/main ppc64el Packages [9682 kB]
Get:5 http://localhost:3142/debian sid/main amd64 Packages T-2024-05-19-0804.22-F-2024-05-19-0204.51.pdiff [23.2 kB]
Fetched 10.0 MB in 3s (3657 kB/s)
Reading package lists...
Reading package lists...
Building dependency tree...
Reading state information...
Calculating upgrade...
0 upgraded, 0 newly installed, 0 to remove and 0 not upgraded.

+------------------------------------------------------------------------------+
| Fetch source files                                                           |
+------------------------------------------------------------------------------+


Check APT
---------

Checking available source versions...

Download source files with APT
------------------------------

Reading package lists...
NOTICE: 'pam-p11' packaging is maintained in the 'Git' version control system at:
https://salsa.debian.org/opensc-team/pam-p11.git
Please use:
git clone https://salsa.debian.org/opensc-team/pam-p11.git
to retrieve the latest (possibly unreleased) updates to the package.
Need to get 38.7 kB of source archives.
Get:1 http://localhost:3142/debian sid/main pam-p11 0.6.0-1 (dsc) [1803 B]
Get:2 http://localhost:3142/debian sid/main pam-p11 0.6.0-1 (tar) [33.4 kB]
Get:3 http://localhost:3142/debian sid/main pam-p11 0.6.0-1 (diff) [3564 B]
Fetched 38.7 kB in 1s (64.9 kB/s)
Download complete and in download only mode
I: NOTICE: Log filtering will replace 'build/pam-p11-qz5lrT/pam-p11-0.6.0' with '<<PKGBUILDDIR>>'
I: NOTICE: Log filtering will replace 'build/pam-p11-qz5lrT' with '<<BUILDDIR>>'

+------------------------------------------------------------------------------+
| Install package build dependencies                                           |
+------------------------------------------------------------------------------+


Setup apt archive
-----------------

Merged Build-Depends: debhelper-compat (= 12), libltdl-dev, libp11-dev, libpam0g-dev, libssl-dev, libc-dev, libstdc++-dev, build-essential:amd64, fakeroot:amd64, crossbuild-essential-ppc64el:amd64, libc-dev:ppc64el, libstdc++-dev:ppc64el
Filtered Build-Depends: debhelper-compat (= 12), libltdl-dev, libp11-dev, libpam0g-dev, libssl-dev, libc-dev, libstdc++-dev, build-essential:amd64, fakeroot:amd64, crossbuild-essential-ppc64el:amd64, libc-dev:ppc64el, libstdc++-dev:ppc64el
dpkg-deb: building package 'sbuild-build-depends-main-dummy' in '/<<RESOLVERDIR>>/apt_archive/sbuild-build-depends-main-dummy.deb'.
Ign:1 copy:/<<RESOLVERDIR>>/apt_archive ./ InRelease
Get:2 copy:/<<RESOLVERDIR>>/apt_archive ./ Release [609 B]
Ign:3 copy:/<<RESOLVERDIR>>/apt_archive ./ Release.gpg
Get:4 copy:/<<RESOLVERDIR>>/apt_archive ./ Sources [771 B]
Get:5 copy:/<<RESOLVERDIR>>/apt_archive ./ Packages [816 B]
Fetched 2196 B in 0s (0 B/s)
Reading package lists...
Reading package lists...

Install main build dependencies (apt-based resolver)
----------------------------------------------------

Installing build dependencies
Reading package lists...
Building dependency tree...
Reading state information...
Execute external solver...
The following packages were automatically installed and are no longer required:
  mount tzdata
Use 'apt autoremove' to remove them.
The following additional packages will be installed:
  autoconf automake autopoint autotools-dev binutils-powerpc64le-linux-gnu
  bsdextrautils cpp-13-powerpc64le-linux-gnu cpp-powerpc64le-linux-gnu
  cross-config crossbuild-essential-ppc64el debhelper dh-autoreconf
  dh-strip-nondeterminism dpkg-cross dwz fakeroot file
  g++-13-powerpc64le-linux-gnu g++-powerpc64le-linux-gnu gcc-13-base:ppc64el
  gcc-13-cross-base gcc-13-powerpc64le-linux-gnu
  gcc-13-powerpc64le-linux-gnu-base gcc-14-base:ppc64el gcc-14-cross-base
  gcc-powerpc64le-linux-gnu gettext gettext-base groff-base intltool-debian
  libarchive-zip-perl libasan8:ppc64el libasan8-ppc64el-cross
  libatomic1:ppc64el libatomic1-ppc64el-cross libaudit1:ppc64el libc6:ppc64el
  libc6-dev:ppc64el libc6-dev-ppc64el-cross libc6-ppc64el-cross
  libcap-ng0:ppc64el libconfig-auto-perl libconfig-inifiles-perl
  libcrypt-dev:ppc64el libcrypt1:ppc64el libdata-optlist-perl
  libdebhelper-perl libdebian-dpkgcross-perl libelf1t64 libfakeroot
  libfile-homedir-perl libfile-stripnondeterminism-perl libfile-which-perl
  libgcc-13-dev:ppc64el libgcc-13-dev-ppc64el-cross libgcc-s1:ppc64el
  libgcc-s1-ppc64el-cross libgomp1:ppc64el libgomp1-ppc64el-cross libicu72
  libio-string-perl libitm1:ppc64el libitm1-ppc64el-cross
  liblocale-gettext-perl liblsan0:ppc64el liblsan0-ppc64el-cross
  libltdl-dev:ppc64el libltdl7:ppc64el libmagic-mgc libmagic1t64
  libp11-3t64:ppc64el libp11-dev:ppc64el libpam0g:ppc64el libpam0g-dev:ppc64el
  libparams-util-perl libpipeline1 libquadmath0:ppc64el
  libquadmath0-ppc64el-cross libssl-dev:ppc64el libssl3t64:ppc64el
  libstdc++-13-dev:ppc64el libstdc++-13-dev-ppc64el-cross libstdc++6:ppc64el
  libstdc++6-ppc64el-cross libsub-exporter-perl libsub-install-perl
  libsub-override-perl libsub-prototype-perl libtool libtsan2:ppc64el
  libtsan2-ppc64el-cross libubsan1:ppc64el libubsan1-ppc64el-cross
  libuchardet0 libxml-libxml-perl libxml-namespacesupport-perl
  libxml-sax-base-perl libxml-sax-perl libxml-simple-perl libxml2 libyaml-perl
  libzstd1:ppc64el m4 man-db po-debconf sensible-utils ucf zlib1g:ppc64el
Suggested packages:
  autoconf-archive gnu-standards autoconf-doc binutils-doc gcc-13-locales
  cpp-13-doc cpp-doc dh-make binutils-multiarch gcc-13-doc manpages-dev flex
  bison gdb-powerpc64le-linux-gnu gcc-doc gettext-doc libasprintf-dev
  libgettextpo-dev groff glibc-doc:ppc64el libc-l10n:ppc64el locales:ppc64el
  libnss-nis:ppc64el libnss-nisplus:ppc64el manpages-dev:ppc64el
  libtool-doc:ppc64el libpam-doc:ppc64el libssl-doc:ppc64el
  libstdc++-13-doc:ppc64el libtool-doc gfortran | fortran95-compiler gcj-jdk
  libyaml-shell-perl m4-doc apparmor less www-browser libmail-box-perl
Recommended packages:
  curl | wget | lynx libidn2-0:ppc64el libarchive-cpio-perl libltdl-dev
  libwww-perl libxml-sax-expat-perl libyaml-libyaml-perl | libyaml-syck-perl
  libmail-sendmail-perl
The following NEW packages will be installed:
  autoconf automake autopoint autotools-dev binutils-powerpc64le-linux-gnu
  bsdextrautils cpp-13-powerpc64le-linux-gnu cpp-powerpc64le-linux-gnu
  cross-config crossbuild-essential-ppc64el debhelper dh-autoreconf
  dh-strip-nondeterminism dpkg-cross dwz fakeroot file
  g++-13-powerpc64le-linux-gnu g++-powerpc64le-linux-gnu gcc-13-base:ppc64el
  gcc-13-cross-base gcc-13-powerpc64le-linux-gnu
  gcc-13-powerpc64le-linux-gnu-base gcc-14-base:ppc64el gcc-14-cross-base
  gcc-powerpc64le-linux-gnu gettext gettext-base groff-base intltool-debian
  libarchive-zip-perl libasan8:ppc64el libasan8-ppc64el-cross
  libatomic1:ppc64el libatomic1-ppc64el-cross libaudit1:ppc64el libc6:ppc64el
  libc6-dev:ppc64el libc6-dev-ppc64el-cross libc6-ppc64el-cross
  libcap-ng0:ppc64el libconfig-auto-perl libconfig-inifiles-perl
  libcrypt-dev:ppc64el libcrypt1:ppc64el libdata-optlist-perl
  libdebhelper-perl libdebian-dpkgcross-perl libelf1t64 libfakeroot
  libfile-homedir-perl libfile-stripnondeterminism-perl libfile-which-perl
  libgcc-13-dev:ppc64el libgcc-13-dev-ppc64el-cross libgcc-s1:ppc64el
  libgcc-s1-ppc64el-cross libgomp1:ppc64el libgomp1-ppc64el-cross libicu72
  libio-string-perl libitm1:ppc64el libitm1-ppc64el-cross
  liblocale-gettext-perl liblsan0:ppc64el liblsan0-ppc64el-cross
  libltdl-dev:ppc64el libltdl7:ppc64el libmagic-mgc libmagic1t64
  libp11-3t64:ppc64el libp11-dev:ppc64el libpam0g:ppc64el libpam0g-dev:ppc64el
  libparams-util-perl libpipeline1 libquadmath0:ppc64el
  libquadmath0-ppc64el-cross libssl-dev:ppc64el libssl3t64:ppc64el
  libstdc++-13-dev:ppc64el libstdc++-13-dev-ppc64el-cross libstdc++6:ppc64el
  libstdc++6-ppc64el-cross libsub-exporter-perl libsub-install-perl
  libsub-override-perl libsub-prototype-perl libtool libtsan2:ppc64el
  libtsan2-ppc64el-cross libubsan1:ppc64el libubsan1-ppc64el-cross
  libuchardet0 libxml-libxml-perl libxml-namespacesupport-perl
  libxml-sax-base-perl libxml-sax-perl libxml-simple-perl libxml2 libyaml-perl
  libzstd1:ppc64el m4 man-db po-debconf
  sbuild-build-depends-main-dummy:ppc64el sensible-utils ucf zlib1g:ppc64el
0 upgraded, 109 newly installed, 0 to remove and 0 not upgraded.
Need to get 98.7 MB of archives.
After this operation, 420 MB of additional disk space will be used.
Get:1 copy:/<<RESOLVERDIR>>/apt_archive ./ sbuild-build-depends-main-dummy 0.invalid.0 [936 B]
Get:2 http://localhost:3142/debian sid/main amd64 liblocale-gettext-perl amd64 1.07-7 [15.0 kB]
Get:3 http://localhost:3142/debian sid/main amd64 sensible-utils all 0.0.22 [22.4 kB]
Get:4 http://localhost:3142/debian sid/main amd64 libmagic-mgc amd64 1:5.45-3 [314 kB]
Get:5 http://localhost:3142/debian sid/main amd64 libmagic1t64 amd64 1:5.45-3 [105 kB]
Get:6 http://localhost:3142/debian sid/main amd64 file amd64 1:5.45-3 [42.9 kB]
Get:7 http://localhost:3142/debian sid/main amd64 gettext-base amd64 0.21-14+b1 [161 kB]
Get:8 http://localhost:3142/debian sid/main amd64 libuchardet0 amd64 0.0.8-1+b1 [68.8 kB]
Get:9 http://localhost:3142/debian sid/main amd64 groff-base amd64 1.23.0-4 [1180 kB]
Get:10 http://localhost:3142/debian sid/main amd64 bsdextrautils amd64 2.40.1-1 [94.1 kB]
Get:11 http://localhost:3142/debian sid/main amd64 libpipeline1 amd64 1.5.7-2 [38.0 kB]
Get:12 http://localhost:3142/debian sid/main amd64 man-db amd64 2.12.1-1 [1411 kB]
Get:13 http://localhost:3142/debian sid/main amd64 ucf all 3.0043+nmu1 [55.2 kB]
Get:14 http://localhost:3142/debian sid/main amd64 m4 amd64 1.4.19-4 [287 kB]
Get:15 http://localhost:3142/debian sid/main amd64 autoconf all 2.71-3 [332 kB]
Get:16 http://localhost:3142/debian sid/main amd64 autotools-dev all 20220109.1 [51.6 kB]
Get:17 http://localhost:3142/debian sid/main amd64 automake all 1:1.16.5-1.3 [823 kB]
Get:18 http://localhost:3142/debian sid/main amd64 autopoint all 0.21-14 [496 kB]
Get:19 http://localhost:3142/debian sid/main amd64 binutils-powerpc64le-linux-gnu amd64 2.42-4 [2763 kB]
Get:20 http://localhost:3142/debian sid/main amd64 gcc-13-powerpc64le-linux-gnu-base amd64 13.2.0-12cross1 [42.7 kB]
Get:21 http://localhost:3142/debian sid/main amd64 cpp-13-powerpc64le-linux-gnu amd64 13.2.0-12cross1 [9190 kB]
Get:22 http://localhost:3142/debian sid/main amd64 cpp-powerpc64le-linux-gnu amd64 4:13.2.0-7 [4736 B]
Get:23 http://localhost:3142/debian sid/main amd64 cross-config all 2.6.20 [16.3 kB]
Get:24 http://localhost:3142/debian sid/main amd64 gcc-13-cross-base all 13.2.0-12cross1 [38.1 kB]
Get:25 http://localhost:3142/debian sid/main amd64 gcc-14-cross-base all 14-20240127-1cross1 [37.9 kB]
Get:26 http://localhost:3142/debian sid/main amd64 libc6-ppc64el-cross all 2.38-11cross1 [1365 kB]
Get:27 http://localhost:3142/debian sid/main amd64 libgcc-s1-ppc64el-cross all 14-20240127-1cross1 [35.5 kB]
Get:28 http://localhost:3142/debian sid/main amd64 libgomp1-ppc64el-cross all 14-20240127-1cross1 [134 kB]
Get:29 http://localhost:3142/debian sid/main amd64 libitm1-ppc64el-cross all 14-20240127-1cross1 [27.9 kB]
Get:30 http://localhost:3142/debian sid/main amd64 libatomic1-ppc64el-cross all 14-20240127-1cross1 [9544 B]
Get:31 http://localhost:3142/debian sid/main amd64 libasan8-ppc64el-cross all 14-20240127-1cross1 [2641 kB]
Get:32 http://localhost:3142/debian sid/main amd64 liblsan0-ppc64el-cross all 14-20240127-1cross1 [1201 kB]
Get:33 http://localhost:3142/debian sid/main amd64 libtsan2-ppc64el-cross all 14-20240127-1cross1 [2408 kB]
Get:34 http://localhost:3142/debian sid/main amd64 libstdc++6-ppc64el-cross all 14-20240127-1cross1 [749 kB]
Get:35 http://localhost:3142/debian sid/main amd64 libubsan1-ppc64el-cross all 14-20240127-1cross1 [1078 kB]
Get:36 http://localhost:3142/debian sid/main amd64 libquadmath0-ppc64el-cross all 14-20240127-1cross1 [151 kB]
Get:37 http://localhost:3142/debian sid/main amd64 libgcc-13-dev-ppc64el-cross all 13.2.0-12cross1 [1370 kB]
Get:38 http://localhost:3142/debian sid/main amd64 gcc-13-powerpc64le-linux-gnu amd64 13.2.0-12cross1 [17.6 MB]
Get:39 http://localhost:3142/debian sid/main amd64 gcc-powerpc64le-linux-gnu amd64 4:13.2.0-7 [1464 B]
Get:40 http://localhost:3142/debian sid/main amd64 libc6-dev-ppc64el-cross all 2.38-11cross1 [1828 kB]
Get:41 http://localhost:3142/debian sid/main amd64 libstdc++-13-dev-ppc64el-cross all 13.2.0-12cross1 [2296 kB]
Get:42 http://localhost:3142/debian sid/main amd64 g++-13-powerpc64le-linux-gnu amd64 13.2.0-12cross1 [10.1 MB]
Get:43 http://localhost:3142/debian sid/main amd64 g++-powerpc64le-linux-gnu amd64 4:13.2.0-7 [1208 B]
Get:44 http://localhost:3142/debian sid/main amd64 libconfig-inifiles-perl all 3.000003-2 [45.9 kB]
Get:45 http://localhost:3142/debian sid/main amd64 libio-string-perl all 1.08-4 [12.1 kB]
Get:46 http://localhost:3142/debian sid/main amd64 libicu72 amd64 72.1-4+b1 [9395 kB]
Get:47 http://localhost:3142/debian sid/main amd64 libxml2 amd64 2.9.14+dfsg-1.3+b3 [692 kB]
Get:48 http://localhost:3142/debian sid/main amd64 libxml-namespacesupport-perl all 1.12-2 [15.1 kB]
Get:49 http://localhost:3142/debian sid/main amd64 libxml-sax-base-perl all 1.09-3 [20.6 kB]
Get:50 http://localhost:3142/debian sid/main amd64 libxml-sax-perl all 1.02+dfsg-3 [59.4 kB]
Get:51 http://localhost:3142/debian sid/main amd64 libxml-libxml-perl amd64 2.0207+dfsg+really+2.0134-1+b3 [313 kB]
Get:52 http://localhost:3142/debian sid/main amd64 libxml-simple-perl all 2.25-2 [69.8 kB]
Get:53 http://localhost:3142/debian sid/main amd64 libyaml-perl all 1.31-1 [64.8 kB]
Get:54 http://localhost:3142/debian sid/main amd64 libconfig-auto-perl all 0.44-2 [19.2 kB]
Get:55 http://localhost:3142/debian sid/main amd64 libfile-which-perl all 1.27-2 [15.1 kB]
Get:56 http://localhost:3142/debian sid/main amd64 libfile-homedir-perl all 1.006-2 [42.4 kB]
Get:57 http://localhost:3142/debian sid/main amd64 libdebian-dpkgcross-perl all 2.6.20 [15.3 kB]
Get:58 http://localhost:3142/debian sid/main amd64 dpkg-cross all 2.6.20 [25.8 kB]
Get:59 http://localhost:3142/debian sid/main amd64 crossbuild-essential-ppc64el all 12.10 [3492 B]
Get:60 http://localhost:3142/debian sid/main amd64 libdebhelper-perl all 13.15.3 [88.0 kB]
Get:61 http://localhost:3142/debian sid/main amd64 libtool all 2.4.7-7 [517 kB]
Get:62 http://localhost:3142/debian sid/main amd64 dh-autoreconf all 20 [17.1 kB]
Get:63 http://localhost:3142/debian sid/main amd64 libarchive-zip-perl all 1.68-1 [104 kB]
Get:64 http://localhost:3142/debian sid/main amd64 libparams-util-perl amd64 1.102-3 [24.0 kB]
Get:65 http://localhost:3142/debian sid/main amd64 libsub-install-perl all 0.929-1 [10.5 kB]
Get:66 http://localhost:3142/debian sid/main amd64 libdata-optlist-perl all 0.114-1 [10.6 kB]
Get:67 http://localhost:3142/debian sid/main amd64 libsub-exporter-perl all 0.990-1 [50.6 kB]
Get:68 http://localhost:3142/debian sid/main amd64 libsub-prototype-perl amd64 0.03-2+b2 [9744 B]
Get:69 http://localhost:3142/debian sid/main amd64 libsub-override-perl all 0.11-1 [10.4 kB]
Get:70 http://localhost:3142/debian sid/main amd64 libfile-stripnondeterminism-perl all 1.13.1-1 [19.4 kB]
Get:71 http://localhost:3142/debian sid/main amd64 dh-strip-nondeterminism all 1.13.1-1 [8620 B]
Get:72 http://localhost:3142/debian sid/main amd64 libelf1t64 amd64 0.191-1+b1 [189 kB]
Get:73 http://localhost:3142/debian sid/main amd64 dwz amd64 0.15-1+b1 [110 kB]
Get:74 http://localhost:3142/debian sid/main amd64 gettext amd64 0.21-14+b1 [1301 kB]
Get:75 http://localhost:3142/debian sid/main amd64 intltool-debian all 0.35.0+20060710.6 [22.9 kB]
Get:76 http://localhost:3142/debian sid/main amd64 po-debconf all 1.0.21+nmu1 [248 kB]
Get:77 http://localhost:3142/debian sid/main amd64 debhelper all 13.15.3 [901 kB]
Get:78 http://localhost:3142/debian sid/main amd64 libfakeroot amd64 1.34-1 [28.9 kB]
Get:79 http://localhost:3142/debian sid/main amd64 fakeroot amd64 1.34-1 [74.0 kB]
Get:80 http://localhost:3142/debian sid/main ppc64el gcc-13-base ppc64el 13.2.0-25 [45.8 kB]
Get:81 http://localhost:3142/debian sid/main ppc64el gcc-14-base ppc64el 14.1.0-1 [44.3 kB]
Get:82 http://localhost:3142/debian sid/main ppc64el libgcc-s1 ppc64el 14.1.0-1 [35.4 kB]
Get:83 http://localhost:3142/debian sid/main ppc64el libc6 ppc64el 2.38-11 [2687 kB]
Get:84 http://localhost:3142/debian sid/main ppc64el libasan8 ppc64el 14.1.0-1 [2653 kB]
Get:85 http://localhost:3142/debian sid/main ppc64el libatomic1 ppc64el 14.1.0-1 [9816 B]
Get:86 http://localhost:3142/debian sid/main ppc64el libcap-ng0 ppc64el 0.8.5-1 [17.6 kB]
Get:87 http://localhost:3142/debian sid/main ppc64el libaudit1 ppc64el 1:3.1.2-2.1 [51.2 kB]
Get:88 http://localhost:3142/debian sid/main ppc64el libcrypt1 ppc64el 1:4.4.36-4 [98.1 kB]
Get:89 http://localhost:3142/debian sid/main ppc64el libcrypt-dev ppc64el 1:4.4.36-4 [132 kB]
Get:90 http://localhost:3142/debian sid/main ppc64el libc6-dev ppc64el 2.38-11 [1832 kB]
Get:91 http://localhost:3142/debian sid/main ppc64el libgomp1 ppc64el 14.1.0-1 [142 kB]
Get:92 http://localhost:3142/debian sid/main ppc64el libitm1 ppc64el 14.1.0-1 [28.4 kB]
Get:93 http://localhost:3142/debian sid/main ppc64el liblsan0 ppc64el 14.1.0-1 [1203 kB]
Get:94 http://localhost:3142/debian sid/main ppc64el libtsan2 ppc64el 14.1.0-1 [2418 kB]
Get:95 http://localhost:3142/debian sid/main ppc64el libstdc++6 ppc64el 14.1.0-1 [797 kB]
Get:96 http://localhost:3142/debian sid/main ppc64el libubsan1 ppc64el 14.1.0-1 [1081 kB]
Get:97 http://localhost:3142/debian sid/main ppc64el libquadmath0 ppc64el 14.1.0-1 [151 kB]
Get:98 http://localhost:3142/debian sid/main ppc64el libgcc-13-dev ppc64el 13.2.0-25 [1373 kB]
Get:99 http://localhost:3142/debian sid/main ppc64el libltdl7 ppc64el 2.4.7-7+b1 [397 kB]
Get:100 http://localhost:3142/debian sid/main ppc64el libltdl-dev ppc64el 2.4.7-7+b1 [169 kB]
Get:101 http://localhost:3142/debian sid/main ppc64el libzstd1 ppc64el 1.5.5+dfsg2-2 [312 kB]
Get:102 http://localhost:3142/debian sid/main ppc64el zlib1g ppc64el 1:1.3.dfsg+really1.3.1-1 [86.4 kB]
Get:103 http://localhost:3142/debian sid/main ppc64el libssl3t64 ppc64el 3.2.1-3 [2244 kB]
Get:104 http://localhost:3142/debian sid/main ppc64el libp11-3t64 ppc64el 0.4.12-2 [28.9 kB]
Get:105 http://localhost:3142/debian sid/main ppc64el libssl-dev ppc64el 3.2.1-3 [2776 kB]
Get:106 http://localhost:3142/debian sid/main ppc64el libp11-dev ppc64el 0.4.12-2 [48.2 kB]
Get:107 http://localhost:3142/debian sid/main ppc64el libpam0g ppc64el 1.5.3-7 [72.2 kB]
Get:108 http://localhost:3142/debian sid/main ppc64el libpam0g-dev ppc64el 1.5.3-7 [130 kB]
Get:109 http://localhost:3142/debian sid/main ppc64el libstdc++-13-dev ppc64el 13.2.0-25 [2434 kB]
debconf: delaying package configuration, since apt-utils is not installed
Fetched 98.7 MB in 1s (105 MB/s)
Selecting previously unselected package liblocale-gettext-perl.
(Reading database ... 12874 files and directories currently installed.)
Preparing to unpack .../000-liblocale-gettext-perl_1.07-7_amd64.deb ...
Unpacking liblocale-gettext-perl (1.07-7) ...
Selecting previously unselected package sensible-utils.
Preparing to unpack .../001-sensible-utils_0.0.22_all.deb ...
Unpacking sensible-utils (0.0.22) ...
Selecting previously unselected package libmagic-mgc.
Preparing to unpack .../002-libmagic-mgc_1%3a5.45-3_amd64.deb ...
Unpacking libmagic-mgc (1:5.45-3) ...
Selecting previously unselected package libmagic1t64:amd64.
Preparing to unpack .../003-libmagic1t64_1%3a5.45-3_amd64.deb ...
Unpacking libmagic1t64:amd64 (1:5.45-3) ...
Selecting previously unselected package file.
Preparing to unpack .../004-file_1%3a5.45-3_amd64.deb ...
Unpacking file (1:5.45-3) ...
Selecting previously unselected package gettext-base.
Preparing to unpack .../005-gettext-base_0.21-14+b1_amd64.deb ...
Unpacking gettext-base (0.21-14+b1) ...
Selecting previously unselected package libuchardet0:amd64.
Preparing to unpack .../006-libuchardet0_0.0.8-1+b1_amd64.deb ...
Unpacking libuchardet0:amd64 (0.0.8-1+b1) ...
Selecting previously unselected package groff-base.
Preparing to unpack .../007-groff-base_1.23.0-4_amd64.deb ...
Unpacking groff-base (1.23.0-4) ...
Selecting previously unselected package bsdextrautils.
Preparing to unpack .../008-bsdextrautils_2.40.1-1_amd64.deb ...
Unpacking bsdextrautils (2.40.1-1) ...
Selecting previously unselected package libpipeline1:amd64.
Preparing to unpack .../009-libpipeline1_1.5.7-2_amd64.deb ...
Unpacking libpipeline1:amd64 (1.5.7-2) ...
Selecting previously unselected package man-db.
Preparing to unpack .../010-man-db_2.12.1-1_amd64.deb ...
Unpacking man-db (2.12.1-1) ...
Selecting previously unselected package ucf.
Preparing to unpack .../011-ucf_3.0043+nmu1_all.deb ...
Moving old data out of the way
Unpacking ucf (3.0043+nmu1) ...
Selecting previously unselected package m4.
Preparing to unpack .../012-m4_1.4.19-4_amd64.deb ...
Unpacking m4 (1.4.19-4) ...
Selecting previously unselected package autoconf.
Preparing to unpack .../013-autoconf_2.71-3_all.deb ...
Unpacking autoconf (2.71-3) ...
Selecting previously unselected package autotools-dev.
Preparing to unpack .../014-autotools-dev_20220109.1_all.deb ...
Unpacking autotools-dev (20220109.1) ...
Selecting previously unselected package automake.
Preparing to unpack .../015-automake_1%3a1.16.5-1.3_all.deb ...
Unpacking automake (1:1.16.5-1.3) ...
Selecting previously unselected package autopoint.
Preparing to unpack .../016-autopoint_0.21-14_all.deb ...
Unpacking autopoint (0.21-14) ...
Selecting previously unselected package binutils-powerpc64le-linux-gnu.
Preparing to unpack .../017-binutils-powerpc64le-linux-gnu_2.42-4_amd64.deb ...
Unpacking binutils-powerpc64le-linux-gnu (2.42-4) ...
Selecting previously unselected package gcc-13-powerpc64le-linux-gnu-base:amd64.
Preparing to unpack .../018-gcc-13-powerpc64le-linux-gnu-base_13.2.0-12cross1_amd64.deb ...
Unpacking gcc-13-powerpc64le-linux-gnu-base:amd64 (13.2.0-12cross1) ...
Selecting previously unselected package cpp-13-powerpc64le-linux-gnu.
Preparing to unpack .../019-cpp-13-powerpc64le-linux-gnu_13.2.0-12cross1_amd64.deb ...
Unpacking cpp-13-powerpc64le-linux-gnu (13.2.0-12cross1) ...
Selecting previously unselected package cpp-powerpc64le-linux-gnu.
Preparing to unpack .../020-cpp-powerpc64le-linux-gnu_4%3a13.2.0-7_amd64.deb ...
Unpacking cpp-powerpc64le-linux-gnu (4:13.2.0-7) ...
Selecting previously unselected package cross-config.
Preparing to unpack .../021-cross-config_2.6.20_all.deb ...
Unpacking cross-config (2.6.20) ...
Selecting previously unselected package gcc-13-cross-base.
Preparing to unpack .../022-gcc-13-cross-base_13.2.0-12cross1_all.deb ...
Unpacking gcc-13-cross-base (13.2.0-12cross1) ...
Selecting previously unselected package gcc-14-cross-base.
Preparing to unpack .../023-gcc-14-cross-base_14-20240127-1cross1_all.deb ...
Unpacking gcc-14-cross-base (14-20240127-1cross1) ...
Selecting previously unselected package libc6-ppc64el-cross.
Preparing to unpack .../024-libc6-ppc64el-cross_2.38-11cross1_all.deb ...
Unpacking libc6-ppc64el-cross (2.38-11cross1) ...
Selecting previously unselected package libgcc-s1-ppc64el-cross.
Preparing to unpack .../025-libgcc-s1-ppc64el-cross_14-20240127-1cross1_all.deb ...
Unpacking libgcc-s1-ppc64el-cross (14-20240127-1cross1) ...
Selecting previously unselected package libgomp1-ppc64el-cross.
Preparing to unpack .../026-libgomp1-ppc64el-cross_14-20240127-1cross1_all.deb ...
Unpacking libgomp1-ppc64el-cross (14-20240127-1cross1) ...
Selecting previously unselected package libitm1-ppc64el-cross.
Preparing to unpack .../027-libitm1-ppc64el-cross_14-20240127-1cross1_all.deb ...
Unpacking libitm1-ppc64el-cross (14-20240127-1cross1) ...
Selecting previously unselected package libatomic1-ppc64el-cross.
Preparing to unpack .../028-libatomic1-ppc64el-cross_14-20240127-1cross1_all.deb ...
Unpacking libatomic1-ppc64el-cross (14-20240127-1cross1) ...
Selecting previously unselected package libasan8-ppc64el-cross.
Preparing to unpack .../029-libasan8-ppc64el-cross_14-20240127-1cross1_all.deb ...
Unpacking libasan8-ppc64el-cross (14-20240127-1cross1) ...
Selecting previously unselected package liblsan0-ppc64el-cross.
Preparing to unpack .../030-liblsan0-ppc64el-cross_14-20240127-1cross1_all.deb ...
Unpacking liblsan0-ppc64el-cross (14-20240127-1cross1) ...
Selecting previously unselected package libtsan2-ppc64el-cross.
Preparing to unpack .../031-libtsan2-ppc64el-cross_14-20240127-1cross1_all.deb ...
Unpacking libtsan2-ppc64el-cross (14-20240127-1cross1) ...
Selecting previously unselected package libstdc++6-ppc64el-cross.
Preparing to unpack .../032-libstdc++6-ppc64el-cross_14-20240127-1cross1_all.deb ...
Unpacking libstdc++6-ppc64el-cross (14-20240127-1cross1) ...
Selecting previously unselected package libubsan1-ppc64el-cross.
Preparing to unpack .../033-libubsan1-ppc64el-cross_14-20240127-1cross1_all.deb ...
Unpacking libubsan1-ppc64el-cross (14-20240127-1cross1) ...
Selecting previously unselected package libquadmath0-ppc64el-cross.
Preparing to unpack .../034-libquadmath0-ppc64el-cross_14-20240127-1cross1_all.deb ...
Unpacking libquadmath0-ppc64el-cross (14-20240127-1cross1) ...
Selecting previously unselected package libgcc-13-dev-ppc64el-cross.
Preparing to unpack .../035-libgcc-13-dev-ppc64el-cross_13.2.0-12cross1_all.deb ...
Unpacking libgcc-13-dev-ppc64el-cross (13.2.0-12cross1) ...
Selecting previously unselected package gcc-13-powerpc64le-linux-gnu.
Preparing to unpack .../036-gcc-13-powerpc64le-linux-gnu_13.2.0-12cross1_amd64.deb ...
Unpacking gcc-13-powerpc64le-linux-gnu (13.2.0-12cross1) ...
Selecting previously unselected package gcc-powerpc64le-linux-gnu.
Preparing to unpack .../037-gcc-powerpc64le-linux-gnu_4%3a13.2.0-7_amd64.deb ...
Unpacking gcc-powerpc64le-linux-gnu (4:13.2.0-7) ...
Selecting previously unselected package libc6-dev-ppc64el-cross.
Preparing to unpack .../038-libc6-dev-ppc64el-cross_2.38-11cross1_all.deb ...
Unpacking libc6-dev-ppc64el-cross (2.38-11cross1) ...
Selecting previously unselected package libstdc++-13-dev-ppc64el-cross.
Preparing to unpack .../039-libstdc++-13-dev-ppc64el-cross_13.2.0-12cross1_all.deb ...
Unpacking libstdc++-13-dev-ppc64el-cross (13.2.0-12cross1) ...
Selecting previously unselected package g++-13-powerpc64le-linux-gnu.
Preparing to unpack .../040-g++-13-powerpc64le-linux-gnu_13.2.0-12cross1_amd64.deb ...
Unpacking g++-13-powerpc64le-linux-gnu (13.2.0-12cross1) ...
Selecting previously unselected package g++-powerpc64le-linux-gnu.
Preparing to unpack .../041-g++-powerpc64le-linux-gnu_4%3a13.2.0-7_amd64.deb ...
Unpacking g++-powerpc64le-linux-gnu (4:13.2.0-7) ...
Selecting previously unselected package libconfig-inifiles-perl.
Preparing to unpack .../042-libconfig-inifiles-perl_3.000003-2_all.deb ...
Unpacking libconfig-inifiles-perl (3.000003-2) ...
Selecting previously unselected package libio-string-perl.
Preparing to unpack .../043-libio-string-perl_1.08-4_all.deb ...
Unpacking libio-string-perl (1.08-4) ...
Selecting previously unselected package libicu72:amd64.
Preparing to unpack .../044-libicu72_72.1-4+b1_amd64.deb ...
Unpacking libicu72:amd64 (72.1-4+b1) ...
Selecting previously unselected package libxml2:amd64.
Preparing to unpack .../045-libxml2_2.9.14+dfsg-1.3+b3_amd64.deb ...
Unpacking libxml2:amd64 (2.9.14+dfsg-1.3+b3) ...
Selecting previously unselected package libxml-namespacesupport-perl.
Preparing to unpack .../046-libxml-namespacesupport-perl_1.12-2_all.deb ...
Unpacking libxml-namespacesupport-perl (1.12-2) ...
Selecting previously unselected package libxml-sax-base-perl.
Preparing to unpack .../047-libxml-sax-base-perl_1.09-3_all.deb ...
Unpacking libxml-sax-base-perl (1.09-3) ...
Selecting previously unselected package libxml-sax-perl.
Preparing to unpack .../048-libxml-sax-perl_1.02+dfsg-3_all.deb ...
Unpacking libxml-sax-perl (1.02+dfsg-3) ...
Selecting previously unselected package libxml-libxml-perl.
Preparing to unpack .../049-libxml-libxml-perl_2.0207+dfsg+really+2.0134-1+b3_amd64.deb ...
Unpacking libxml-libxml-perl (2.0207+dfsg+really+2.0134-1+b3) ...
Selecting previously unselected package libxml-simple-perl.
Preparing to unpack .../050-libxml-simple-perl_2.25-2_all.deb ...
Unpacking libxml-simple-perl (2.25-2) ...
Selecting previously unselected package libyaml-perl.
Preparing to unpack .../051-libyaml-perl_1.31-1_all.deb ...
Unpacking libyaml-perl (1.31-1) ...
Selecting previously unselected package libconfig-auto-perl.
Preparing to unpack .../052-libconfig-auto-perl_0.44-2_all.deb ...
Unpacking libconfig-auto-perl (0.44-2) ...
Selecting previously unselected package libfile-which-perl.
Preparing to unpack .../053-libfile-which-perl_1.27-2_all.deb ...
Unpacking libfile-which-perl (1.27-2) ...
Selecting previously unselected package libfile-homedir-perl.
Preparing to unpack .../054-libfile-homedir-perl_1.006-2_all.deb ...
Unpacking libfile-homedir-perl (1.006-2) ...
Selecting previously unselected package libdebian-dpkgcross-perl.
Preparing to unpack .../055-libdebian-dpkgcross-perl_2.6.20_all.deb ...
Unpacking libdebian-dpkgcross-perl (2.6.20) ...
Selecting previously unselected package dpkg-cross.
Preparing to unpack .../056-dpkg-cross_2.6.20_all.deb ...
Unpacking dpkg-cross (2.6.20) ...
Selecting previously unselected package crossbuild-essential-ppc64el.
Preparing to unpack .../057-crossbuild-essential-ppc64el_12.10_all.deb ...
Unpacking crossbuild-essential-ppc64el (12.10) ...
Selecting previously unselected package libdebhelper-perl.
Preparing to unpack .../058-libdebhelper-perl_13.15.3_all.deb ...
Unpacking libdebhelper-perl (13.15.3) ...
Selecting previously unselected package libtool.
Preparing to unpack .../059-libtool_2.4.7-7_all.deb ...
Unpacking libtool (2.4.7-7) ...
Selecting previously unselected package dh-autoreconf.
Preparing to unpack .../060-dh-autoreconf_20_all.deb ...
Unpacking dh-autoreconf (20) ...
Selecting previously unselected package libarchive-zip-perl.
Preparing to unpack .../061-libarchive-zip-perl_1.68-1_all.deb ...
Unpacking libarchive-zip-perl (1.68-1) ...
Selecting previously unselected package libparams-util-perl.
Preparing to unpack .../062-libparams-util-perl_1.102-3_amd64.deb ...
Unpacking libparams-util-perl (1.102-3) ...
Selecting previously unselected package libsub-install-perl.
Preparing to unpack .../063-libsub-install-perl_0.929-1_all.deb ...
Unpacking libsub-install-perl (0.929-1) ...
Selecting previously unselected package libdata-optlist-perl.
Preparing to unpack .../064-libdata-optlist-perl_0.114-1_all.deb ...
Unpacking libdata-optlist-perl (0.114-1) ...
Selecting previously unselected package libsub-exporter-perl.
Preparing to unpack .../065-libsub-exporter-perl_0.990-1_all.deb ...
Unpacking libsub-exporter-perl (0.990-1) ...
Selecting previously unselected package libsub-prototype-perl.
Preparing to unpack .../066-libsub-prototype-perl_0.03-2+b2_amd64.deb ...
Unpacking libsub-prototype-perl (0.03-2+b2) ...
Selecting previously unselected package libsub-override-perl.
Preparing to unpack .../067-libsub-override-perl_0.11-1_all.deb ...
Unpacking libsub-override-perl (0.11-1) ...
Selecting previously unselected package libfile-stripnondeterminism-perl.
Preparing to unpack .../068-libfile-stripnondeterminism-perl_1.13.1-1_all.deb ...
Unpacking libfile-stripnondeterminism-perl (1.13.1-1) ...
Selecting previously unselected package dh-strip-nondeterminism.
Preparing to unpack .../069-dh-strip-nondeterminism_1.13.1-1_all.deb ...
Unpacking dh-strip-nondeterminism (1.13.1-1) ...
Selecting previously unselected package libelf1t64:amd64.
Preparing to unpack .../070-libelf1t64_0.191-1+b1_amd64.deb ...
Unpacking libelf1t64:amd64 (0.191-1+b1) ...
Selecting previously unselected package dwz.
Preparing to unpack .../071-dwz_0.15-1+b1_amd64.deb ...
Unpacking dwz (0.15-1+b1) ...
Selecting previously unselected package gettext.
Preparing to unpack .../072-gettext_0.21-14+b1_amd64.deb ...
Unpacking gettext (0.21-14+b1) ...
Selecting previously unselected package intltool-debian.
Preparing to unpack .../073-intltool-debian_0.35.0+20060710.6_all.deb ...
Unpacking intltool-debian (0.35.0+20060710.6) ...
Selecting previously unselected package po-debconf.
Preparing to unpack .../074-po-debconf_1.0.21+nmu1_all.deb ...
Unpacking po-debconf (1.0.21+nmu1) ...
Selecting previously unselected package debhelper.
Preparing to unpack .../075-debhelper_13.15.3_all.deb ...
Unpacking debhelper (13.15.3) ...
Selecting previously unselected package libfakeroot:amd64.
Preparing to unpack .../076-libfakeroot_1.34-1_amd64.deb ...
Unpacking libfakeroot:amd64 (1.34-1) ...
Selecting previously unselected package fakeroot.
Preparing to unpack .../077-fakeroot_1.34-1_amd64.deb ...
Unpacking fakeroot (1.34-1) ...
Selecting previously unselected package gcc-13-base:ppc64el.
Preparing to unpack .../078-gcc-13-base_13.2.0-25_ppc64el.deb ...
Unpacking gcc-13-base:ppc64el (13.2.0-25) ...
Selecting previously unselected package gcc-14-base:ppc64el.
Preparing to unpack .../079-gcc-14-base_14.1.0-1_ppc64el.deb ...
Unpacking gcc-14-base:ppc64el (14.1.0-1) ...
Selecting previously unselected package libgcc-s1:ppc64el.
Preparing to unpack .../080-libgcc-s1_14.1.0-1_ppc64el.deb ...
Unpacking libgcc-s1:ppc64el (14.1.0-1) ...
Selecting previously unselected package libc6:ppc64el.
Preparing to unpack .../081-libc6_2.38-11_ppc64el.deb ...
Unpacking libc6:ppc64el (2.38-11) ...
Selecting previously unselected package libasan8:ppc64el.
Preparing to unpack .../082-libasan8_14.1.0-1_ppc64el.deb ...
Unpacking libasan8:ppc64el (14.1.0-1) ...
Selecting previously unselected package libatomic1:ppc64el.
Preparing to unpack .../083-libatomic1_14.1.0-1_ppc64el.deb ...
Unpacking libatomic1:ppc64el (14.1.0-1) ...
Selecting previously unselected package libcap-ng0:ppc64el.
Preparing to unpack .../084-libcap-ng0_0.8.5-1_ppc64el.deb ...
Unpacking libcap-ng0:ppc64el (0.8.5-1) ...
Selecting previously unselected package libaudit1:ppc64el.
Preparing to unpack .../085-libaudit1_1%3a3.1.2-2.1_ppc64el.deb ...
Unpacking libaudit1:ppc64el (1:3.1.2-2.1) ...
Selecting previously unselected package libcrypt1:ppc64el.
Preparing to unpack .../086-libcrypt1_1%3a4.4.36-4_ppc64el.deb ...
Unpacking libcrypt1:ppc64el (1:4.4.36-4) ...
Selecting previously unselected package libcrypt-dev:ppc64el.
Preparing to unpack .../087-libcrypt-dev_1%3a4.4.36-4_ppc64el.deb ...
Unpacking libcrypt-dev:ppc64el (1:4.4.36-4) ...
Selecting previously unselected package libc6-dev:ppc64el.
Preparing to unpack .../088-libc6-dev_2.38-11_ppc64el.deb ...
Unpacking libc6-dev:ppc64el (2.38-11) ...
Selecting previously unselected package libgomp1:ppc64el.
Preparing to unpack .../089-libgomp1_14.1.0-1_ppc64el.deb ...
Unpacking libgomp1:ppc64el (14.1.0-1) ...
Selecting previously unselected package libitm1:ppc64el.
Preparing to unpack .../090-libitm1_14.1.0-1_ppc64el.deb ...
Unpacking libitm1:ppc64el (14.1.0-1) ...
Selecting previously unselected package liblsan0:ppc64el.
Preparing to unpack .../091-liblsan0_14.1.0-1_ppc64el.deb ...
Unpacking liblsan0:ppc64el (14.1.0-1) ...
Selecting previously unselected package libtsan2:ppc64el.
Preparing to unpack .../092-libtsan2_14.1.0-1_ppc64el.deb ...
Unpacking libtsan2:ppc64el (14.1.0-1) ...
Selecting previously unselected package libstdc++6:ppc64el.
Preparing to unpack .../093-libstdc++6_14.1.0-1_ppc64el.deb ...
Unpacking libstdc++6:ppc64el (14.1.0-1) ...
Selecting previously unselected package libubsan1:ppc64el.
Preparing to unpack .../094-libubsan1_14.1.0-1_ppc64el.deb ...
Unpacking libubsan1:ppc64el (14.1.0-1) ...
Selecting previously unselected package libquadmath0:ppc64el.
Preparing to unpack .../095-libquadmath0_14.1.0-1_ppc64el.deb ...
Unpacking libquadmath0:ppc64el (14.1.0-1) ...
Selecting previously unselected package libgcc-13-dev:ppc64el.
Preparing to unpack .../096-libgcc-13-dev_13.2.0-25_ppc64el.deb ...
Unpacking libgcc-13-dev:ppc64el (13.2.0-25) ...
Selecting previously unselected package libltdl7:ppc64el.
Preparing to unpack .../097-libltdl7_2.4.7-7+b1_ppc64el.deb ...
Unpacking libltdl7:ppc64el (2.4.7-7+b1) ...
Selecting previously unselected package libltdl-dev:ppc64el.
Preparing to unpack .../098-libltdl-dev_2.4.7-7+b1_ppc64el.deb ...
Unpacking libltdl-dev:ppc64el (2.4.7-7+b1) ...
Selecting previously unselected package libzstd1:ppc64el.
Preparing to unpack .../099-libzstd1_1.5.5+dfsg2-2_ppc64el.deb ...
Unpacking libzstd1:ppc64el (1.5.5+dfsg2-2) ...
Selecting previously unselected package zlib1g:ppc64el.
Preparing to unpack .../100-zlib1g_1%3a1.3.dfsg+really1.3.1-1_ppc64el.deb ...
Unpacking zlib1g:ppc64el (1:1.3.dfsg+really1.3.1-1) ...
Selecting previously unselected package libssl3t64:ppc64el.
Preparing to unpack .../101-libssl3t64_3.2.1-3_ppc64el.deb ...
Unpacking libssl3t64:ppc64el (3.2.1-3) ...
Selecting previously unselected package libp11-3t64:ppc64el.
Preparing to unpack .../102-libp11-3t64_0.4.12-2_ppc64el.deb ...
Unpacking libp11-3t64:ppc64el (0.4.12-2) ...
Selecting previously unselected package libssl-dev:ppc64el.
Preparing to unpack .../103-libssl-dev_3.2.1-3_ppc64el.deb ...
Unpacking libssl-dev:ppc64el (3.2.1-3) ...
Selecting previously unselected package libp11-dev:ppc64el.
Preparing to unpack .../104-libp11-dev_0.4.12-2_ppc64el.deb ...
Unpacking libp11-dev:ppc64el (0.4.12-2) ...
Selecting previously unselected package libpam0g:ppc64el.
Preparing to unpack .../105-libpam0g_1.5.3-7_ppc64el.deb ...
Unpacking libpam0g:ppc64el (1.5.3-7) ...
Selecting previously unselected package libpam0g-dev:ppc64el.
Preparing to unpack .../106-libpam0g-dev_1.5.3-7_ppc64el.deb ...
Unpacking libpam0g-dev:ppc64el (1.5.3-7) ...
Selecting previously unselected package libstdc++-13-dev:ppc64el.
Preparing to unpack .../107-libstdc++-13-dev_13.2.0-25_ppc64el.deb ...
Unpacking libstdc++-13-dev:ppc64el (13.2.0-25) ...
Selecting previously unselected package sbuild-build-depends-main-dummy:ppc64el.
Preparing to unpack .../108-sbuild-build-depends-main-dummy_0.invalid.0_ppc64el.deb ...
Unpacking sbuild-build-depends-main-dummy:ppc64el (0.invalid.0) ...
Setting up libconfig-inifiles-perl (3.000003-2) ...
Setting up libpipeline1:amd64 (1.5.7-2) ...
Setting up libfile-which-perl (1.27-2) ...
Setting up libicu72:amd64 (72.1-4+b1) ...
Setting up bsdextrautils (2.40.1-1) ...
Setting up libmagic-mgc (1:5.45-3) ...
Setting up gcc-14-base:ppc64el (14.1.0-1) ...
Setting up libarchive-zip-perl (1.68-1) ...
Setting up libc6-ppc64el-cross (2.38-11cross1) ...
Setting up libdebhelper-perl (13.15.3) ...
Setting up libmagic1t64:amd64 (1:5.45-3) ...
Setting up libxml-namespacesupport-perl (1.12-2) ...
Setting up gettext-base (0.21-14+b1) ...
Setting up m4 (1.4.19-4) ...
Setting up gcc-14-cross-base (14-20240127-1cross1) ...
Setting up file (1:5.45-3) ...
Setting up gcc-13-powerpc64le-linux-gnu-base:amd64 (13.2.0-12cross1) ...
Setting up libgomp1-ppc64el-cross (14-20240127-1cross1) ...
Setting up libyaml-perl (1.31-1) ...
Setting up libfakeroot:amd64 (1.34-1) ...
Setting up libsub-install-perl (0.929-1) ...
Setting up libelf1t64:amd64 (0.191-1+b1) ...
Setting up fakeroot (1.34-1) ...
update-alternatives: using /usr/bin/fakeroot-sysv to provide /usr/bin/fakeroot (fakeroot) in auto mode
Setting up libxml-sax-base-perl (1.09-3) ...
Setting up libio-string-perl (1.08-4) ...
Setting up autotools-dev (20220109.1) ...
Setting up cross-config (2.6.20) ...
Setting up gcc-13-base:ppc64el (13.2.0-25) ...
Setting up gcc-13-cross-base (13.2.0-12cross1) ...
Setting up autopoint (0.21-14) ...
Setting up libparams-util-perl (1.102-3) ...
Setting up autoconf (2.71-3) ...
Setting up libitm1-ppc64el-cross (14-20240127-1cross1) ...
Setting up libatomic1-ppc64el-cross (14-20240127-1cross1) ...
Setting up dwz (0.15-1+b1) ...
Setting up sensible-utils (0.0.22) ...
Setting up libuchardet0:amd64 (0.0.8-1+b1) ...
Setting up libgcc-s1-ppc64el-cross (14-20240127-1cross1) ...
Setting up binutils-powerpc64le-linux-gnu (2.42-4) ...
Setting up libfile-homedir-perl (1.006-2) ...
Setting up cpp-13-powerpc64le-linux-gnu (13.2.0-12cross1) ...
Setting up libxml2:amd64 (2.9.14+dfsg-1.3+b3) ...
Setting up liblocale-gettext-perl (1.07-7) ...
Setting up cpp-powerpc64le-linux-gnu (4:13.2.0-7) ...
Setting up automake (1:1.16.5-1.3) ...
update-alternatives: using /usr/bin/automake-1.16 to provide /usr/bin/automake (automake) in auto mode
Setting up gettext (0.21-14+b1) ...
Setting up libc6-dev-ppc64el-cross (2.38-11cross1) ...
Setting up libtool (2.4.7-7) ...
Setting up libquadmath0-ppc64el-cross (14-20240127-1cross1) ...
Setting up libasan8-ppc64el-cross (14-20240127-1cross1) ...
Setting up liblsan0-ppc64el-cross (14-20240127-1cross1) ...
Setting up intltool-debian (0.35.0+20060710.6) ...
Setting up libtsan2-ppc64el-cross (14-20240127-1cross1) ...
Setting up dh-autoreconf (20) ...
Setting up libdata-optlist-perl (0.114-1) ...
Setting up ucf (3.0043+nmu1) ...
Setting up libstdc++6-ppc64el-cross (14-20240127-1cross1) ...
Setting up groff-base (1.23.0-4) ...
Setting up libsub-exporter-perl (0.990-1) ...
Setting up libubsan1-ppc64el-cross (14-20240127-1cross1) ...
Setting up po-debconf (1.0.21+nmu1) ...
Setting up libsub-prototype-perl (0.03-2+b2) ...
Setting up man-db (2.12.1-1) ...
Not building database; man-db/auto-update is not 'true'.
Setting up libxml-sax-perl (1.02+dfsg-3) ...
update-perl-sax-parsers: Registering Perl SAX parser XML::SAX::PurePerl with priority 10...
update-perl-sax-parsers: Updating overall Perl SAX parser modules info file...

Creating config file /etc/perl/XML/SAX/ParserDetails.ini with new version
Setting up libxml-libxml-perl (2.0207+dfsg+really+2.0134-1+b3) ...
update-perl-sax-parsers: Registering Perl SAX parser XML::LibXML::SAX::Parser with priority 50...
update-perl-sax-parsers: Registering Perl SAX parser XML::LibXML::SAX with priority 50...
update-perl-sax-parsers: Updating overall Perl SAX parser modules info file...
Replacing config file /etc/perl/XML/SAX/ParserDetails.ini with new version
Setting up libsub-override-perl (0.11-1) ...
Setting up libgcc-13-dev-ppc64el-cross (13.2.0-12cross1) ...
Setting up libfile-stripnondeterminism-perl (1.13.1-1) ...
Setting up libstdc++-13-dev-ppc64el-cross (13.2.0-12cross1) ...
Setting up gcc-13-powerpc64le-linux-gnu (13.2.0-12cross1) ...
Setting up libxml-simple-perl (2.25-2) ...
Setting up dh-strip-nondeterminism (1.13.1-1) ...
Setting up debhelper (13.15.3) ...
Setting up libconfig-auto-perl (0.44-2) ...
Setting up g++-13-powerpc64le-linux-gnu (13.2.0-12cross1) ...
Setting up gcc-powerpc64le-linux-gnu (4:13.2.0-7) ...
Setting up libdebian-dpkgcross-perl (2.6.20) ...
Setting up g++-powerpc64le-linux-gnu (4:13.2.0-7) ...
Setting up dpkg-cross (2.6.20) ...
Setting up crossbuild-essential-ppc64el (12.10) ...
Setting up libgcc-s1:ppc64el (14.1.0-1) ...
Setting up libc6:ppc64el (2.38-11) ...
Setting up libasan8:ppc64el (14.1.0-1) ...
Setting up libtsan2:ppc64el (14.1.0-1) ...
Setting up libstdc++6:ppc64el (14.1.0-1) ...
Setting up liblsan0:ppc64el (14.1.0-1) ...
Setting up libitm1:ppc64el (14.1.0-1) ...
Setting up libzstd1:ppc64el (1.5.5+dfsg2-2) ...
Setting up zlib1g:ppc64el (1:1.3.dfsg+really1.3.1-1) ...
Setting up libcrypt1:ppc64el (1:4.4.36-4) ...
Setting up libgomp1:ppc64el (14.1.0-1) ...
Setting up libcap-ng0:ppc64el (0.8.5-1) ...
Setting up libquadmath0:ppc64el (14.1.0-1) ...
Setting up libaudit1:ppc64el (1:3.1.2-2.1) ...
Setting up libatomic1:ppc64el (14.1.0-1) ...
Setting up libltdl7:ppc64el (2.4.7-7+b1) ...
Setting up libubsan1:ppc64el (14.1.0-1) ...
Setting up libgcc-13-dev:ppc64el (13.2.0-25) ...
Setting up libcrypt-dev:ppc64el (1:4.4.36-4) ...
Setting up libc6-dev:ppc64el (2.38-11) ...
Setting up libstdc++-13-dev:ppc64el (13.2.0-25) ...
Setting up libssl3t64:ppc64el (3.2.1-3) ...
Setting up libp11-3t64:ppc64el (0.4.12-2) ...
Setting up libltdl-dev:ppc64el (2.4.7-7+b1) ...
Setting up libpam0g:ppc64el (1.5.3-7) ...
Setting up libssl-dev:ppc64el (3.2.1-3) ...
Setting up libp11-dev:ppc64el (0.4.12-2) ...
Setting up libpam0g-dev:ppc64el (1.5.3-7) ...
Setting up sbuild-build-depends-main-dummy:ppc64el (0.invalid.0) ...
Processing triggers for libc-bin (2.38-11) ...

+------------------------------------------------------------------------------+
| Check architectures                                                          |
+------------------------------------------------------------------------------+

Arch check ok (ppc64el included in any)

+------------------------------------------------------------------------------+
| Build environment                                                            |
+------------------------------------------------------------------------------+

Kernel: Linux 6.1.0-20-amd64 #1 SMP PREEMPT_DYNAMIC Debian 6.1.85-1 (2024-04-11) amd64 (x86_64)
Toolchain package versions: binutils_2.42-4 dpkg-dev_1.22.6 g++-13_13.2.0-25 gcc-13_13.2.0-25 libc6-dev_2.38-11 libstdc++-13-dev_13.2.0-25 libstdc++-13-dev-ppc64el-cross_13.2.0-12cross1 libstdc++6_14.1.0-1 libstdc++6-ppc64el-cross_14-20240127-1cross1 linux-libc-dev_6.8.9-1
Package versions: adduser_3.137 apt_2.9.3 autoconf_2.71-3 automake_1:1.16.5-1.3 autopoint_0.21-14 autotools-dev_20220109.1 base-files_13.2 base-passwd_3.6.3 bash_5.2.21-2+b1 binutils_2.42-4 binutils-common_2.42-4 binutils-powerpc64le-linux-gnu_2.42-4 binutils-x86-64-linux-gnu_2.42-4 bsdextrautils_2.40.1-1 bsdutils_1:2.40.1-1 build-essential_12.10 bzip2_1.0.8-5.1 coreutils_9.4-3.1 cpp_4:13.2.0-7 cpp-13_13.2.0-25 cpp-13-powerpc64le-linux-gnu_13.2.0-12cross1 cpp-13-x86-64-linux-gnu_13.2.0-25 cpp-powerpc64le-linux-gnu_4:13.2.0-7 cpp-x86-64-linux-gnu_4:13.2.0-7 cross-config_2.6.20 crossbuild-essential-ppc64el_12.10 dash_0.5.12-7 debconf_1.5.86 debhelper_13.15.3 debian-archive-keyring_2023.4 debianutils_5.17 dh-autoreconf_20 dh-strip-nondeterminism_1.13.1-1 diffutils_1:3.10-1 dpkg_1.22.6 dpkg-cross_2.6.20 dpkg-dev_1.22.6 dwz_0.15-1+b1 fakeroot_1.34-1 file_1:5.45-3 findutils_4.9.0-5 g++_4:13.2.0-7 g++-13_13.2.0-25 g++-13-powerpc64le-linux-gnu_13.2.0-12cross1 g++-13-x86-64-linux-gnu_13.2.0-25 g++-powerpc64le-linux-gnu_4:13.2.0-7 g++-x86-64-linux-gnu_4:13.2.0-7 gcc_4:13.2.0-7 gcc-13_13.2.0-25 gcc-13-base_13.2.0-25 gcc-13-cross-base_13.2.0-12cross1 gcc-13-powerpc64le-linux-gnu_13.2.0-12cross1 gcc-13-powerpc64le-linux-gnu-base_13.2.0-12cross1 gcc-13-x86-64-linux-gnu_13.2.0-25 gcc-14-base_14.1.0-1 gcc-14-cross-base_14-20240127-1cross1 gcc-powerpc64le-linux-gnu_4:13.2.0-7 gcc-x86-64-linux-gnu_4:13.2.0-7 gettext_0.21-14+b1 gettext-base_0.21-14+b1 gpgv_2.2.43-6 grep_3.11-4 groff-base_1.23.0-4 gzip_1.12-1.1 hostname_3.23+nmu2 init-system-helpers_1.66 intltool-debian_0.35.0+20060710.6 libacl1_2.3.2-2 libapt-pkg6.0t64_2.9.3 libarchive-zip-perl_1.68-1 libasan8_14.1.0-1 libasan8-ppc64el-cross_14-20240127-1cross1 libatomic1_14.1.0-1 libatomic1-ppc64el-cross_14-20240127-1cross1 libattr1_1:2.5.2-1 libaudit-common_1:3.1.2-2.1 libaudit1_1:3.1.2-2.1 libbinutils_2.42-4 libblkid1_2.40.1-1 libbz2-1.0_1.0.8-5.1 libc-bin_2.38-11 libc-dev-bin_2.38-11 libc6_2.38-11 libc6-dev_2.38-11 libc6-dev-ppc64el-cross_2.38-11cross1 libc6-ppc64el-cross_2.38-11cross1 libcap-ng0_0.8.5-1 libcap2_1:2.66-5 libcc1-0_14.1.0-1 libconfig-auto-perl_0.44-2 libconfig-inifiles-perl_3.000003-2 libcrypt-dev_1:4.4.36-4 libcrypt1_1:4.4.36-4 libctf-nobfd0_2.42-4 libctf0_2.42-4 libdata-optlist-perl_0.114-1 libdb5.3t64_5.3.28+dfsg2-7 libdebconfclient0_0.271+b3 libdebhelper-perl_13.15.3 libdebian-dpkgcross-perl_2.6.20 libdpkg-perl_1.22.6 libelf1t64_0.191-1+b1 libfakeroot_1.34-1 libffi8_3.4.6-1 libfile-homedir-perl_1.006-2 libfile-stripnondeterminism-perl_1.13.1-1 libfile-which-perl_1.27-2 libgcc-13-dev_13.2.0-25 libgcc-13-dev-ppc64el-cross_13.2.0-12cross1 libgcc-s1_14.1.0-1 libgcc-s1-ppc64el-cross_14-20240127-1cross1 libgcrypt20_1.10.3-3 libgdbm-compat4t64_1.23-5.1+b1 libgdbm6t64_1.23-5.1+b1 libgmp10_2:6.3.0+dfsg-2+b1 libgnutls30t64_3.8.5-2 libgomp1_14.1.0-1 libgomp1-ppc64el-cross_14-20240127-1cross1 libgpg-error0_1.49-2 libgprofng0_2.42-4 libhogweed6t64_3.9.1-2.2 libhwasan0_14.1.0-1 libicu72_72.1-4+b1 libidn2-0_2.3.7-2 libio-string-perl_1.08-4 libisl23_0.26-3+b2 libitm1_14.1.0-1 libitm1-ppc64el-cross_14-20240127-1cross1 libjansson4_2.14-2+b2 liblocale-gettext-perl_1.07-7 liblsan0_14.1.0-1 liblsan0-ppc64el-cross_14-20240127-1cross1 libltdl-dev_2.4.7-7+b1 libltdl7_2.4.7-7+b1 liblz4-1_1.9.4-2 liblzma5_5.6.1+really5.4.5-1 libmagic-mgc_1:5.45-3 libmagic1t64_1:5.45-3 libmd0_1.1.0-2 libmount1_2.40.1-1 libmpc3_1.3.1-1+b2 libmpfr6_4.2.1-1+b1 libnettle8t64_3.9.1-2.2 libp11-3t64_0.4.12-2 libp11-dev_0.4.12-2 libp11-kit0_0.25.3-5 libpam-modules_1.5.3-7 libpam-modules-bin_1.5.3-7 libpam-runtime_1.5.3-7 libpam0g_1.5.3-7 libpam0g-dev_1.5.3-7 libparams-util-perl_1.102-3 libpcre2-8-0_10.42-4+b1 libperl5.38t64_5.38.2-4 libpipeline1_1.5.7-2 libquadmath0_14.1.0-1 libquadmath0-ppc64el-cross_14-20240127-1cross1 libseccomp2_2.5.5-1 libselinux1_3.5-2+b2 libsemanage-common_3.5-1 libsemanage2_3.5-1+b3 libsepol2_3.5-2+b1 libsframe1_2.42-4 libsmartcols1_2.40.1-1 libssl-dev_3.2.1-3 libssl3t64_3.2.1-3 libstdc++-13-dev_13.2.0-25 libstdc++-13-dev-ppc64el-cross_13.2.0-12cross1 libstdc++6_14.1.0-1 libstdc++6-ppc64el-cross_14-20240127-1cross1 libsub-exporter-perl_0.990-1 libsub-install-perl_0.929-1 libsub-override-perl_0.11-1 libsub-prototype-perl_0.03-2+b2 libsystemd0_256~rc2-3 libtasn1-6_4.19.0-3+b2 libtinfo6_6.5-2 libtool_2.4.7-7 libtsan2_14.1.0-1 libtsan2-ppc64el-cross_14-20240127-1cross1 libubsan1_14.1.0-1 libubsan1-ppc64el-cross_14-20240127-1cross1 libuchardet0_0.0.8-1+b1 libudev1_256~rc2-3 libunistring5_1.2-1 libuuid1_2.40.1-1 libxml-libxml-perl_2.0207+dfsg+really+2.0134-1+b3 libxml-namespacesupport-perl_1.12-2 libxml-sax-base-perl_1.09-3 libxml-sax-perl_1.02+dfsg-3 libxml-simple-perl_2.25-2 libxml2_2.9.14+dfsg-1.3+b3 libxxhash0_0.8.2-2+b1 libyaml-perl_1.31-1 libzstd1_1.5.5+dfsg2-2 linux-libc-dev_6.8.9-1 login_1:4.13+dfsg1-4 m4_1.4.19-4 make_4.3-4.1 man-db_2.12.1-1 mawk_1.3.4.20240123-1 mount_2.40.1-1 ncurses-base_6.5-2 ncurses-bin_6.5-2 passwd_1:4.13+dfsg1-4 patch_2.7.6-7 perl_5.38.2-4 perl-base_5.38.2-4 perl-modules-5.38_5.38.2-4 po-debconf_1.0.21+nmu1 rpcsvc-proto_1.4.3-1 sbuild-build-depends-main-dummy_0.invalid.0 sed_4.9-2 sensible-utils_0.0.22 sysvinit-utils_3.09-1 tar_1.35+dfsg-3 tzdata_2024a-4 ucf_3.0043+nmu1 usr-is-merged_39 util-linux_2.40.1-1 xz-utils_5.6.1+really5.4.5-1 zlib1g_1:1.3.dfsg+really1.3.1-1

+------------------------------------------------------------------------------+
| Build                                                                        |
+------------------------------------------------------------------------------+


Unpack source
-------------

-----BEGIN PGP SIGNED MESSAGE-----
Hash: SHA512

Format: 3.0 (quilt)
Source: pam-p11
Binary: libpam-p11
Architecture: any
Version: 0.6.0-1
Maintainer: Debian OpenSC Maintainers <pkg-opensc-maint@lists.alioth.debian.org>
Uploaders: Eric Dorland <eric@debian.org>
Homepage: https://github.com/OpenSC/pam_p11
Standards-Version: 4.4.0.0
Vcs-Browser: https://salsa.debian.org/opensc-team/pam-p11
Vcs-Git: https://salsa.debian.org/opensc-team/pam-p11.git
Build-Depends: debhelper-compat (= 12), libltdl-dev, libp11-dev, libpam0g-dev, libssl-dev
Package-List:
 libpam-p11 deb admin optional arch=any
Checksums-Sha1:
 01972568be13f8d6d1eb333eaaca810c668063ba 33350 pam-p11_0.6.0.orig.tar.gz
 d03dbe01c9830dc0bed6eef2e20c72ba4e2b85f3 3564 pam-p11_0.6.0-1.debian.tar.xz
Checksums-Sha256:
 b1795b2330899a109703e7866459d76aedf41d30c2d31946c1430a8f39d60d39 33350 pam-p11_0.6.0.orig.tar.gz
 88235b5db522ea6a7683d9b598e8a2dff1ec0ddbead92dac8e5179dbd6bac7d5 3564 pam-p11_0.6.0-1.debian.tar.xz
Files:
 6a6e533c98bdf2400b9890d2a9f4b2b2 33350 pam-p11_0.6.0.orig.tar.gz
 7d6c651eb49e869cea624c01583d4af2 3564 pam-p11_0.6.0-1.debian.tar.xz

-----BEGIN PGP SIGNATURE-----

iQHEBAEBCgAuFiEEQGIgyLhVKAI3jM5BH1x6i0VWQxQFAmZFxVIQHGJhZ2VAZGVi
aWFuLm9yZwAKCRAfXHqLRVZDFAdUC/0R235ExhWQ0s1t0kGcS1NshMknSQUqezA3
UFA+wL9z6woouFEaJCksUqnEFuq2gyuDXpZV85vI/PsT7+iPh6hQpUtaou4AZggM
0m9jZvrE5fs4JwY5D1W8xmlF1rw2SW/WNQtoBmYSO01ZZagXb9osl1NUtqTFrcSG
lFt5Fhr0cZpVYLYvgN1F1uxrL6iz0STBguJZPcJrmHCmhUYa/NrdCbXE0kAtSiYH
lDRbLkk0Y3zs4bhhI4PiRy91WfJsLzOhWs2+oV5AjrgAiwinQ3jFTUS/ekoT1oQr
YnYGBt8vnU53b5yBUeWC3DKzZrfLc6nebHIq6wvSSxWpO1MZShdijHJRY5V5ZUCB
FjPmsHO90zOA/gmNl15QHaNygs7tUC2uaKzgyJ4m4yi+kvayE7HLI6apqq1PYkPX
+EO07/rea4sWrmin+MKjKcNA69s5ttuX6S+j7Ugdqeu7vDU5EgVt+s9Ia7reOfpw
to3BvTbHlnYyCZkv8mna1RmR/rEGwmg=
=EAtT
-----END PGP SIGNATURE-----

gpgv: Signature made Thu May 16 08:35:30 2024 UTC
gpgv:                using RSA key 406220C8B8552802378CCE411F5C7A8B45564314
gpgv:                issuer "bage@debian.org"
gpgv: Can't check signature: No public key
dpkg-source: warning: cannot verify inline signature for ./pam-p11_0.6.0-1.dsc: no acceptable signature found
dpkg-source: info: extracting pam-p11 in /<<PKGBUILDDIR>>
dpkg-source: info: unpacking pam-p11_0.6.0.orig.tar.gz
dpkg-source: info: unpacking pam-p11_0.6.0-1.debian.tar.xz

Check disk space
----------------

Sufficient free space for build

User Environment
----------------

APT_CONFIG=/var/lib/sbuild/apt.conf
CONFIG_SITE=/etc/dpkg-cross/cross-config.ppc64el
DEB_BUILD_OPTIONS=nocheck
HOME=/sbuild-nonexistent
LANG=en_US.UTF-8
LC_ALL=C.UTF-8
LOGNAME=crossqa
OLDPWD=/home/crossqa
PATH=/usr/local/sbin:/usr/local/bin:/usr/sbin:/usr/bin:/sbin:/bin:/usr/games
SBUILD_CONFIG=/tmp/tmp.Q6CVBRUslx/sbuild.conf
SCHROOT_ALIAS_NAME=unstable-amd64-sbuild
SCHROOT_CHROOT_NAME=sid-amd64-sbuild
SCHROOT_COMMAND=env
SCHROOT_GID=1000
SCHROOT_GROUP=crossqa
SCHROOT_SESSION_ID=sid-amd64-sbuild-f4485ab5-4a7b-479b-ab67-30bcc72bad14
SCHROOT_UID=1000
SCHROOT_USER=crossqa
SHELL=/bin/sh
USER=crossqa
XDG_SESSION_CLASS=user

dpkg-buildpackage
-----------------

Command: dpkg-buildpackage --sanitize-env -appc64el -Pcross,nocheck -us -uc -B -rfakeroot --jobs-try=1
dpkg-buildpackage: info: source package pam-p11
dpkg-buildpackage: info: source version 0.6.0-1
dpkg-buildpackage: info: source distribution unstable
dpkg-buildpackage: info: source changed by Bastian Germann <bage@debian.org>
dpkg-architecture: warning: specified GNU system type powerpc64le-linux-gnu does not match CC system type x86_64-linux-gnu, try setting a correct CC environment variable
 dpkg-source --before-build .
dpkg-buildpackage: info: host architecture ppc64el
 debian/rules clean
dh clean
   dh_clean
 debian/rules binary-arch
dh binary-arch
   dh_update_autotools_config -a
   dh_autoreconf -a
Copying file ABOUT-NLS
Copying file ./config.rpath
Copying file m4/codeset.m4
Copying file m4/extern-inline.m4
Copying file m4/fcntl-o.m4
Copying file m4/gettext.m4
Copying file m4/glibc2.m4
Copying file m4/glibc21.m4
Copying file m4/iconv.m4
Copying file m4/intdiv0.m4
Copying file m4/intl.m4
Copying file m4/intldir.m4
Copying file m4/intlmacosx.m4
Copying file m4/intmax.m4
Copying file m4/inttypes-pri.m4
Copying file m4/inttypes_h.m4
Copying file m4/lcmessage.m4
Copying file m4/lib-ld.m4
Copying file m4/lib-link.m4
Copying file m4/lib-prefix.m4
Copying file m4/lock.m4
Copying file m4/longlong.m4
Copying file m4/nls.m4
Copying file m4/po.m4
Copying file m4/printf-posix.m4
Copying file m4/progtest.m4
Copying file m4/size_max.m4
Copying file m4/stdint_h.m4
Copying file m4/threadlib.m4
Copying file m4/uintmax_t.m4
Copying file m4/visibility.m4
Copying file m4/wchar_t.m4
Copying file m4/wint_t.m4
Copying file m4/xsize.m4
Copying file po/Makefile.in.in
Copying file po/Makevars.template
Copying file po/Rules-quot
Copying file po/boldquot.sed
Copying file po/en@boldquot.header
Copying file po/en@quot.header
Copying file po/insert-header.sin
Copying file po/quot.sed
Copying file po/remove-potcdate.sin
libtoolize: putting auxiliary files in AC_CONFIG_AUX_DIR, '.'.
libtoolize: copying file './ltmain.sh'
libtoolize: putting macros in AC_CONFIG_MACRO_DIRS, 'm4'.
libtoolize: copying file 'm4/libtool.m4'
libtoolize: copying file 'm4/ltoptions.m4'
libtoolize: copying file 'm4/ltsugar.m4'
libtoolize: copying file 'm4/ltversion.m4'
libtoolize: copying file 'm4/lt~obsolete.m4'
libtoolize: Remember to add 'LT_INIT' to configure.ac.
configure.ac:11: warning: 'AM_CONFIG_HEADER': this macro is obsolete.
configure.ac:11: You should use the 'AC_CONFIG_HEADERS' macro instead.
./lib/autoconf/general.m4:2434: AC_DIAGNOSE is expanded from...
aclocal.m4:745: AM_CONFIG_HEADER is expanded from...
configure.ac:11: the top level
configure.ac:70: error: possibly undefined macro: AC_MSG_ERROR
      If this token and others are legitimate, please use m4_pattern_allow.
      See the Autoconf documentation.
configure.ac:79: error: possibly undefined macro: AC_CHECK_LIB
autoreconf: error: /usr/bin/autoconf failed with exit status: 1
dh_autoreconf: error: autoreconf -f -i returned exit code 1
make: *** [debian/rules:8: binary-arch] Error 255
dpkg-buildpackage: error: debian/rules binary-arch subprocess returned exit status 2
--------------------------------------------------------------------------------
Build finished at 2024-05-19T09:10:18Z

Finished
--------


+------------------------------------------------------------------------------+
| Cleanup                                                                      |
+------------------------------------------------------------------------------+

Purging /<<BUILDDIR>>
Not cleaning session: cloned chroot in use
E: Build failure (dpkg-buildpackage died)

+------------------------------------------------------------------------------+
| Summary                                                                      |
+------------------------------------------------------------------------------+

Build Architecture: amd64
Build Profiles: cross nocheck
Build Type: any
Build-Space: 4724
Build-Time: 6
Distribution: unstable
Fail-Stage: build
Foreign Architectures: ppc64el
Host Architecture: ppc64el
Install-Time: 13
Job: pam-p11_0.6.0-1
Machine Architecture: amd64
Package: pam-p11
Package-Time: 29
Source-Version: 0.6.0-1
Space: 4724
Status: attempted
Version: 0.6.0-1
--------------------------------------------------------------------------------
Finished at 2024-05-19T09:10:18Z
Build needed 00:00:29, 4724k disk space