sbuild (Debian sbuild) 0.85.0 (04 January 2023) on debian-ci-siliconvalley

+==============================================================================+
| polari 46.0-2 (ppc64el)                      Sun, 30 Mar 2025 07:52:45 +0000 |
+==============================================================================+

Package: polari
Version: 46.0-2
Source Version: 46.0-2
Distribution: unstable
Machine Architecture: amd64
Host Architecture: ppc64el
Build Architecture: amd64
Build Profiles: cross nocheck
Build Type: any

I: NOTICE: Log filtering will replace 'var/run/schroot/mount/sid-amd64-sbuild-6364f937-3aff-4a8b-bcf3-dff2a074cd8d' with '<<CHROOT>>'
I: NOTICE: Log filtering will replace 'build/polari-8vKpAu/resolver-ZDxioB' with '<<RESOLVERDIR>>'

+------------------------------------------------------------------------------+
| Update chroot                                                                |
+------------------------------------------------------------------------------+

Get:1 http://localhost:3142/debian unstable InRelease [205 kB]
Get:2 http://localhost:3142/debian unstable/non-free Sources.diff/Index [63.3 kB]
Get:3 http://localhost:3142/debian unstable/contrib Sources.diff/Index [63.3 kB]
Get:4 http://localhost:3142/debian unstable/main Sources.diff/Index [63.6 kB]
Get:5 http://localhost:3142/debian unstable/main amd64 Packages.diff/Index [63.6 kB]
Get:6 http://localhost:3142/debian unstable/non-free Sources T-2025-03-30-0211.29-F-2025-03-29-2020.22.pdiff [6785 B]
Get:7 http://localhost:3142/debian unstable/contrib Sources T-2025-03-30-0211.29-F-2025-03-29-2020.22.pdiff [338 B]
Get:8 http://localhost:3142/debian unstable/main Sources T-2025-03-30-0211.29-F-2025-03-29-2020.22.pdiff [78.4 kB]
Get:6 http://localhost:3142/debian unstable/non-free Sources T-2025-03-30-0211.29-F-2025-03-29-2020.22.pdiff [6785 B]
Get:8 http://localhost:3142/debian unstable/main Sources T-2025-03-30-0211.29-F-2025-03-29-2020.22.pdiff [78.4 kB]
Get:7 http://localhost:3142/debian unstable/contrib Sources T-2025-03-30-0211.29-F-2025-03-29-2020.22.pdiff [338 B]
Get:9 http://localhost:3142/debian unstable/main amd64 Packages T-2025-03-30-0211.29-F-2025-03-29-2020.22.pdiff [88.4 kB]
Get:9 http://localhost:3142/debian unstable/main amd64 Packages T-2025-03-30-0211.29-F-2025-03-29-2020.22.pdiff [88.4 kB]
Get:10 http://localhost:3142/debian unstable/main ppc64el Packages [9941 kB]
Fetched 10.6 MB in 3s (3979 kB/s)
Reading package lists...
Reading package lists...
Building dependency tree...
Reading state information...
Calculating upgrade...
The following packages will be upgraded:
  libsystemd0 libudev1
2 upgraded, 0 newly installed, 0 to remove and 0 not upgraded.
Need to get 603 kB of archives.
After this operation, 0 B of additional disk space will be used.
Get:1 http://localhost:3142/debian unstable/main amd64 libsystemd0 amd64 257.4-7 [452 kB]
Get:2 http://localhost:3142/debian unstable/main amd64 libudev1 amd64 257.4-7 [151 kB]
Fetched 603 kB in 0s (10.6 MB/s)
(Reading database ... 
(Reading database ... 5%
(Reading database ... 10%
(Reading database ... 15%
(Reading database ... 20%
(Reading database ... 25%
(Reading database ... 30%
(Reading database ... 35%
(Reading database ... 40%
(Reading database ... 45%
(Reading database ... 50%
(Reading database ... 55%
(Reading database ... 60%
(Reading database ... 65%
(Reading database ... 70%
(Reading database ... 75%
(Reading database ... 80%
(Reading database ... 85%
(Reading database ... 90%
(Reading database ... 95%
(Reading database ... 100%
(Reading database ... 12837 files and directories currently installed.)
Preparing to unpack .../libsystemd0_257.4-7_amd64.deb ...
Unpacking libsystemd0:amd64 (257.4-7) over (257.4-6) ...
Setting up libsystemd0:amd64 (257.4-7) ...
(Reading database ... 
(Reading database ... 5%
(Reading database ... 10%
(Reading database ... 15%
(Reading database ... 20%
(Reading database ... 25%
(Reading database ... 30%
(Reading database ... 35%
(Reading database ... 40%
(Reading database ... 45%
(Reading database ... 50%
(Reading database ... 55%
(Reading database ... 60%
(Reading database ... 65%
(Reading database ... 70%
(Reading database ... 75%
(Reading database ... 80%
(Reading database ... 85%
(Reading database ... 90%
(Reading database ... 95%
(Reading database ... 100%
(Reading database ... 12837 files and directories currently installed.)
Preparing to unpack .../libudev1_257.4-7_amd64.deb ...
Unpacking libudev1:amd64 (257.4-7) over (257.4-6) ...
Setting up libudev1:amd64 (257.4-7) ...
Processing triggers for libc-bin (2.41-6) ...

+------------------------------------------------------------------------------+
| Fetch source files                                                           |
+------------------------------------------------------------------------------+


Check APT
---------

Checking available source versions...

Download source files with APT
------------------------------

Reading package lists...
NOTICE: 'polari' packaging is maintained in the 'Git' version control system at:
https://salsa.debian.org/gnome-team/polari.git
Please use:
git clone https://salsa.debian.org/gnome-team/polari.git
to retrieve the latest (possibly unreleased) updates to the package.
Need to get 1075 kB of source archives.
Get:1 http://localhost:3142/debian unstable/main polari 46.0-2 (dsc) [2307 B]
Get:2 http://localhost:3142/debian unstable/main polari 46.0-2 (tar) [1067 kB]
Get:3 http://localhost:3142/debian unstable/main polari 46.0-2 (diff) [5516 B]
Fetched 1075 kB in 0s (87.7 MB/s)
Download complete and in download only mode
I: NOTICE: Log filtering will replace 'build/polari-8vKpAu/polari-46.0' with '<<PKGBUILDDIR>>'
I: NOTICE: Log filtering will replace 'build/polari-8vKpAu' with '<<BUILDDIR>>'

+------------------------------------------------------------------------------+
| Install package build dependencies                                           |
+------------------------------------------------------------------------------+


Setup apt archive
-----------------

Merged Build-Depends: debhelper-compat (= 13), dh-sequence-gir, desktop-file-utils, gtk-update-icon-cache, itstool, libgirepository1.0-dev, libgjs-dev (>= 1.73.1), libglib2.0-dev (>= 2.43.4), libtelepathy-glib-dev, libtracker-sparql-3.0-dev, libxml2-utils, meson (>= 0.53.0), libc-dev, libstdc++-dev, build-essential:amd64, fakeroot:amd64, crossbuild-essential-ppc64el:amd64, libc-dev:ppc64el, libstdc++-dev:ppc64el
Filtered Build-Depends: debhelper-compat (= 13), dh-sequence-gir, desktop-file-utils, gtk-update-icon-cache, itstool, libgirepository1.0-dev, libgjs-dev (>= 1.73.1), libglib2.0-dev (>= 2.43.4), libtelepathy-glib-dev, libtracker-sparql-3.0-dev, libxml2-utils, meson (>= 0.53.0), libc-dev, libstdc++-dev, build-essential:amd64, fakeroot:amd64, crossbuild-essential-ppc64el:amd64, libc-dev:ppc64el, libstdc++-dev:ppc64el
dpkg-deb: warning: root directory /<<RESOLVERDIR>>/sbuild-build-depends-main-dummy has unusual owner or group 1000:119
dpkg-deb: hint: you might need to pass --root-owner-group, see <https://wiki.debian.org/Teams/Dpkg/RootlessBuilds> for further details
dpkg-deb: warning: ignoring 1 warning about the control file(s)
dpkg-deb: building package 'sbuild-build-depends-main-dummy' in '/<<RESOLVERDIR>>/apt_archive/sbuild-build-depends-main-dummy.deb'.
Ign:1 copy:/<<RESOLVERDIR>>/apt_archive ./ InRelease
Get:2 copy:/<<RESOLVERDIR>>/apt_archive ./ Release [612 B]
Ign:3 copy:/<<RESOLVERDIR>>/apt_archive ./ Release.gpg
Get:4 copy:/<<RESOLVERDIR>>/apt_archive ./ Sources [1026 B]
Get:5 copy:/<<RESOLVERDIR>>/apt_archive ./ Packages [995 B]
Fetched 2633 B in 0s (0 B/s)
Reading package lists...
Reading package lists...

Install main build dependencies (apt-based resolver)
----------------------------------------------------

Installing build dependencies
Reading package lists...
Building dependency tree...
Reading state information...
Execute external solver...
The following additional packages will be installed:
  autoconf automake autopoint autotools-dev binutils-powerpc64le-linux-gnu
  bsdextrautils comerr-dev:ppc64el cpp-14-powerpc64le-linux-gnu
  cpp-powerpc64le-linux-gnu cross-exe-wrapper:ppc64el
  crossbuild-essential-ppc64el dbus dbus-bin dbus-daemon
  dbus-session-bus-common dbus-system-bus-common dbus-user-session
  dconf-gsettings-backend dconf-service debhelper desktop-file-utils
  dh-autoreconf dh-strip-nondeterminism dwz fakeroot file fontconfig-config
  fonts-dejavu-core fonts-dejavu-mono g++-14-powerpc64le-linux-gnu
  g++-powerpc64le-linux-gnu gcc-14-base:ppc64el gcc-14-cross-base
  gcc-14-powerpc64le-linux-gnu gcc-14-powerpc64le-linux-gnu-base
  gcc-powerpc64le-linux-gnu gettext gettext-base gir1.2-freedesktop:ppc64el
  gir1.2-freedesktop-dev:ppc64el gir1.2-girepository-2.0:ppc64el
  gir1.2-girepository-2.0-dev:ppc64el gir1.2-glib-2.0:ppc64el
  gir1.2-glib-2.0-dev:ppc64el gir1.2-json-1.0:ppc64el gir1.2-soup-3.0:ppc64el
  gir1.2-telepathyglib-0.12:ppc64el gir1.2-tracker-3.0:ppc64el
  gir1.2-tsparql-3.0:ppc64el girepository-tools girepository-tools:ppc64el
  glib-networking:ppc64el glib-networking-common glib-networking-services
  gobject-introspection:ppc64el gobject-introspection-bin groff-base
  gsettings-desktop-schemas gtk-update-icon-cache icu-devtools intltool-debian
  itstool krb5-multidev:ppc64el libapparmor1 libarchive-zip-perl
  libasan8:ppc64el libasan8-ppc64el-cross libatomic1:ppc64el
  libatomic1-ppc64el-cross libblkid-dev:ppc64el libblkid1:ppc64el
  libbrotli-dev:ppc64el libbrotli1 libbrotli1:ppc64el libbz2-1.0:ppc64el
  libbz2-dev:ppc64el libc6:ppc64el libc6-dev:ppc64el libc6-dev-ppc64el-cross
  libc6-ppc64el-cross libcairo-gobject2:ppc64el
  libcairo-script-interpreter2:ppc64el libcairo2:ppc64el libcairo2-dev:ppc64el
  libcap-dev:ppc64el libcap2:ppc64el libcom-err2 libcom-err2:ppc64el
  libcrypt-dev:ppc64el libcrypt1:ppc64el libcurl3t64-gnutls
  libcurl3t64-gnutls:ppc64el libdb5.3t64:ppc64el libdbus-1-3
  libdbus-1-3:ppc64el libdbus-1-dev:ppc64el libdbus-glib-1-2
  libdbus-glib-1-2:ppc64el libdbus-glib-1-dev:ppc64el libdbus-glib-1-dev-bin
  libdconf1 libdebhelper-perl libdeflate0 libduktape207 libduktape207:ppc64el
  libelf1t64 libexpat1 libexpat1:ppc64el libexpat1-dev:ppc64el libfakeroot
  libffi-dev:ppc64el libffi8 libffi8:ppc64el libfile-stripnondeterminism-perl
  libfontconfig-dev:ppc64el libfontconfig1:ppc64el libfreetype-dev:ppc64el
  libfreetype6:ppc64el libgcc-14-dev:ppc64el libgcc-14-dev-ppc64el-cross
  libgcc-s1:ppc64el libgcc-s1-ppc64el-cross libgdk-pixbuf-2.0-0
  libgdk-pixbuf2.0-common libgio-2.0-dev:ppc64el libgio-2.0-dev-bin
  libgirepository-1.0-1 libgirepository-1.0-1:ppc64el
  libgirepository-1.0-dev:ppc64el libgirepository-2.0-0
  libgirepository-2.0-0:ppc64el libgirepository1.0-dev:ppc64el
  libgjs-dev:ppc64el libgjs0g:ppc64el libglib2.0-0t64 libglib2.0-0t64:ppc64el
  libglib2.0-bin libglib2.0-data libglib2.0-dev:ppc64el libglib2.0-dev-bin
  libgmp10:ppc64el libgnutls30t64 libgnutls30t64:ppc64el libgomp1:ppc64el
  libgomp1-ppc64el-cross libgssapi-krb5-2 libgssapi-krb5-2:ppc64el
  libgssrpc4t64:ppc64el libhogweed6t64:ppc64el libice-dev:ppc64el
  libice6:ppc64el libicu-dev:ppc64el libicu76 libicu76:ppc64el libidn2-0
  libidn2-0:ppc64el libitm1:ppc64el libitm1-ppc64el-cross libjbig0
  libjpeg62-turbo libjson-glib-1.0-0:ppc64el libjson-glib-1.0-common
  libjson-glib-dev:ppc64el libk5crypto3 libk5crypto3:ppc64el
  libkadm5clnt-mit12:ppc64el libkadm5srv-mit12:ppc64el libkdb5-10t64:ppc64el
  libkeyutils1 libkeyutils1:ppc64el libkrb5-3 libkrb5-3:ppc64el
  libkrb5-dev:ppc64el libkrb5support0 libkrb5support0:ppc64el libldap2
  libldap2:ppc64el liblerc4 liblsan0:ppc64el liblsan0-ppc64el-cross
  liblzma5:ppc64el liblzo2-2:ppc64el libmagic-mgc libmagic1t64
  libmount-dev:ppc64el libmount1:ppc64el libmozjs-128-0:ppc64el
  libmozjs-128-dev:ppc64el libncursesw6 libnettle8t64:ppc64el libnghttp2-14
  libnghttp2-14:ppc64el libnghttp2-dev:ppc64el libnghttp3-9
  libnghttp3-9:ppc64el libngtcp2-16 libngtcp2-16:ppc64el
  libngtcp2-crypto-gnutls8 libngtcp2-crypto-gnutls8:ppc64el libp11-kit0
  libp11-kit0:ppc64el libpam-systemd libpcre2-16-0:ppc64el
  libpcre2-32-0:ppc64el libpcre2-8-0:ppc64el libpcre2-dev:ppc64el
  libpcre2-posix3:ppc64el libpipeline1 libpixman-1-0:ppc64el
  libpixman-1-dev:ppc64el libpkgconf3 libpng-dev:ppc64el libpng16-16t64
  libpng16-16t64:ppc64el libproc2-0 libproxy1v5 libproxy1v5:ppc64el
  libpsl-dev:ppc64el libpsl5t64 libpsl5t64:ppc64el libpython3-stdlib
  libpython3.13-minimal libpython3.13-stdlib libquadmath0:ppc64el
  libquadmath0-ppc64el-cross libreadline8t64 libreadline8t64:ppc64el librtmp1
  librtmp1:ppc64el libsasl2-2 libsasl2-2:ppc64el libsasl2-modules-db
  libsasl2-modules-db:ppc64el libselinux1:ppc64el libselinux1-dev:ppc64el
  libsepol-dev:ppc64el libsepol2:ppc64el libsharpyuv0 libsm-dev:ppc64el
  libsm6:ppc64el libsoup-3.0-0:ppc64el libsoup-3.0-common
  libsoup-3.0-dev:ppc64el libsqlite3-0 libsqlite3-0:ppc64el
  libsqlite3-dev:ppc64el libssh2-1t64 libssh2-1t64:ppc64el libssl3t64:ppc64el
  libstdc++-14-dev:ppc64el libstdc++-14-dev-ppc64el-cross libstdc++6:ppc64el
  libstdc++6-ppc64el-cross libstemmer0d:ppc64el
  libsysprof-capture-4-dev:ppc64el libsystemd-dev:ppc64el libsystemd-shared
  libsystemd0:ppc64el libtasn1-6 libtasn1-6:ppc64el
  libtelepathy-glib-dev:ppc64el libtelepathy-glib0t64:ppc64el libtiff6
  libtinfo6:ppc64el libtinysparql-3.0-0:ppc64el libtinysparql-dev:ppc64el
  libtool libtracker-sparql-3.0-dev:ppc64el libtsan2:ppc64el
  libtsan2-ppc64el-cross libubsan1:ppc64el libubsan1-ppc64el-cross
  libuchardet0 libunistring5 libunistring5:ppc64el libuuid1:ppc64el libwebp7
  libx11-6:ppc64el libx11-data libx11-dev:ppc64el libxau-dev:ppc64el
  libxau6:ppc64el libxcb-render0:ppc64el libxcb-render0-dev:ppc64el
  libxcb-shm0:ppc64el libxcb-shm0-dev:ppc64el libxcb1:ppc64el
  libxcb1-dev:ppc64el libxdmcp-dev:ppc64el libxdmcp6:ppc64el
  libxext-dev:ppc64el libxext6:ppc64el libxml2 libxml2:ppc64el
  libxml2-dev:ppc64el libxml2-utils libxrender-dev:ppc64el libxrender1:ppc64el
  libzstd1:ppc64el linux-libc-dev-ppc64el-cross m4 man-db media-types meson
  native-architecture netbase ninja-build pkgconf:ppc64el pkgconf-bin
  po-debconf procps python3 python3-autocommand python3-inflect
  python3-jaraco.context python3-jaraco.functools python3-jaraco.text
  python3-libxml2 python3-mako python3-markdown python3-markupsafe
  python3-minimal python3-more-itertools python3-packaging
  python3-pkg-resources python3-setuptools python3-typeguard
  python3-typing-extensions python3-zipp python3.13 python3.13-minimal
  qemu-user readline-common sensible-utils sgml-base shared-mime-info systemd
  systemd-sysv uuid-dev:ppc64el x11-common x11proto-dev xml-core
  xorg-sgml-doctools xtrans-dev zlib1g:ppc64el zlib1g-dev:ppc64el
Suggested packages:
  autoconf-archive gnu-standards autoconf-doc binutils-doc doc-base:ppc64el
  gcc-14-locales cpp-14-doc cpp-doc dh-make gcc-14-doc manpages-dev flex bison
  gdb-powerpc64le-linux-gnu gcc-doc gettext-doc libasprintf-dev
  libgettextpo-dev groff krb5-doc:ppc64el glibc-doc:ppc64el libc-l10n:ppc64el
  locales:ppc64el libnss-nis:ppc64el libnss-nisplus:ppc64el
  manpages-dev:ppc64el libcairo2-doc:ppc64el freetype2-doc:ppc64el
  libglib2.0-doc:ppc64el libgdk-pixbuf2.0-bin libgirepository1.0-doc:ppc64el
  low-memory-monitor low-memory-monitor:ppc64el gnutls-bin gnutls-bin:ppc64el
  krb5-doc krb5-user krb5-user:ppc64el libice-doc:ppc64el icu-doc:ppc64el
  libjson-glib-doc:ppc64el cryptsetup-bin:ppc64el libnghttp2-doc:ppc64el
  libcryptsetup12 libtss2-rc0t64 libsm-doc:ppc64el libsoup-3.0-doc:ppc64el
  sqlite3-doc:ppc64el libstdc++-14-doc:ppc64el libarchive13t64 libbpf1
  libdw1t64 libfido2-1 libgcrypt20 libip4tc2 libpwquality1 libqrencode4
  libgcrypt20:ppc64el liblz4-1:ppc64el libtelepathy-glib-doc:ppc64el
  libtracker-sparql-doc:ppc64el libtool-doc gfortran | fortran95-compiler
  gcj-jdk uuid-runtime:ppc64el libx11-doc:ppc64el libxcb-doc:ppc64el
  libxext-doc:ppc64el m4-doc apparmor less www-browser libmail-box-perl
  python3-doc python3-tk python3-venv python-mako-doc python3-beaker
  python-markdown-doc python-setuptools-doc python3.13-venv python3.13-doc
  binfmt-support readline-doc sgml-base-doc systemd-container systemd-homed
  systemd-userdbd systemd-boot systemd-resolved systemd-repart
  libtss2-tcti-device0 polkitd
Recommended packages:
  curl | wget | lynx glib-networking bzip2-doc:ppc64el ca-certificates
  ca-certificates:ppc64el libarchive-cpio-perl libgdk-pixbuf2.0-bin
  xdg-user-dirs xdg-user-dirs:ppc64el krb5-locales krb5-locales:ppc64el
  libldap-common libldap-common:ppc64el libgpm2 libpng-tools:ppc64el
  publicsuffix publicsuffix:ppc64el libsasl2-modules libsasl2-modules:ppc64el
  libkmod2 libltdl-dev libmail-sendmail-perl psmisc linux-sysctl-defaults
  python3-pygments python3-yaml qemu-user-binfmt systemd-timesyncd
  | time-daemon systemd-cryptsetup libnss-systemd
The following NEW packages will be installed:
  autoconf automake autopoint autotools-dev binutils-powerpc64le-linux-gnu
  bsdextrautils comerr-dev:ppc64el cpp-14-powerpc64le-linux-gnu
  cpp-powerpc64le-linux-gnu cross-exe-wrapper:ppc64el
  crossbuild-essential-ppc64el dbus dbus-bin dbus-daemon
  dbus-session-bus-common dbus-system-bus-common dbus-user-session
  dconf-gsettings-backend dconf-service debhelper desktop-file-utils
  dh-autoreconf dh-strip-nondeterminism dwz fakeroot file fontconfig-config
  fonts-dejavu-core fonts-dejavu-mono g++-14-powerpc64le-linux-gnu
  g++-powerpc64le-linux-gnu gcc-14-base:ppc64el gcc-14-cross-base
  gcc-14-powerpc64le-linux-gnu gcc-14-powerpc64le-linux-gnu-base
  gcc-powerpc64le-linux-gnu gettext gettext-base gir1.2-freedesktop:ppc64el
  gir1.2-freedesktop-dev:ppc64el gir1.2-girepository-2.0:ppc64el
  gir1.2-girepository-2.0-dev:ppc64el gir1.2-glib-2.0:ppc64el
  gir1.2-glib-2.0-dev:ppc64el gir1.2-json-1.0:ppc64el gir1.2-soup-3.0:ppc64el
  gir1.2-telepathyglib-0.12:ppc64el gir1.2-tracker-3.0:ppc64el
  gir1.2-tsparql-3.0:ppc64el girepository-tools girepository-tools:ppc64el
  glib-networking:ppc64el glib-networking-common glib-networking-services
  gobject-introspection:ppc64el gobject-introspection-bin groff-base
  gsettings-desktop-schemas gtk-update-icon-cache icu-devtools intltool-debian
  itstool krb5-multidev:ppc64el libapparmor1 libarchive-zip-perl
  libasan8:ppc64el libasan8-ppc64el-cross libatomic1:ppc64el
  libatomic1-ppc64el-cross libblkid-dev:ppc64el libblkid1:ppc64el
  libbrotli-dev:ppc64el libbrotli1 libbrotli1:ppc64el libbz2-1.0:ppc64el
  libbz2-dev:ppc64el libc6:ppc64el libc6-dev:ppc64el libc6-dev-ppc64el-cross
  libc6-ppc64el-cross libcairo-gobject2:ppc64el
  libcairo-script-interpreter2:ppc64el libcairo2:ppc64el libcairo2-dev:ppc64el
  libcap-dev:ppc64el libcap2:ppc64el libcom-err2 libcom-err2:ppc64el
  libcrypt-dev:ppc64el libcrypt1:ppc64el libcurl3t64-gnutls
  libcurl3t64-gnutls:ppc64el libdb5.3t64:ppc64el libdbus-1-3
  libdbus-1-3:ppc64el libdbus-1-dev:ppc64el libdbus-glib-1-2
  libdbus-glib-1-2:ppc64el libdbus-glib-1-dev:ppc64el libdbus-glib-1-dev-bin
  libdconf1 libdebhelper-perl libdeflate0 libduktape207 libduktape207:ppc64el
  libelf1t64 libexpat1 libexpat1:ppc64el libexpat1-dev:ppc64el libfakeroot
  libffi-dev:ppc64el libffi8 libffi8:ppc64el libfile-stripnondeterminism-perl
  libfontconfig-dev:ppc64el libfontconfig1:ppc64el libfreetype-dev:ppc64el
  libfreetype6:ppc64el libgcc-14-dev:ppc64el libgcc-14-dev-ppc64el-cross
  libgcc-s1:ppc64el libgcc-s1-ppc64el-cross libgdk-pixbuf-2.0-0
  libgdk-pixbuf2.0-common libgio-2.0-dev:ppc64el libgio-2.0-dev-bin
  libgirepository-1.0-1 libgirepository-1.0-1:ppc64el
  libgirepository-1.0-dev:ppc64el libgirepository-2.0-0
  libgirepository-2.0-0:ppc64el libgirepository1.0-dev:ppc64el
  libgjs-dev:ppc64el libgjs0g:ppc64el libglib2.0-0t64 libglib2.0-0t64:ppc64el
  libglib2.0-bin libglib2.0-data libglib2.0-dev:ppc64el libglib2.0-dev-bin
  libgmp10:ppc64el libgnutls30t64 libgnutls30t64:ppc64el libgomp1:ppc64el
  libgomp1-ppc64el-cross libgssapi-krb5-2 libgssapi-krb5-2:ppc64el
  libgssrpc4t64:ppc64el libhogweed6t64:ppc64el libice-dev:ppc64el
  libice6:ppc64el libicu-dev:ppc64el libicu76 libicu76:ppc64el libidn2-0
  libidn2-0:ppc64el libitm1:ppc64el libitm1-ppc64el-cross libjbig0
  libjpeg62-turbo libjson-glib-1.0-0:ppc64el libjson-glib-1.0-common
  libjson-glib-dev:ppc64el libk5crypto3 libk5crypto3:ppc64el
  libkadm5clnt-mit12:ppc64el libkadm5srv-mit12:ppc64el libkdb5-10t64:ppc64el
  libkeyutils1 libkeyutils1:ppc64el libkrb5-3 libkrb5-3:ppc64el
  libkrb5-dev:ppc64el libkrb5support0 libkrb5support0:ppc64el libldap2
  libldap2:ppc64el liblerc4 liblsan0:ppc64el liblsan0-ppc64el-cross
  liblzma5:ppc64el liblzo2-2:ppc64el libmagic-mgc libmagic1t64
  libmount-dev:ppc64el libmount1:ppc64el libmozjs-128-0:ppc64el
  libmozjs-128-dev:ppc64el libncursesw6 libnettle8t64:ppc64el libnghttp2-14
  libnghttp2-14:ppc64el libnghttp2-dev:ppc64el libnghttp3-9
  libnghttp3-9:ppc64el libngtcp2-16 libngtcp2-16:ppc64el
  libngtcp2-crypto-gnutls8 libngtcp2-crypto-gnutls8:ppc64el libp11-kit0
  libp11-kit0:ppc64el libpam-systemd libpcre2-16-0:ppc64el
  libpcre2-32-0:ppc64el libpcre2-8-0:ppc64el libpcre2-dev:ppc64el
  libpcre2-posix3:ppc64el libpipeline1 libpixman-1-0:ppc64el
  libpixman-1-dev:ppc64el libpkgconf3 libpng-dev:ppc64el libpng16-16t64
  libpng16-16t64:ppc64el libproc2-0 libproxy1v5 libproxy1v5:ppc64el
  libpsl-dev:ppc64el libpsl5t64 libpsl5t64:ppc64el libpython3-stdlib
  libpython3.13-minimal libpython3.13-stdlib libquadmath0:ppc64el
  libquadmath0-ppc64el-cross libreadline8t64 libreadline8t64:ppc64el librtmp1
  librtmp1:ppc64el libsasl2-2 libsasl2-2:ppc64el libsasl2-modules-db
  libsasl2-modules-db:ppc64el libselinux1:ppc64el libselinux1-dev:ppc64el
  libsepol-dev:ppc64el libsepol2:ppc64el libsharpyuv0 libsm-dev:ppc64el
  libsm6:ppc64el libsoup-3.0-0:ppc64el libsoup-3.0-common
  libsoup-3.0-dev:ppc64el libsqlite3-0 libsqlite3-0:ppc64el
  libsqlite3-dev:ppc64el libssh2-1t64 libssh2-1t64:ppc64el libssl3t64:ppc64el
  libstdc++-14-dev:ppc64el libstdc++-14-dev-ppc64el-cross libstdc++6:ppc64el
  libstdc++6-ppc64el-cross libstemmer0d:ppc64el
  libsysprof-capture-4-dev:ppc64el libsystemd-dev:ppc64el libsystemd-shared
  libsystemd0:ppc64el libtasn1-6 libtasn1-6:ppc64el
  libtelepathy-glib-dev:ppc64el libtelepathy-glib0t64:ppc64el libtiff6
  libtinfo6:ppc64el libtinysparql-3.0-0:ppc64el libtinysparql-dev:ppc64el
  libtool libtracker-sparql-3.0-dev:ppc64el libtsan2:ppc64el
  libtsan2-ppc64el-cross libubsan1:ppc64el libubsan1-ppc64el-cross
  libuchardet0 libunistring5 libunistring5:ppc64el libuuid1:ppc64el libwebp7
  libx11-6:ppc64el libx11-data libx11-dev:ppc64el libxau-dev:ppc64el
  libxau6:ppc64el libxcb-render0:ppc64el libxcb-render0-dev:ppc64el
  libxcb-shm0:ppc64el libxcb-shm0-dev:ppc64el libxcb1:ppc64el
  libxcb1-dev:ppc64el libxdmcp-dev:ppc64el libxdmcp6:ppc64el
  libxext-dev:ppc64el libxext6:ppc64el libxml2 libxml2:ppc64el
  libxml2-dev:ppc64el libxml2-utils libxrender-dev:ppc64el libxrender1:ppc64el
  libzstd1:ppc64el linux-libc-dev-ppc64el-cross m4 man-db media-types meson
  native-architecture netbase ninja-build pkgconf:ppc64el pkgconf-bin
  po-debconf procps python3 python3-autocommand python3-inflect
  python3-jaraco.context python3-jaraco.functools python3-jaraco.text
  python3-libxml2 python3-mako python3-markdown python3-markupsafe
  python3-minimal python3-more-itertools python3-packaging
  python3-pkg-resources python3-setuptools python3-typeguard
  python3-typing-extensions python3-zipp python3.13 python3.13-minimal
  qemu-user readline-common sbuild-build-depends-main-dummy:ppc64el
  sensible-utils sgml-base shared-mime-info systemd systemd-sysv
  uuid-dev:ppc64el x11-common x11proto-dev xml-core xorg-sgml-doctools
  xtrans-dev zlib1g:ppc64el zlib1g-dev:ppc64el
0 upgraded, 347 newly installed, 0 to remove and 0 not upgraded.
Need to get 284 MB of archives.
After this operation, 1361 MB of additional disk space will be used.
Get:1 copy:/<<RESOLVERDIR>>/apt_archive ./ sbuild-build-depends-main-dummy 0.invalid.0 [1044 B]
Get:2 http://localhost:3142/debian unstable/main amd64 libsystemd-shared amd64 257.4-7 [2142 kB]
Get:3 http://localhost:3142/debian unstable/main amd64 libapparmor1 amd64 4.1.0~beta5-5 [43.5 kB]
Get:4 http://localhost:3142/debian unstable/main amd64 systemd amd64 257.4-7 [3091 kB]
Get:5 http://localhost:3142/debian unstable/main amd64 systemd-sysv amd64 257.4-7 [63.1 kB]
Get:6 http://localhost:3142/debian unstable/main amd64 libdbus-1-3 amd64 1.16.2-2 [178 kB]
Get:7 http://localhost:3142/debian unstable/main amd64 dbus-bin amd64 1.16.2-2 [80.0 kB]
Get:8 http://localhost:3142/debian unstable/main amd64 dbus-session-bus-common all 1.16.2-2 [52.3 kB]
Get:9 http://localhost:3142/debian unstable/main amd64 libexpat1 amd64 2.7.1-1 [108 kB]
Get:10 http://localhost:3142/debian unstable/main amd64 dbus-daemon amd64 1.16.2-2 [159 kB]
Get:11 http://localhost:3142/debian unstable/main amd64 dbus-system-bus-common all 1.16.2-2 [53.5 kB]
Get:12 http://localhost:3142/debian unstable/main amd64 dbus amd64 1.16.2-2 [71.6 kB]
Get:13 http://localhost:3142/debian unstable/main amd64 libpython3.13-minimal amd64 3.13.2-3 [861 kB]
Get:14 http://localhost:3142/debian unstable/main amd64 python3.13-minimal amd64 3.13.2-3 [2212 kB]
Get:15 http://localhost:3142/debian unstable/main amd64 python3-minimal amd64 3.13.2-2 [27.1 kB]
Get:16 http://localhost:3142/debian unstable/main amd64 media-types all 13.0.0 [29.3 kB]
Get:17 http://localhost:3142/debian unstable/main amd64 netbase all 6.5 [12.4 kB]
Get:18 http://localhost:3142/debian unstable/main amd64 libffi8 amd64 3.4.7-1 [23.9 kB]
Get:19 http://localhost:3142/debian unstable/main amd64 libncursesw6 amd64 6.5+20250216-2 [135 kB]
Get:20 http://localhost:3142/debian unstable/main amd64 readline-common all 8.2-6 [69.4 kB]
Get:21 http://localhost:3142/debian unstable/main amd64 libreadline8t64 amd64 8.2-6 [169 kB]
Get:22 http://localhost:3142/debian unstable/main amd64 libsqlite3-0 amd64 3.46.1-2 [913 kB]
Get:23 http://localhost:3142/debian unstable/main amd64 libpython3.13-stdlib amd64 3.13.2-3 [1952 kB]
Get:24 http://localhost:3142/debian unstable/main amd64 python3.13 amd64 3.13.2-3 [746 kB]
Get:25 http://localhost:3142/debian unstable/main amd64 libpython3-stdlib amd64 3.13.2-2 [10.1 kB]
Get:26 http://localhost:3142/debian unstable/main amd64 python3 amd64 3.13.2-2 [28.1 kB]
Get:27 http://localhost:3142/debian unstable/main amd64 sgml-base all 1.31 [15.4 kB]
Get:28 http://localhost:3142/debian unstable/main amd64 libproc2-0 amd64 2:4.0.4-7 [64.9 kB]
Get:29 http://localhost:3142/debian unstable/main amd64 procps amd64 2:4.0.4-7 [878 kB]
Get:30 http://localhost:3142/debian unstable/main amd64 sensible-utils all 0.0.24 [24.8 kB]
Get:31 http://localhost:3142/debian unstable/main amd64 libmagic-mgc amd64 1:5.46-4 [337 kB]
Get:32 http://localhost:3142/debian unstable/main amd64 libmagic1t64 amd64 1:5.46-4 [109 kB]
Get:33 http://localhost:3142/debian unstable/main amd64 file amd64 1:5.46-4 [43.5 kB]
Get:34 http://localhost:3142/debian unstable/main amd64 gettext-base amd64 0.23.1-1 [243 kB]
Get:35 http://localhost:3142/debian unstable/main amd64 libuchardet0 amd64 0.0.8-1+b2 [68.9 kB]
Get:36 http://localhost:3142/debian unstable/main amd64 groff-base amd64 1.23.0-7 [1185 kB]
Get:37 http://localhost:3142/debian unstable/main amd64 libpam-systemd amd64 257.4-7 [295 kB]
Get:38 http://localhost:3142/debian unstable/main amd64 bsdextrautils amd64 2.40.4-5 [92.4 kB]
Get:39 http://localhost:3142/debian unstable/main amd64 libpipeline1 amd64 1.5.8-1 [42.0 kB]
Get:40 http://localhost:3142/debian unstable/main amd64 man-db amd64 2.13.0-1 [1420 kB]
Get:41 http://localhost:3142/debian unstable/main amd64 m4 amd64 1.4.19-7 [294 kB]
Get:42 http://localhost:3142/debian unstable/main amd64 autoconf all 2.72-3 [493 kB]
Get:43 http://localhost:3142/debian unstable/main amd64 autotools-dev all 20240727.1 [60.2 kB]
Get:44 http://localhost:3142/debian unstable/main amd64 automake all 1:1.17-4 [862 kB]
Get:45 http://localhost:3142/debian unstable/main amd64 autopoint all 0.23.1-1 [770 kB]
Get:46 http://localhost:3142/debian unstable/main amd64 binutils-powerpc64le-linux-gnu amd64 2.44-3 [1514 kB]
Get:47 http://localhost:3142/debian unstable/main ppc64el gcc-14-base ppc64el 14.2.0-19 [49.5 kB]
Get:48 http://localhost:3142/debian unstable/main ppc64el libgcc-s1 ppc64el 14.2.0-19 [35.5 kB]
Get:49 http://localhost:3142/debian unstable/main ppc64el libc6 ppc64el 2.41-6 [2761 kB]
Get:50 http://localhost:3142/debian unstable/main ppc64el libcrypt1 ppc64el 1:4.4.38-1 [98.0 kB]
Get:51 http://localhost:3142/debian unstable/main ppc64el libcrypt-dev ppc64el 1:4.4.38-1 [132 kB]
Get:52 http://localhost:3142/debian unstable/main ppc64el libc6-dev ppc64el 2.41-6 [1901 kB]
Get:53 http://localhost:3142/debian unstable/main ppc64el libcom-err2 ppc64el 1.47.2-1+b1 [24.7 kB]
Get:54 http://localhost:3142/debian unstable/main ppc64el comerr-dev ppc64el 2.1-1.47.2-1+b1 [56.6 kB]
Get:55 http://localhost:3142/debian unstable/main amd64 gcc-14-powerpc64le-linux-gnu-base amd64 14.2.0-19cross1 [49.7 kB]
Get:56 http://localhost:3142/debian unstable/main amd64 cpp-14-powerpc64le-linux-gnu amd64 14.2.0-19cross1 [10.2 MB]
Get:57 http://localhost:3142/debian unstable/main amd64 cpp-powerpc64le-linux-gnu amd64 4:14.2.0-1 [4860 B]
Get:58 http://localhost:3142/debian unstable/main amd64 qemu-user amd64 1:10.0.0~rc1+ds-2 [71.0 MB]
Get:59 http://localhost:3142/debian unstable/main ppc64el cross-exe-wrapper ppc64el 0.2.6 [6896 B]
Get:60 http://localhost:3142/debian unstable/main amd64 gcc-14-cross-base all 14.2.0-19cross1 [44.9 kB]
Get:61 http://localhost:3142/debian unstable/main amd64 libc6-ppc64el-cross all 2.41-6cross2 [1428 kB]
Get:62 http://localhost:3142/debian unstable/main amd64 libgcc-s1-ppc64el-cross all 14.2.0-19cross1 [35.5 kB]
Get:63 http://localhost:3142/debian unstable/main amd64 libgomp1-ppc64el-cross all 14.2.0-19cross1 [135 kB]
Get:64 http://localhost:3142/debian unstable/main amd64 libitm1-ppc64el-cross all 14.2.0-19cross1 [28.0 kB]
Get:65 http://localhost:3142/debian unstable/main amd64 libatomic1-ppc64el-cross all 14.2.0-19cross1 [9644 B]
Get:66 http://localhost:3142/debian unstable/main amd64 libasan8-ppc64el-cross all 14.2.0-19cross1 [2643 kB]
Get:67 http://localhost:3142/debian unstable/main amd64 liblsan0-ppc64el-cross all 14.2.0-19cross1 [1201 kB]
Get:68 http://localhost:3142/debian unstable/main amd64 libtsan2-ppc64el-cross all 14.2.0-19cross1 [2409 kB]
Get:69 http://localhost:3142/debian unstable/main amd64 libstdc++6-ppc64el-cross all 14.2.0-19cross1 [747 kB]
Get:70 http://localhost:3142/debian unstable/main amd64 libubsan1-ppc64el-cross all 14.2.0-19cross1 [1078 kB]
Get:71 http://localhost:3142/debian unstable/main amd64 libquadmath0-ppc64el-cross all 14.2.0-19cross1 [151 kB]
Get:72 http://localhost:3142/debian unstable/main amd64 libgcc-14-dev-ppc64el-cross all 14.2.0-19cross1 [1408 kB]
Get:73 http://localhost:3142/debian unstable/main amd64 gcc-14-powerpc64le-linux-gnu amd64 14.2.0-19cross1 [19.6 MB]
Get:74 http://localhost:3142/debian unstable/main amd64 gcc-powerpc64le-linux-gnu amd64 4:14.2.0-1 [1460 B]
Get:75 http://localhost:3142/debian unstable/main amd64 linux-libc-dev-ppc64el-cross all 6.12.17-1cross2 [2356 kB]
Get:76 http://localhost:3142/debian unstable/main amd64 libc6-dev-ppc64el-cross all 2.41-6cross2 [1896 kB]
Get:77 http://localhost:3142/debian unstable/main amd64 libstdc++-14-dev-ppc64el-cross all 14.2.0-19cross1 [2485 kB]
Get:78 http://localhost:3142/debian unstable/main amd64 g++-14-powerpc64le-linux-gnu amd64 14.2.0-19cross1 [11.2 MB]
Get:79 http://localhost:3142/debian unstable/main amd64 g++-powerpc64le-linux-gnu amd64 4:14.2.0-1 [1212 B]
Get:80 http://localhost:3142/debian unstable/main amd64 crossbuild-essential-ppc64el all 12.12 [3560 B]
Get:81 http://localhost:3142/debian unstable/main amd64 dbus-user-session amd64 1.16.2-2 [52.1 kB]
Get:82 http://localhost:3142/debian unstable/main amd64 libglib2.0-0t64 amd64 2.84.0-2 [1513 kB]
Get:83 http://localhost:3142/debian unstable/main amd64 libdconf1 amd64 0.40.0-5 [41.8 kB]
Get:84 http://localhost:3142/debian unstable/main amd64 dconf-service amd64 0.40.0-5 [32.4 kB]
Get:85 http://localhost:3142/debian unstable/main amd64 dconf-gsettings-backend amd64 0.40.0-5 [28.6 kB]
Get:86 http://localhost:3142/debian unstable/main amd64 libdebhelper-perl all 13.24.2 [90.9 kB]
Get:87 http://localhost:3142/debian unstable/main amd64 libtool all 2.5.4-4 [539 kB]
Get:88 http://localhost:3142/debian unstable/main amd64 dh-autoreconf all 20 [17.1 kB]
Get:89 http://localhost:3142/debian unstable/main amd64 libarchive-zip-perl all 1.68-1 [104 kB]
Get:90 http://localhost:3142/debian unstable/main amd64 libfile-stripnondeterminism-perl all 1.14.1-2 [19.7 kB]
Get:91 http://localhost:3142/debian unstable/main amd64 dh-strip-nondeterminism all 1.14.1-2 [8620 B]
Get:92 http://localhost:3142/debian unstable/main amd64 libelf1t64 amd64 0.192-4 [189 kB]
Get:93 http://localhost:3142/debian unstable/main amd64 dwz amd64 0.15-1+b1 [110 kB]
Get:94 http://localhost:3142/debian unstable/main amd64 libunistring5 amd64 1.3-2 [477 kB]
Get:95 http://localhost:3142/debian unstable/main amd64 libxml2 amd64 2.12.7+dfsg+really2.9.14-0.4 [698 kB]
Get:96 http://localhost:3142/debian unstable/main amd64 gettext amd64 0.23.1-1 [1680 kB]
Get:97 http://localhost:3142/debian unstable/main amd64 intltool-debian all 0.35.0+20060710.6 [22.9 kB]
Get:98 http://localhost:3142/debian unstable/main amd64 po-debconf all 1.0.21+nmu1 [248 kB]
Get:99 http://localhost:3142/debian unstable/main amd64 debhelper all 13.24.2 [919 kB]
Get:100 http://localhost:3142/debian unstable/main amd64 desktop-file-utils amd64 0.28-1 [91.7 kB]
Get:101 http://localhost:3142/debian unstable/main amd64 libfakeroot amd64 1.37.1.1-1 [29.6 kB]
Get:102 http://localhost:3142/debian unstable/main amd64 fakeroot amd64 1.37.1.1-1 [76.0 kB]
Get:103 http://localhost:3142/debian unstable/main amd64 fonts-dejavu-mono all 2.37-8 [489 kB]
Get:104 http://localhost:3142/debian unstable/main amd64 fonts-dejavu-core all 2.37-8 [840 kB]
Get:105 http://localhost:3142/debian unstable/main amd64 fontconfig-config amd64 2.15.0-2.2 [318 kB]
Get:106 http://localhost:3142/debian unstable/main ppc64el libatomic1 ppc64el 14.2.0-19 [9952 B]
Get:107 http://localhost:3142/debian unstable/main ppc64el libffi8 ppc64el 3.4.7-1 [23.7 kB]
Get:108 http://localhost:3142/debian unstable/main ppc64el libblkid1 ppc64el 2.40.4-5 [188 kB]
Get:109 http://localhost:3142/debian unstable/main ppc64el libpcre2-8-0 ppc64el 10.45-1 [286 kB]
Get:110 http://localhost:3142/debian unstable/main ppc64el libselinux1 ppc64el 3.8.1-1 [93.8 kB]
Get:111 http://localhost:3142/debian unstable/main ppc64el libmount1 ppc64el 2.40.4-5 [223 kB]
Get:112 http://localhost:3142/debian unstable/main ppc64el zlib1g ppc64el 1:1.3.dfsg+really1.3.1-1+b1 [87.4 kB]
Get:113 http://localhost:3142/debian unstable/main ppc64el libglib2.0-0t64 ppc64el 2.84.0-2 [1569 kB]
Get:114 http://localhost:3142/debian unstable/main ppc64el gir1.2-glib-2.0 ppc64el 2.84.0-2 [197 kB]
Get:115 http://localhost:3142/debian unstable/main ppc64el libexpat1 ppc64el 2.7.1-1 [101 kB]
Get:116 http://localhost:3142/debian unstable/main ppc64el libbrotli1 ppc64el 1.1.0-2+b7 [335 kB]
Get:117 http://localhost:3142/debian unstable/main ppc64el libbz2-1.0 ppc64el 1.0.8-6 [42.2 kB]
Get:118 http://localhost:3142/debian unstable/main ppc64el libpng16-16t64 ppc64el 1.6.47-1.1 [293 kB]
Get:119 http://localhost:3142/debian unstable/main ppc64el libfreetype6 ppc64el 2.13.3+dfsg-1 [490 kB]
Get:120 http://localhost:3142/debian unstable/main ppc64el libfontconfig1 ppc64el 2.15.0-2.2 [409 kB]
Get:121 http://localhost:3142/debian unstable/main ppc64el libpixman-1-0 ppc64el 0.44.0-3 [185 kB]
Get:122 http://localhost:3142/debian unstable/main ppc64el libxau6 ppc64el 1:1.0.11-1 [21.1 kB]
Get:123 http://localhost:3142/debian unstable/main ppc64el libxdmcp6 ppc64el 1:1.1.5-1 [28.7 kB]
Get:124 http://localhost:3142/debian unstable/main ppc64el libxcb1 ppc64el 1.17.0-2+b1 [148 kB]
Get:125 http://localhost:3142/debian unstable/main amd64 libx11-data all 2:1.8.12-1 [343 kB]
Get:126 http://localhost:3142/debian unstable/main ppc64el libx11-6 ppc64el 2:1.8.12-1 [854 kB]
Get:127 http://localhost:3142/debian unstable/main ppc64el libxcb-render0 ppc64el 1.17.0-2+b1 [116 kB]
Get:128 http://localhost:3142/debian unstable/main ppc64el libxcb-shm0 ppc64el 1.17.0-2+b1 [106 kB]
Get:129 http://localhost:3142/debian unstable/main ppc64el libxext6 ppc64el 2:1.3.4-1+b3 [51.9 kB]
Get:130 http://localhost:3142/debian unstable/main ppc64el libxrender1 ppc64el 1:0.9.12-1 [29.4 kB]
Get:131 http://localhost:3142/debian unstable/main ppc64el libcairo2 ppc64el 1.18.4-1+b1 [580 kB]
Get:132 http://localhost:3142/debian unstable/main ppc64el libcairo-gobject2 ppc64el 1.18.4-1+b1 [131 kB]
Get:133 http://localhost:3142/debian unstable/main ppc64el gir1.2-freedesktop ppc64el 1.84.0-1 [60.5 kB]
Get:134 http://localhost:3142/debian unstable/main ppc64el gir1.2-glib-2.0-dev ppc64el 2.84.0-2 [913 kB]
Get:135 http://localhost:3142/debian unstable/main ppc64el gir1.2-freedesktop-dev ppc64el 1.84.0-1 [51.6 kB]
Get:136 http://localhost:3142/debian unstable/main ppc64el libgirepository-1.0-1 ppc64el 1.84.0-1 [121 kB]
Get:137 http://localhost:3142/debian unstable/main ppc64el gir1.2-girepository-2.0 ppc64el 1.84.0-1 [39.7 kB]
Get:138 http://localhost:3142/debian unstable/main ppc64el gir1.2-girepository-2.0-dev ppc64el 1.84.0-1 [57.5 kB]
Get:139 http://localhost:3142/debian unstable/main amd64 libjson-glib-1.0-common all 1.10.6+ds-2 [62.3 kB]
Get:140 http://localhost:3142/debian unstable/main ppc64el libjson-glib-1.0-0 ppc64el 1.10.6+ds-2 [64.9 kB]
Get:141 http://localhost:3142/debian unstable/main ppc64el gir1.2-json-1.0 ppc64el 1.10.6+ds-2 [12.1 kB]
Get:142 http://localhost:3142/debian unstable/main ppc64el libgmp10 ppc64el 2:6.3.0+dfsg-3 [572 kB]
Get:143 http://localhost:3142/debian unstable/main ppc64el libnettle8t64 ppc64el 3.10.1-1 [329 kB]
Get:144 http://localhost:3142/debian unstable/main ppc64el libhogweed6t64 ppc64el 3.10.1-1 [339 kB]
Get:145 http://localhost:3142/debian unstable/main ppc64el libunistring5 ppc64el 1.3-2 [480 kB]
Get:146 http://localhost:3142/debian unstable/main ppc64el libidn2-0 ppc64el 2.3.8-2 [112 kB]
Get:147 http://localhost:3142/debian unstable/main ppc64el libp11-kit0 ppc64el 0.25.5-3 [423 kB]
Get:148 http://localhost:3142/debian unstable/main ppc64el libtasn1-6 ppc64el 4.20.0-2 [53.4 kB]
Get:149 http://localhost:3142/debian unstable/main ppc64el libgnutls30t64 ppc64el 3.8.9-2 [1425 kB]
Get:150 http://localhost:3142/debian unstable/main ppc64el libkrb5support0 ppc64el 1.21.3-5 [35.6 kB]
Get:151 http://localhost:3142/debian unstable/main ppc64el libk5crypto3 ppc64el 1.21.3-5 [90.8 kB]
Get:152 http://localhost:3142/debian unstable/main ppc64el libkeyutils1 ppc64el 1.6.3-4 [10.3 kB]
Get:153 http://localhost:3142/debian unstable/main ppc64el libzstd1 ppc64el 1.5.7+dfsg-1 [318 kB]
Get:154 http://localhost:3142/debian unstable/main ppc64el libssl3t64 ppc64el 3.4.1-1 [2362 kB]
Get:155 http://localhost:3142/debian unstable/main ppc64el libkrb5-3 ppc64el 1.21.3-5 [356 kB]
Get:156 http://localhost:3142/debian unstable/main ppc64el libgssapi-krb5-2 ppc64el 1.21.3-5 [152 kB]
Get:157 http://localhost:3142/debian unstable/main ppc64el libdb5.3t64 ppc64el 5.3.28+dfsg2-9 [733 kB]
Get:158 http://localhost:3142/debian unstable/main ppc64el libsasl2-modules-db ppc64el 2.1.28+dfsg1-9 [22.0 kB]
Get:159 http://localhost:3142/debian unstable/main ppc64el libsasl2-2 ppc64el 2.1.28+dfsg1-9 [65.9 kB]
Get:160 http://localhost:3142/debian unstable/main ppc64el libldap2 ppc64el 2.6.9+dfsg-2 [208 kB]
Get:161 http://localhost:3142/debian unstable/main ppc64el libnghttp2-14 ppc64el 1.64.0-1 [82.6 kB]
Get:162 http://localhost:3142/debian unstable/main ppc64el libnghttp3-9 ppc64el 1.8.0-1 [73.0 kB]
Get:163 http://localhost:3142/debian unstable/main ppc64el libngtcp2-16 ppc64el 1.11.0-1 [140 kB]
Get:164 http://localhost:3142/debian unstable/main ppc64el libngtcp2-crypto-gnutls8 ppc64el 1.11.0-1 [29.8 kB]
Get:165 http://localhost:3142/debian unstable/main ppc64el libpsl5t64 ppc64el 0.21.2-1.1+b1 [58.8 kB]
Get:166 http://localhost:3142/debian unstable/main ppc64el librtmp1 ppc64el 2.4+20151223.gitfa8646d.1-2+b5 [63.0 kB]
Get:167 http://localhost:3142/debian unstable/main ppc64el libssh2-1t64 ppc64el 1.11.1-1 [256 kB]
Get:168 http://localhost:3142/debian unstable/main ppc64el libcurl3t64-gnutls ppc64el 8.13.0~rc3-1 [397 kB]
Get:169 http://localhost:3142/debian unstable/main ppc64el libduktape207 ppc64el 2.7.0-2+b2 [136 kB]
Get:170 http://localhost:3142/debian unstable/main ppc64el libproxy1v5 ppc64el 0.5.9-1 [28.0 kB]
Get:171 http://localhost:3142/debian unstable/main amd64 libbrotli1 amd64 1.1.0-2+b7 [307 kB]
Get:172 http://localhost:3142/debian unstable/main amd64 libidn2-0 amd64 2.3.8-2 [109 kB]
Get:173 http://localhost:3142/debian unstable/main amd64 libp11-kit0 amd64 0.25.5-3 [425 kB]
Get:174 http://localhost:3142/debian unstable/main amd64 libtasn1-6 amd64 4.20.0-2 [49.9 kB]
Get:175 http://localhost:3142/debian unstable/main amd64 libgnutls30t64 amd64 3.8.9-2 [1464 kB]
Get:176 http://localhost:3142/debian unstable/main amd64 libkrb5support0 amd64 1.21.3-5 [33.0 kB]
Get:177 http://localhost:3142/debian unstable/main amd64 libcom-err2 amd64 1.47.2-1+b1 [24.3 kB]
Get:178 http://localhost:3142/debian unstable/main amd64 libk5crypto3 amd64 1.21.3-5 [81.5 kB]
Get:179 http://localhost:3142/debian unstable/main amd64 libkeyutils1 amd64 1.6.3-4 [9092 B]
Get:180 http://localhost:3142/debian unstable/main amd64 libkrb5-3 amd64 1.21.3-5 [326 kB]
Get:181 http://localhost:3142/debian unstable/main amd64 libgssapi-krb5-2 amd64 1.21.3-5 [138 kB]
Get:182 http://localhost:3142/debian unstable/main amd64 libsasl2-modules-db amd64 2.1.28+dfsg1-9 [19.8 kB]
Get:183 http://localhost:3142/debian unstable/main amd64 libsasl2-2 amd64 2.1.28+dfsg1-9 [57.5 kB]
Get:184 http://localhost:3142/debian unstable/main amd64 libldap2 amd64 2.6.9+dfsg-2 [194 kB]
Get:185 http://localhost:3142/debian unstable/main amd64 libnghttp2-14 amd64 1.64.0-1 [75.5 kB]
Get:186 http://localhost:3142/debian unstable/main amd64 libnghttp3-9 amd64 1.8.0-1 [67.7 kB]
Get:187 http://localhost:3142/debian unstable/main amd64 libngtcp2-16 amd64 1.11.0-1 [131 kB]
Get:188 http://localhost:3142/debian unstable/main amd64 libngtcp2-crypto-gnutls8 amd64 1.11.0-1 [29.3 kB]
Get:189 http://localhost:3142/debian unstable/main amd64 libpsl5t64 amd64 0.21.2-1.1+b1 [57.2 kB]
Get:190 http://localhost:3142/debian unstable/main amd64 librtmp1 amd64 2.4+20151223.gitfa8646d.1-2+b5 [58.8 kB]
Get:191 http://localhost:3142/debian unstable/main amd64 libssh2-1t64 amd64 1.11.1-1 [245 kB]
Get:192 http://localhost:3142/debian unstable/main amd64 libcurl3t64-gnutls amd64 8.13.0~rc3-1 [374 kB]
Get:193 http://localhost:3142/debian unstable/main amd64 libduktape207 amd64 2.7.0-2+b2 [135 kB]
Get:194 http://localhost:3142/debian unstable/main amd64 libproxy1v5 amd64 0.5.9-1 [26.4 kB]
Get:195 http://localhost:3142/debian unstable/main amd64 glib-networking-common all 2.80.1-1 [86.0 kB]
Get:196 http://localhost:3142/debian unstable/main amd64 glib-networking-services amd64 2.80.1-1 [12.3 kB]
Get:197 http://localhost:3142/debian unstable/main amd64 gsettings-desktop-schemas all 48.0-1 [700 kB]
Get:198 http://localhost:3142/debian unstable/main ppc64el glib-networking ppc64el 2.80.1-1 [71.6 kB]
Get:199 http://localhost:3142/debian unstable/main amd64 libsoup-3.0-common all 3.6.5-1 [63.9 kB]
Get:200 http://localhost:3142/debian unstable/main ppc64el libsqlite3-0 ppc64el 3.46.1-2 [957 kB]
Get:201 http://localhost:3142/debian unstable/main ppc64el libsoup-3.0-0 ppc64el 3.6.5-1 [290 kB]
Get:202 http://localhost:3142/debian unstable/main ppc64el gir1.2-soup-3.0 ppc64el 3.6.5-1 [28.1 kB]
Get:203 http://localhost:3142/debian unstable/main ppc64el libcap2 ppc64el 1:2.75-4 [30.6 kB]
Get:204 http://localhost:3142/debian unstable/main ppc64el libsystemd0 ppc64el 257.4-7 [482 kB]
Get:205 http://localhost:3142/debian unstable/main ppc64el libdbus-1-3 ppc64el 1.16.2-2 [192 kB]
Get:206 http://localhost:3142/debian unstable/main ppc64el libdbus-glib-1-2 ppc64el 0.114-1 [67.2 kB]
Get:207 http://localhost:3142/debian unstable/main ppc64el libtelepathy-glib0t64 ppc64el 0.24.2-2 [756 kB]
Get:208 http://localhost:3142/debian unstable/main ppc64el gir1.2-telepathyglib-0.12 ppc64el 0.24.2-2 [49.9 kB]
Get:209 http://localhost:3142/debian unstable/main ppc64el libstdc++6 ppc64el 14.2.0-19 [797 kB]
Get:210 http://localhost:3142/debian unstable/main ppc64el libicu76 ppc64el 76.1-3 [9822 kB]
Get:211 http://localhost:3142/debian unstable/main ppc64el libstemmer0d ppc64el 2.2.0-4+b2 [115 kB]
Get:212 http://localhost:3142/debian unstable/main ppc64el liblzma5 ppc64el 5.6.4-1 [288 kB]
Get:213 http://localhost:3142/debian unstable/main ppc64el libxml2 ppc64el 2.12.7+dfsg+really2.9.14-0.4 [729 kB]
Get:214 http://localhost:3142/debian unstable/main ppc64el libtinysparql-3.0-0 ppc64el 3.8.2-7 [302 kB]
Get:215 http://localhost:3142/debian unstable/main ppc64el gir1.2-tracker-3.0 ppc64el 3.8.2-7 [14.4 kB]
Get:216 http://localhost:3142/debian unstable/main ppc64el gir1.2-tsparql-3.0 ppc64el 3.8.2-7 [14.4 kB]
Get:217 http://localhost:3142/debian unstable/main ppc64el libgirepository-2.0-0 ppc64el 2.84.0-2 [144 kB]
Get:218 http://localhost:3142/debian unstable/main ppc64el girepository-tools ppc64el 2.84.0-2 [159 kB]
Get:219 http://localhost:3142/debian unstable/main amd64 native-architecture all 0.2.6 [2264 B]
Get:220 http://localhost:3142/debian unstable/main amd64 libgirepository-2.0-0 amd64 2.84.0-2 [141 kB]
Get:221 http://localhost:3142/debian unstable/main amd64 girepository-tools amd64 2.84.0-2 [148 kB]
Get:222 http://localhost:3142/debian unstable/main amd64 libgirepository-1.0-1 amd64 1.84.0-1 [116 kB]
Get:223 http://localhost:3142/debian unstable/main amd64 python3-markupsafe amd64 2.1.5-1+b3 [14.0 kB]
Get:224 http://localhost:3142/debian unstable/main amd64 python3-mako all 1.3.8-2 [83.5 kB]
Get:225 http://localhost:3142/debian unstable/main amd64 python3-markdown all 3.7-2 [85.2 kB]
Get:226 http://localhost:3142/debian unstable/main amd64 python3-autocommand all 2.2.2-3 [13.6 kB]
Get:227 http://localhost:3142/debian unstable/main amd64 python3-more-itertools all 10.6.0-1 [65.3 kB]
Get:228 http://localhost:3142/debian unstable/main amd64 python3-typing-extensions all 4.12.2-2 [73.0 kB]
Get:229 http://localhost:3142/debian unstable/main amd64 python3-typeguard all 4.4.2-1 [37.3 kB]
Get:230 http://localhost:3142/debian unstable/main amd64 python3-inflect all 7.3.1-2 [32.4 kB]
Get:231 http://localhost:3142/debian unstable/main amd64 python3-jaraco.context all 6.0.1-1 [8276 B]
Get:232 http://localhost:3142/debian unstable/main amd64 python3-jaraco.functools all 4.1.0-1 [12.0 kB]
Get:233 http://localhost:3142/debian unstable/main amd64 python3-pkg-resources all 75.8.0-1 [222 kB]
Get:234 http://localhost:3142/debian unstable/main amd64 python3-jaraco.text all 4.0.0-1 [11.4 kB]
Get:235 http://localhost:3142/debian unstable/main amd64 python3-zipp all 3.21.0-1 [10.6 kB]
Get:236 http://localhost:3142/debian unstable/main amd64 python3-setuptools all 75.8.0-1 [724 kB]
Get:237 http://localhost:3142/debian unstable/main amd64 gobject-introspection-bin amd64 1.84.0-1 [272 kB]
Get:238 http://localhost:3142/debian unstable/main ppc64el libffi-dev ppc64el 3.4.7-1 [61.7 kB]
Get:239 http://localhost:3142/debian unstable/main ppc64el libuuid1 ppc64el 2.40.4-5 [37.7 kB]
Get:240 http://localhost:3142/debian unstable/main ppc64el uuid-dev ppc64el 2.40.4-5 [49.5 kB]
Get:241 http://localhost:3142/debian unstable/main ppc64el libblkid-dev ppc64el 2.40.4-5 [236 kB]
Get:242 http://localhost:3142/debian unstable/main ppc64el libsepol2 ppc64el 3.8.1-1 [311 kB]
Get:243 http://localhost:3142/debian unstable/main ppc64el libsepol-dev ppc64el 3.8.1-1 [406 kB]
Get:244 http://localhost:3142/debian unstable/main ppc64el libpcre2-16-0 ppc64el 10.45-1 [270 kB]
Get:245 http://localhost:3142/debian unstable/main ppc64el libpcre2-32-0 ppc64el 10.45-1 [259 kB]
Get:246 http://localhost:3142/debian unstable/main ppc64el libpcre2-posix3 ppc64el 10.45-1 [64.0 kB]
Get:247 http://localhost:3142/debian unstable/main ppc64el libpcre2-dev ppc64el 10.45-1 [808 kB]
Get:248 http://localhost:3142/debian unstable/main ppc64el libselinux1-dev ppc64el 3.8.1-1 [187 kB]
Get:249 http://localhost:3142/debian unstable/main ppc64el libmount-dev ppc64el 2.40.4-5 [29.6 kB]
Get:250 http://localhost:3142/debian unstable/main ppc64el libsysprof-capture-4-dev ppc64el 48.0-2 [55.5 kB]
Get:251 http://localhost:3142/debian unstable/main amd64 libpkgconf3 amd64 1.8.1-4 [36.4 kB]
Get:252 http://localhost:3142/debian unstable/main amd64 pkgconf-bin amd64 1.8.1-4 [30.2 kB]
Get:253 http://localhost:3142/debian unstable/main ppc64el pkgconf ppc64el 1.8.1-4 [26.2 kB]
Get:254 http://localhost:3142/debian unstable/main ppc64el zlib1g-dev ppc64el 1:1.3.dfsg+really1.3.1-1+b1 [919 kB]
Get:255 http://localhost:3142/debian unstable/main ppc64el libgio-2.0-dev ppc64el 2.84.0-2 [1858 kB]
Get:256 http://localhost:3142/debian unstable/main amd64 libglib2.0-data all 2.84.0-2 [1286 kB]
Get:257 http://localhost:3142/debian unstable/main amd64 libglib2.0-bin amd64 2.84.0-2 [128 kB]
Get:258 http://localhost:3142/debian unstable/main amd64 python3-packaging all 24.2-1 [55.3 kB]
Get:259 http://localhost:3142/debian unstable/main amd64 libgio-2.0-dev-bin amd64 2.84.0-2 [164 kB]
Get:260 http://localhost:3142/debian unstable/main amd64 libglib2.0-dev-bin amd64 2.84.0-2 [52.9 kB]
Get:261 http://localhost:3142/debian unstable/main ppc64el libglib2.0-dev ppc64el 2.84.0-2 [53.6 kB]
Get:262 http://localhost:3142/debian unstable/main ppc64el gobject-introspection ppc64el 1.84.0-1 [136 kB]
Get:263 http://localhost:3142/debian unstable/main amd64 libgdk-pixbuf2.0-common all 2.42.12+dfsg-2 [311 kB]
Get:264 http://localhost:3142/debian unstable/main amd64 shared-mime-info amd64 2.4-5+b2 [760 kB]
Get:265 http://localhost:3142/debian unstable/main amd64 libjpeg62-turbo amd64 1:2.1.5-3.1 [168 kB]
Get:266 http://localhost:3142/debian unstable/main amd64 libpng16-16t64 amd64 1.6.47-1.1 [282 kB]
Get:267 http://localhost:3142/debian unstable/main amd64 libdeflate0 amd64 1.23-1+b1 [47.5 kB]
Get:268 http://localhost:3142/debian unstable/main amd64 libjbig0 amd64 2.1-6.1+b2 [32.1 kB]
Get:269 http://localhost:3142/debian unstable/main amd64 liblerc4 amd64 4.0.0+ds-5 [183 kB]
Get:270 http://localhost:3142/debian unstable/main amd64 libsharpyuv0 amd64 1.5.0-0.1 [116 kB]
Get:271 http://localhost:3142/debian unstable/main amd64 libwebp7 amd64 1.5.0-0.1 [318 kB]
Get:272 http://localhost:3142/debian unstable/main amd64 libtiff6 amd64 4.7.0-2 [345 kB]
Get:273 http://localhost:3142/debian unstable/main amd64 libgdk-pixbuf-2.0-0 amd64 2.42.12+dfsg-2 [140 kB]
Get:274 http://localhost:3142/debian unstable/main amd64 gtk-update-icon-cache amd64 4.18.3+ds-1 [51.6 kB]
Get:275 http://localhost:3142/debian unstable/main amd64 libicu76 amd64 76.1-3 [9721 kB]
Get:276 http://localhost:3142/debian unstable/main amd64 icu-devtools amd64 76.1-3 [215 kB]
Get:277 http://localhost:3142/debian unstable/main amd64 python3-libxml2 amd64 2.12.7+dfsg+really2.9.14-0.4 [189 kB]
Get:278 http://localhost:3142/debian unstable/main amd64 itstool all 2.0.6-4 [40.8 kB]
Get:279 http://localhost:3142/debian unstable/main ppc64el libgssrpc4t64 ppc64el 1.21.3-5 [64.2 kB]
Get:280 http://localhost:3142/debian unstable/main ppc64el libkadm5clnt-mit12 ppc64el 1.21.3-5 [44.4 kB]
Get:281 http://localhost:3142/debian unstable/main ppc64el libkdb5-10t64 ppc64el 1.21.3-5 [47.4 kB]
Get:282 http://localhost:3142/debian unstable/main ppc64el libkadm5srv-mit12 ppc64el 1.21.3-5 [59.4 kB]
Get:283 http://localhost:3142/debian unstable/main ppc64el krb5-multidev ppc64el 1.21.3-5 [126 kB]
Get:284 http://localhost:3142/debian unstable/main ppc64el libasan8 ppc64el 14.2.0-19 [2650 kB]
Get:285 http://localhost:3142/debian unstable/main ppc64el libbrotli-dev ppc64el 1.1.0-2+b7 [348 kB]
Get:286 http://localhost:3142/debian unstable/main ppc64el libbz2-dev ppc64el 1.0.8-6 [36.2 kB]
Get:287 http://localhost:3142/debian unstable/main ppc64el liblzo2-2 ppc64el 2.10-3+b1 [61.6 kB]
Get:288 http://localhost:3142/debian unstable/main ppc64el libcairo-script-interpreter2 ppc64el 1.18.4-1+b1 [65.4 kB]
Get:289 http://localhost:3142/debian unstable/main ppc64el libexpat1-dev ppc64el 2.7.1-1 [156 kB]
Get:290 http://localhost:3142/debian unstable/main ppc64el libpng-dev ppc64el 1.6.47-1.1 [378 kB]
Get:291 http://localhost:3142/debian unstable/main ppc64el libfreetype-dev ppc64el 2.13.3+dfsg-1 [668 kB]
Get:292 http://localhost:3142/debian unstable/main ppc64el libfontconfig-dev ppc64el 2.15.0-2.2 [435 kB]
Get:293 http://localhost:3142/debian unstable/main ppc64el libpixman-1-dev ppc64el 0.44.0-3 [11.4 kB]
Get:294 http://localhost:3142/debian unstable/main amd64 x11-common all 1:7.7+24 [217 kB]
Get:295 http://localhost:3142/debian unstable/main ppc64el libice6 ppc64el 2:1.1.1-1 [69.9 kB]
Get:296 http://localhost:3142/debian unstable/main ppc64el libsm6 ppc64el 2:1.2.6-1 [38.0 kB]
Get:297 http://localhost:3142/debian unstable/main amd64 xorg-sgml-doctools all 1:1.11-1.1 [22.1 kB]
Get:298 http://localhost:3142/debian unstable/main amd64 x11proto-dev all 2024.1-1 [603 kB]
Get:299 http://localhost:3142/debian unstable/main ppc64el libice-dev ppc64el 2:1.1.1-1 [80.4 kB]
Get:300 http://localhost:3142/debian unstable/main ppc64el libsm-dev ppc64el 2:1.2.6-1 [41.6 kB]
Get:301 http://localhost:3142/debian unstable/main ppc64el libxau-dev ppc64el 1:1.0.11-1 [24.3 kB]
Get:302 http://localhost:3142/debian unstable/main ppc64el libxdmcp-dev ppc64el 1:1.1.5-1 [45.5 kB]
Get:303 http://localhost:3142/debian unstable/main amd64 xtrans-dev all 1.4.0-1 [98.7 kB]
Get:304 http://localhost:3142/debian unstable/main ppc64el libxcb1-dev ppc64el 1.17.0-2+b1 [186 kB]
Get:305 http://localhost:3142/debian unstable/main ppc64el libx11-dev ppc64el 2:1.8.12-1 [945 kB]
Get:306 http://localhost:3142/debian unstable/main ppc64el libxcb-render0-dev ppc64el 1.17.0-2+b1 [119 kB]
Get:307 http://localhost:3142/debian unstable/main ppc64el libxcb-shm0-dev ppc64el 1.17.0-2+b1 [108 kB]
Get:308 http://localhost:3142/debian unstable/main ppc64el libxext-dev ppc64el 2:1.3.4-1+b3 [107 kB]
Get:309 http://localhost:3142/debian unstable/main ppc64el libxrender-dev ppc64el 1:0.9.12-1 [40.9 kB]
Get:310 http://localhost:3142/debian unstable/main ppc64el libcairo2-dev ppc64el 1.18.4-1+b1 [43.4 kB]
Get:311 http://localhost:3142/debian unstable/main ppc64el libcap-dev ppc64el 1:2.75-4 [582 kB]
Get:312 http://localhost:3142/debian unstable/main ppc64el libsystemd-dev ppc64el 257.4-7 [1453 kB]
Get:313 http://localhost:3142/debian unstable/main amd64 xml-core all 0.19 [20.1 kB]
Get:314 http://localhost:3142/debian unstable/main ppc64el libdbus-1-dev ppc64el 1.16.2-2 [238 kB]
Get:315 http://localhost:3142/debian unstable/main amd64 libdbus-glib-1-2 amd64 0.114-1 [61.7 kB]
Get:316 http://localhost:3142/debian unstable/main amd64 libdbus-glib-1-dev-bin amd64 0.114-1 [43.8 kB]
Get:317 http://localhost:3142/debian unstable/main ppc64el libdbus-glib-1-dev ppc64el 0.114-1 [84.4 kB]
Get:318 http://localhost:3142/debian unstable/main ppc64el libgomp1 ppc64el 14.2.0-19 [143 kB]
Get:319 http://localhost:3142/debian unstable/main ppc64el libitm1 ppc64el 14.2.0-19 [28.5 kB]
Get:320 http://localhost:3142/debian unstable/main ppc64el liblsan0 ppc64el 14.2.0-19 [1202 kB]
Get:321 http://localhost:3142/debian unstable/main ppc64el libtsan2 ppc64el 14.2.0-19 [2416 kB]
Get:322 http://localhost:3142/debian unstable/main ppc64el libubsan1 ppc64el 14.2.0-19 [1079 kB]
Get:323 http://localhost:3142/debian unstable/main ppc64el libquadmath0 ppc64el 14.2.0-19 [151 kB]
Get:324 http://localhost:3142/debian unstable/main ppc64el libgcc-14-dev ppc64el 14.2.0-19 [1409 kB]
Get:325 http://localhost:3142/debian unstable/main ppc64el libgirepository-1.0-dev ppc64el 1.84.0-1 [44.5 kB]
Get:326 http://localhost:3142/debian unstable/main ppc64el libgirepository1.0-dev ppc64el 1.84.0-1 [33.3 kB]
Get:327 http://localhost:3142/debian unstable/main ppc64el libmozjs-128-0 ppc64el 128.8.0-1 [9642 kB]
Get:328 http://localhost:3142/debian unstable/main ppc64el libtinfo6 ppc64el 6.5+20250216-2 [356 kB]
Get:329 http://localhost:3142/debian unstable/main ppc64el libreadline8t64 ppc64el 8.2-6 [180 kB]
Get:330 http://localhost:3142/debian unstable/main ppc64el libgjs0g ppc64el 1.82.1-1 [412 kB]
Get:331 http://localhost:3142/debian unstable/main ppc64el libmozjs-128-dev ppc64el 128.8.0-1 [11.9 MB]
Get:332 http://localhost:3142/debian unstable/main ppc64el libgjs-dev ppc64el 1.82.1-1 [19.9 kB]
Get:333 http://localhost:3142/debian unstable/main ppc64el libicu-dev ppc64el 76.1-3 [11.0 MB]
Get:334 http://localhost:3142/debian unstable/main ppc64el libjson-glib-dev ppc64el 1.10.6+ds-2 [93.2 kB]
Get:335 http://localhost:3142/debian unstable/main ppc64el libkrb5-dev ppc64el 1.21.3-5 [16.1 kB]
Get:336 http://localhost:3142/debian unstable/main ppc64el libnghttp2-dev ppc64el 1.64.0-1 [124 kB]
Get:337 http://localhost:3142/debian unstable/main ppc64el libpsl-dev ppc64el 0.21.2-1.1+b1 [79.7 kB]
Get:338 http://localhost:3142/debian unstable/main ppc64el libsqlite3-dev ppc64el 3.46.1-2 [1169 kB]
Get:339 http://localhost:3142/debian unstable/main ppc64el libsoup-3.0-dev ppc64el 3.6.5-1 [114 kB]
Get:340 http://localhost:3142/debian unstable/main ppc64el libstdc++-14-dev ppc64el 14.2.0-19 [2507 kB]
Get:341 http://localhost:3142/debian unstable/main ppc64el libtelepathy-glib-dev ppc64el 0.24.2-2 [1025 kB]
Get:342 http://localhost:3142/debian unstable/main ppc64el libxml2-dev ppc64el 2.12.7+dfsg+really2.9.14-0.4 [861 kB]
Get:343 http://localhost:3142/debian unstable/main ppc64el libtinysparql-dev ppc64el 3.8.2-7 [46.8 kB]
Get:344 http://localhost:3142/debian unstable/main ppc64el libtracker-sparql-3.0-dev ppc64el 3.8.2-7 [40.5 kB]
Get:345 http://localhost:3142/debian unstable/main amd64 libxml2-utils amd64 2.12.7+dfsg+really2.9.14-0.4 [99.8 kB]
Get:346 http://localhost:3142/debian unstable/main amd64 ninja-build amd64 1.12.1-1 [142 kB]
Get:347 http://localhost:3142/debian unstable/main amd64 meson all 1.7.0-1 [639 kB]
Preconfiguring packages ...
Fetched 284 MB in 3s (98.4 MB/s)
Selecting previously unselected package libsystemd-shared:amd64.
(Reading database ... 12837 files and directories currently installed.)
Preparing to unpack .../libsystemd-shared_257.4-7_amd64.deb ...
Unpacking libsystemd-shared:amd64 (257.4-7) ...
Selecting previously unselected package libapparmor1:amd64.
Preparing to unpack .../libapparmor1_4.1.0~beta5-5_amd64.deb ...
Unpacking libapparmor1:amd64 (4.1.0~beta5-5) ...
Setting up libsystemd-shared:amd64 (257.4-7) ...
Selecting previously unselected package systemd.
(Reading database ... 12850 files and directories currently installed.)
Preparing to unpack .../systemd_257.4-7_amd64.deb ...
Unpacking systemd (257.4-7) ...
Setting up libapparmor1:amd64 (4.1.0~beta5-5) ...
Setting up systemd (257.4-7) ...
Created symlink '/etc/systemd/system/getty.target.wants/getty@tty1.service' → '/usr/lib/systemd/system/getty@.service'.
Created symlink '/etc/systemd/system/multi-user.target.wants/remote-fs.target' → '/usr/lib/systemd/system/remote-fs.target'.
Created symlink '/etc/systemd/system/sysinit.target.wants/systemd-pstore.service' → '/usr/lib/systemd/system/systemd-pstore.service'.
Initializing machine ID from random generator.
/usr/lib/tmpfiles.d/legacy.conf:14: Duplicate line for path "/run/lock", ignoring.
Selecting previously unselected package systemd-sysv.
(Reading database ... 13788 files and directories currently installed.)
Preparing to unpack .../0-systemd-sysv_257.4-7_amd64.deb ...
Unpacking systemd-sysv (257.4-7) ...
Selecting previously unselected package libdbus-1-3:amd64.
Preparing to unpack .../1-libdbus-1-3_1.16.2-2_amd64.deb ...
Unpacking libdbus-1-3:amd64 (1.16.2-2) ...
Selecting previously unselected package dbus-bin.
Preparing to unpack .../2-dbus-bin_1.16.2-2_amd64.deb ...
Unpacking dbus-bin (1.16.2-2) ...
Selecting previously unselected package dbus-session-bus-common.
Preparing to unpack .../3-dbus-session-bus-common_1.16.2-2_all.deb ...
Unpacking dbus-session-bus-common (1.16.2-2) ...
Selecting previously unselected package libexpat1:amd64.
Preparing to unpack .../4-libexpat1_2.7.1-1_amd64.deb ...
Unpacking libexpat1:amd64 (2.7.1-1) ...
Selecting previously unselected package dbus-daemon.
Preparing to unpack .../5-dbus-daemon_1.16.2-2_amd64.deb ...
Unpacking dbus-daemon (1.16.2-2) ...
Selecting previously unselected package dbus-system-bus-common.
Preparing to unpack .../6-dbus-system-bus-common_1.16.2-2_all.deb ...
Unpacking dbus-system-bus-common (1.16.2-2) ...
Selecting previously unselected package dbus.
Preparing to unpack .../7-dbus_1.16.2-2_amd64.deb ...
Unpacking dbus (1.16.2-2) ...
Selecting previously unselected package libpython3.13-minimal:amd64.
Preparing to unpack .../8-libpython3.13-minimal_3.13.2-3_amd64.deb ...
Unpacking libpython3.13-minimal:amd64 (3.13.2-3) ...
Selecting previously unselected package python3.13-minimal.
Preparing to unpack .../9-python3.13-minimal_3.13.2-3_amd64.deb ...
Unpacking python3.13-minimal (3.13.2-3) ...
Setting up libpython3.13-minimal:amd64 (3.13.2-3) ...
Setting up libexpat1:amd64 (2.7.1-1) ...
Setting up python3.13-minimal (3.13.2-3) ...
Selecting previously unselected package python3-minimal.
(Reading database ... 14215 files and directories currently installed.)
Preparing to unpack .../00-python3-minimal_3.13.2-2_amd64.deb ...
Unpacking python3-minimal (3.13.2-2) ...
Selecting previously unselected package media-types.
Preparing to unpack .../01-media-types_13.0.0_all.deb ...
Unpacking media-types (13.0.0) ...
Selecting previously unselected package netbase.
Preparing to unpack .../02-netbase_6.5_all.deb ...
Unpacking netbase (6.5) ...
Selecting previously unselected package libffi8:amd64.
Preparing to unpack .../03-libffi8_3.4.7-1_amd64.deb ...
Unpacking libffi8:amd64 (3.4.7-1) ...
Selecting previously unselected package libncursesw6:amd64.
Preparing to unpack .../04-libncursesw6_6.5+20250216-2_amd64.deb ...
Unpacking libncursesw6:amd64 (6.5+20250216-2) ...
Selecting previously unselected package readline-common.
Preparing to unpack .../05-readline-common_8.2-6_all.deb ...
Unpacking readline-common (8.2-6) ...
Selecting previously unselected package libreadline8t64:amd64.
Preparing to unpack .../06-libreadline8t64_8.2-6_amd64.deb ...
Adding 'diversion of /lib/x86_64-linux-gnu/libhistory.so.8 to /lib/x86_64-linux-gnu/libhistory.so.8.usr-is-merged by libreadline8t64'
Adding 'diversion of /lib/x86_64-linux-gnu/libhistory.so.8.2 to /lib/x86_64-linux-gnu/libhistory.so.8.2.usr-is-merged by libreadline8t64'
Adding 'diversion of /lib/x86_64-linux-gnu/libreadline.so.8 to /lib/x86_64-linux-gnu/libreadline.so.8.usr-is-merged by libreadline8t64'
Adding 'diversion of /lib/x86_64-linux-gnu/libreadline.so.8.2 to /lib/x86_64-linux-gnu/libreadline.so.8.2.usr-is-merged by libreadline8t64'
Unpacking libreadline8t64:amd64 (8.2-6) ...
Selecting previously unselected package libsqlite3-0:amd64.
Preparing to unpack .../07-libsqlite3-0_3.46.1-2_amd64.deb ...
Unpacking libsqlite3-0:amd64 (3.46.1-2) ...
Selecting previously unselected package libpython3.13-stdlib:amd64.
Preparing to unpack .../08-libpython3.13-stdlib_3.13.2-3_amd64.deb ...
Unpacking libpython3.13-stdlib:amd64 (3.13.2-3) ...
Selecting previously unselected package python3.13.
Preparing to unpack .../09-python3.13_3.13.2-3_amd64.deb ...
Unpacking python3.13 (3.13.2-3) ...
Selecting previously unselected package libpython3-stdlib:amd64.
Preparing to unpack .../10-libpython3-stdlib_3.13.2-2_amd64.deb ...
Unpacking libpython3-stdlib:amd64 (3.13.2-2) ...
Setting up python3-minimal (3.13.2-2) ...
Selecting previously unselected package python3.
(Reading database ... 14726 files and directories currently installed.)
Preparing to unpack .../000-python3_3.13.2-2_amd64.deb ...
Unpacking python3 (3.13.2-2) ...
Selecting previously unselected package sgml-base.
Preparing to unpack .../001-sgml-base_1.31_all.deb ...
Unpacking sgml-base (1.31) ...
Selecting previously unselected package libproc2-0:amd64.
Preparing to unpack .../002-libproc2-0_2%3a4.0.4-7_amd64.deb ...
Unpacking libproc2-0:amd64 (2:4.0.4-7) ...
Selecting previously unselected package procps.
Preparing to unpack .../003-procps_2%3a4.0.4-7_amd64.deb ...
Unpacking procps (2:4.0.4-7) ...
Selecting previously unselected package sensible-utils.
Preparing to unpack .../004-sensible-utils_0.0.24_all.deb ...
Unpacking sensible-utils (0.0.24) ...
Selecting previously unselected package libmagic-mgc.
Preparing to unpack .../005-libmagic-mgc_1%3a5.46-4_amd64.deb ...
Unpacking libmagic-mgc (1:5.46-4) ...
Selecting previously unselected package libmagic1t64:amd64.
Preparing to unpack .../006-libmagic1t64_1%3a5.46-4_amd64.deb ...
Unpacking libmagic1t64:amd64 (1:5.46-4) ...
Selecting previously unselected package file.
Preparing to unpack .../007-file_1%3a5.46-4_amd64.deb ...
Unpacking file (1:5.46-4) ...
Selecting previously unselected package gettext-base.
Preparing to unpack .../008-gettext-base_0.23.1-1_amd64.deb ...
Unpacking gettext-base (0.23.1-1) ...
Selecting previously unselected package libuchardet0:amd64.
Preparing to unpack .../009-libuchardet0_0.0.8-1+b2_amd64.deb ...
Unpacking libuchardet0:amd64 (0.0.8-1+b2) ...
Selecting previously unselected package groff-base.
Preparing to unpack .../010-groff-base_1.23.0-7_amd64.deb ...
Unpacking groff-base (1.23.0-7) ...
Selecting previously unselected package libpam-systemd:amd64.
Preparing to unpack .../011-libpam-systemd_257.4-7_amd64.deb ...
Unpacking libpam-systemd:amd64 (257.4-7) ...
Selecting previously unselected package bsdextrautils.
Preparing to unpack .../012-bsdextrautils_2.40.4-5_amd64.deb ...
Unpacking bsdextrautils (2.40.4-5) ...
Selecting previously unselected package libpipeline1:amd64.
Preparing to unpack .../013-libpipeline1_1.5.8-1_amd64.deb ...
Unpacking libpipeline1:amd64 (1.5.8-1) ...
Selecting previously unselected package man-db.
Preparing to unpack .../014-man-db_2.13.0-1_amd64.deb ...
Unpacking man-db (2.13.0-1) ...
Selecting previously unselected package m4.
Preparing to unpack .../015-m4_1.4.19-7_amd64.deb ...
Unpacking m4 (1.4.19-7) ...
Selecting previously unselected package autoconf.
Preparing to unpack .../016-autoconf_2.72-3_all.deb ...
Unpacking autoconf (2.72-3) ...
Selecting previously unselected package autotools-dev.
Preparing to unpack .../017-autotools-dev_20240727.1_all.deb ...
Unpacking autotools-dev (20240727.1) ...
Selecting previously unselected package automake.
Preparing to unpack .../018-automake_1%3a1.17-4_all.deb ...
Unpacking automake (1:1.17-4) ...
Selecting previously unselected package autopoint.
Preparing to unpack .../019-autopoint_0.23.1-1_all.deb ...
Unpacking autopoint (0.23.1-1) ...
Selecting previously unselected package binutils-powerpc64le-linux-gnu.
Preparing to unpack .../020-binutils-powerpc64le-linux-gnu_2.44-3_amd64.deb ...
Unpacking binutils-powerpc64le-linux-gnu (2.44-3) ...
Selecting previously unselected package gcc-14-base:ppc64el.
Preparing to unpack .../021-gcc-14-base_14.2.0-19_ppc64el.deb ...
Unpacking gcc-14-base:ppc64el (14.2.0-19) ...
Selecting previously unselected package libgcc-s1:ppc64el.
Preparing to unpack .../022-libgcc-s1_14.2.0-19_ppc64el.deb ...
Unpacking libgcc-s1:ppc64el (14.2.0-19) ...
Selecting previously unselected package libc6:ppc64el.
Preparing to unpack .../023-libc6_2.41-6_ppc64el.deb ...
Unpacking libc6:ppc64el (2.41-6) ...
Selecting previously unselected package libcrypt1:ppc64el.
Preparing to unpack .../024-libcrypt1_1%3a4.4.38-1_ppc64el.deb ...
Unpacking libcrypt1:ppc64el (1:4.4.38-1) ...
Selecting previously unselected package libcrypt-dev:ppc64el.
Preparing to unpack .../025-libcrypt-dev_1%3a4.4.38-1_ppc64el.deb ...
Unpacking libcrypt-dev:ppc64el (1:4.4.38-1) ...
Selecting previously unselected package libc6-dev:ppc64el.
Preparing to unpack .../026-libc6-dev_2.41-6_ppc64el.deb ...
Unpacking libc6-dev:ppc64el (2.41-6) ...
Selecting previously unselected package libcom-err2:ppc64el.
Preparing to unpack .../027-libcom-err2_1.47.2-1+b1_ppc64el.deb ...
Unpacking libcom-err2:ppc64el (1.47.2-1+b1) ...
Selecting previously unselected package comerr-dev:ppc64el.
Preparing to unpack .../028-comerr-dev_2.1-1.47.2-1+b1_ppc64el.deb ...
Unpacking comerr-dev:ppc64el (2.1-1.47.2-1+b1) ...
Selecting previously unselected package gcc-14-powerpc64le-linux-gnu-base:amd64.
Preparing to unpack .../029-gcc-14-powerpc64le-linux-gnu-base_14.2.0-19cross1_amd64.deb ...
Unpacking gcc-14-powerpc64le-linux-gnu-base:amd64 (14.2.0-19cross1) ...
Selecting previously unselected package cpp-14-powerpc64le-linux-gnu.
Preparing to unpack .../030-cpp-14-powerpc64le-linux-gnu_14.2.0-19cross1_amd64.deb ...
Unpacking cpp-14-powerpc64le-linux-gnu (14.2.0-19cross1) ...
Selecting previously unselected package cpp-powerpc64le-linux-gnu.
Preparing to unpack .../031-cpp-powerpc64le-linux-gnu_4%3a14.2.0-1_amd64.deb ...
Unpacking cpp-powerpc64le-linux-gnu (4:14.2.0-1) ...
Selecting previously unselected package qemu-user.
Preparing to unpack .../032-qemu-user_1%3a10.0.0~rc1+ds-2_amd64.deb ...
Unpacking qemu-user (1:10.0.0~rc1+ds-2) ...
Selecting previously unselected package cross-exe-wrapper:ppc64el.
Preparing to unpack .../033-cross-exe-wrapper_0.2.6_ppc64el.deb ...
Unpacking cross-exe-wrapper:ppc64el (0.2.6) ...
Selecting previously unselected package gcc-14-cross-base.
Preparing to unpack .../034-gcc-14-cross-base_14.2.0-19cross1_all.deb ...
Unpacking gcc-14-cross-base (14.2.0-19cross1) ...
Selecting previously unselected package libc6-ppc64el-cross.
Preparing to unpack .../035-libc6-ppc64el-cross_2.41-6cross2_all.deb ...
Unpacking libc6-ppc64el-cross (2.41-6cross2) ...
Selecting previously unselected package libgcc-s1-ppc64el-cross.
Preparing to unpack .../036-libgcc-s1-ppc64el-cross_14.2.0-19cross1_all.deb ...
Unpacking libgcc-s1-ppc64el-cross (14.2.0-19cross1) ...
Selecting previously unselected package libgomp1-ppc64el-cross.
Preparing to unpack .../037-libgomp1-ppc64el-cross_14.2.0-19cross1_all.deb ...
Unpacking libgomp1-ppc64el-cross (14.2.0-19cross1) ...
Selecting previously unselected package libitm1-ppc64el-cross.
Preparing to unpack .../038-libitm1-ppc64el-cross_14.2.0-19cross1_all.deb ...
Unpacking libitm1-ppc64el-cross (14.2.0-19cross1) ...
Selecting previously unselected package libatomic1-ppc64el-cross.
Preparing to unpack .../039-libatomic1-ppc64el-cross_14.2.0-19cross1_all.deb ...
Unpacking libatomic1-ppc64el-cross (14.2.0-19cross1) ...
Selecting previously unselected package libasan8-ppc64el-cross.
Preparing to unpack .../040-libasan8-ppc64el-cross_14.2.0-19cross1_all.deb ...
Unpacking libasan8-ppc64el-cross (14.2.0-19cross1) ...
Selecting previously unselected package liblsan0-ppc64el-cross.
Preparing to unpack .../041-liblsan0-ppc64el-cross_14.2.0-19cross1_all.deb ...
Unpacking liblsan0-ppc64el-cross (14.2.0-19cross1) ...
Selecting previously unselected package libtsan2-ppc64el-cross.
Preparing to unpack .../042-libtsan2-ppc64el-cross_14.2.0-19cross1_all.deb ...
Unpacking libtsan2-ppc64el-cross (14.2.0-19cross1) ...
Selecting previously unselected package libstdc++6-ppc64el-cross.
Preparing to unpack .../043-libstdc++6-ppc64el-cross_14.2.0-19cross1_all.deb ...
Unpacking libstdc++6-ppc64el-cross (14.2.0-19cross1) ...
Selecting previously unselected package libubsan1-ppc64el-cross.
Preparing to unpack .../044-libubsan1-ppc64el-cross_14.2.0-19cross1_all.deb ...
Unpacking libubsan1-ppc64el-cross (14.2.0-19cross1) ...
Selecting previously unselected package libquadmath0-ppc64el-cross.
Preparing to unpack .../045-libquadmath0-ppc64el-cross_14.2.0-19cross1_all.deb ...
Unpacking libquadmath0-ppc64el-cross (14.2.0-19cross1) ...
Selecting previously unselected package libgcc-14-dev-ppc64el-cross.
Preparing to unpack .../046-libgcc-14-dev-ppc64el-cross_14.2.0-19cross1_all.deb ...
Unpacking libgcc-14-dev-ppc64el-cross (14.2.0-19cross1) ...
Selecting previously unselected package gcc-14-powerpc64le-linux-gnu.
Preparing to unpack .../047-gcc-14-powerpc64le-linux-gnu_14.2.0-19cross1_amd64.deb ...
Unpacking gcc-14-powerpc64le-linux-gnu (14.2.0-19cross1) ...
Selecting previously unselected package gcc-powerpc64le-linux-gnu.
Preparing to unpack .../048-gcc-powerpc64le-linux-gnu_4%3a14.2.0-1_amd64.deb ...
Unpacking gcc-powerpc64le-linux-gnu (4:14.2.0-1) ...
Selecting previously unselected package linux-libc-dev-ppc64el-cross.
Preparing to unpack .../049-linux-libc-dev-ppc64el-cross_6.12.17-1cross2_all.deb ...
Unpacking linux-libc-dev-ppc64el-cross (6.12.17-1cross2) ...
Selecting previously unselected package libc6-dev-ppc64el-cross.
Preparing to unpack .../050-libc6-dev-ppc64el-cross_2.41-6cross2_all.deb ...
Unpacking libc6-dev-ppc64el-cross (2.41-6cross2) ...
Selecting previously unselected package libstdc++-14-dev-ppc64el-cross.
Preparing to unpack .../051-libstdc++-14-dev-ppc64el-cross_14.2.0-19cross1_all.deb ...
Unpacking libstdc++-14-dev-ppc64el-cross (14.2.0-19cross1) ...
Selecting previously unselected package g++-14-powerpc64le-linux-gnu.
Preparing to unpack .../052-g++-14-powerpc64le-linux-gnu_14.2.0-19cross1_amd64.deb ...
Unpacking g++-14-powerpc64le-linux-gnu (14.2.0-19cross1) ...
Selecting previously unselected package g++-powerpc64le-linux-gnu.
Preparing to unpack .../053-g++-powerpc64le-linux-gnu_4%3a14.2.0-1_amd64.deb ...
Unpacking g++-powerpc64le-linux-gnu (4:14.2.0-1) ...
Selecting previously unselected package crossbuild-essential-ppc64el.
Preparing to unpack .../054-crossbuild-essential-ppc64el_12.12_all.deb ...
Unpacking crossbuild-essential-ppc64el (12.12) ...
Selecting previously unselected package dbus-user-session.
Preparing to unpack .../055-dbus-user-session_1.16.2-2_amd64.deb ...
Unpacking dbus-user-session (1.16.2-2) ...
Selecting previously unselected package libglib2.0-0t64:amd64.
Preparing to unpack .../056-libglib2.0-0t64_2.84.0-2_amd64.deb ...
Unpacking libglib2.0-0t64:amd64 (2.84.0-2) ...
Selecting previously unselected package libdconf1:amd64.
Preparing to unpack .../057-libdconf1_0.40.0-5_amd64.deb ...
Unpacking libdconf1:amd64 (0.40.0-5) ...
Selecting previously unselected package dconf-service.
Preparing to unpack .../058-dconf-service_0.40.0-5_amd64.deb ...
Unpacking dconf-service (0.40.0-5) ...
Selecting previously unselected package dconf-gsettings-backend:amd64.
Preparing to unpack .../059-dconf-gsettings-backend_0.40.0-5_amd64.deb ...
Unpacking dconf-gsettings-backend:amd64 (0.40.0-5) ...
Selecting previously unselected package libdebhelper-perl.
Preparing to unpack .../060-libdebhelper-perl_13.24.2_all.deb ...
Unpacking libdebhelper-perl (13.24.2) ...
Selecting previously unselected package libtool.
Preparing to unpack .../061-libtool_2.5.4-4_all.deb ...
Unpacking libtool (2.5.4-4) ...
Selecting previously unselected package dh-autoreconf.
Preparing to unpack .../062-dh-autoreconf_20_all.deb ...
Unpacking dh-autoreconf (20) ...
Selecting previously unselected package libarchive-zip-perl.
Preparing to unpack .../063-libarchive-zip-perl_1.68-1_all.deb ...
Unpacking libarchive-zip-perl (1.68-1) ...
Selecting previously unselected package libfile-stripnondeterminism-perl.
Preparing to unpack .../064-libfile-stripnondeterminism-perl_1.14.1-2_all.deb ...
Unpacking libfile-stripnondeterminism-perl (1.14.1-2) ...
Selecting previously unselected package dh-strip-nondeterminism.
Preparing to unpack .../065-dh-strip-nondeterminism_1.14.1-2_all.deb ...
Unpacking dh-strip-nondeterminism (1.14.1-2) ...
Selecting previously unselected package libelf1t64:amd64.
Preparing to unpack .../066-libelf1t64_0.192-4_amd64.deb ...
Unpacking libelf1t64:amd64 (0.192-4) ...
Selecting previously unselected package dwz.
Preparing to unpack .../067-dwz_0.15-1+b1_amd64.deb ...
Unpacking dwz (0.15-1+b1) ...
Selecting previously unselected package libunistring5:amd64.
Preparing to unpack .../068-libunistring5_1.3-2_amd64.deb ...
Unpacking libunistring5:amd64 (1.3-2) ...
Selecting previously unselected package libxml2:amd64.
Preparing to unpack .../069-libxml2_2.12.7+dfsg+really2.9.14-0.4_amd64.deb ...
Unpacking libxml2:amd64 (2.12.7+dfsg+really2.9.14-0.4) ...
Selecting previously unselected package gettext.
Preparing to unpack .../070-gettext_0.23.1-1_amd64.deb ...
Unpacking gettext (0.23.1-1) ...
Selecting previously unselected package intltool-debian.
Preparing to unpack .../071-intltool-debian_0.35.0+20060710.6_all.deb ...
Unpacking intltool-debian (0.35.0+20060710.6) ...
Selecting previously unselected package po-debconf.
Preparing to unpack .../072-po-debconf_1.0.21+nmu1_all.deb ...
Unpacking po-debconf (1.0.21+nmu1) ...
Selecting previously unselected package debhelper.
Preparing to unpack .../073-debhelper_13.24.2_all.deb ...
Unpacking debhelper (13.24.2) ...
Selecting previously unselected package desktop-file-utils.
Preparing to unpack .../074-desktop-file-utils_0.28-1_amd64.deb ...
Unpacking desktop-file-utils (0.28-1) ...
Selecting previously unselected package libfakeroot:amd64.
Preparing to unpack .../075-libfakeroot_1.37.1.1-1_amd64.deb ...
Unpacking libfakeroot:amd64 (1.37.1.1-1) ...
Selecting previously unselected package fakeroot.
Preparing to unpack .../076-fakeroot_1.37.1.1-1_amd64.deb ...
Unpacking fakeroot (1.37.1.1-1) ...
Selecting previously unselected package fonts-dejavu-mono.
Preparing to unpack .../077-fonts-dejavu-mono_2.37-8_all.deb ...
Unpacking fonts-dejavu-mono (2.37-8) ...
Selecting previously unselected package fonts-dejavu-core.
Preparing to unpack .../078-fonts-dejavu-core_2.37-8_all.deb ...
Unpacking fonts-dejavu-core (2.37-8) ...
Selecting previously unselected package fontconfig-config.
Preparing to unpack .../079-fontconfig-config_2.15.0-2.2_amd64.deb ...
Unpacking fontconfig-config (2.15.0-2.2) ...
Selecting previously unselected package libatomic1:ppc64el.
Preparing to unpack .../080-libatomic1_14.2.0-19_ppc64el.deb ...
Unpacking libatomic1:ppc64el (14.2.0-19) ...
Selecting previously unselected package libffi8:ppc64el.
Preparing to unpack .../081-libffi8_3.4.7-1_ppc64el.deb ...
Unpacking libffi8:ppc64el (3.4.7-1) ...
Selecting previously unselected package libblkid1:ppc64el.
Preparing to unpack .../082-libblkid1_2.40.4-5_ppc64el.deb ...
Unpacking libblkid1:ppc64el (2.40.4-5) ...
Selecting previously unselected package libpcre2-8-0:ppc64el.
Preparing to unpack .../083-libpcre2-8-0_10.45-1_ppc64el.deb ...
Unpacking libpcre2-8-0:ppc64el (10.45-1) ...
Selecting previously unselected package libselinux1:ppc64el.
Preparing to unpack .../084-libselinux1_3.8.1-1_ppc64el.deb ...
Unpacking libselinux1:ppc64el (3.8.1-1) ...
Selecting previously unselected package libmount1:ppc64el.
Preparing to unpack .../085-libmount1_2.40.4-5_ppc64el.deb ...
Unpacking libmount1:ppc64el (2.40.4-5) ...
Selecting previously unselected package zlib1g:ppc64el.
Preparing to unpack .../086-zlib1g_1%3a1.3.dfsg+really1.3.1-1+b1_ppc64el.deb ...
Unpacking zlib1g:ppc64el (1:1.3.dfsg+really1.3.1-1+b1) ...
Selecting previously unselected package libglib2.0-0t64:ppc64el.
Preparing to unpack .../087-libglib2.0-0t64_2.84.0-2_ppc64el.deb ...
Unpacking libglib2.0-0t64:ppc64el (2.84.0-2) ...
Selecting previously unselected package gir1.2-glib-2.0:ppc64el.
Preparing to unpack .../088-gir1.2-glib-2.0_2.84.0-2_ppc64el.deb ...
Unpacking gir1.2-glib-2.0:ppc64el (2.84.0-2) ...
Selecting previously unselected package libexpat1:ppc64el.
Preparing to unpack .../089-libexpat1_2.7.1-1_ppc64el.deb ...
Unpacking libexpat1:ppc64el (2.7.1-1) ...
Selecting previously unselected package libbrotli1:ppc64el.
Preparing to unpack .../090-libbrotli1_1.1.0-2+b7_ppc64el.deb ...
Unpacking libbrotli1:ppc64el (1.1.0-2+b7) ...
Selecting previously unselected package libbz2-1.0:ppc64el.
Preparing to unpack .../091-libbz2-1.0_1.0.8-6_ppc64el.deb ...
Unpacking libbz2-1.0:ppc64el (1.0.8-6) ...
Selecting previously unselected package libpng16-16t64:ppc64el.
Preparing to unpack .../092-libpng16-16t64_1.6.47-1.1_ppc64el.deb ...
Unpacking libpng16-16t64:ppc64el (1.6.47-1.1) ...
Selecting previously unselected package libfreetype6:ppc64el.
Preparing to unpack .../093-libfreetype6_2.13.3+dfsg-1_ppc64el.deb ...
Unpacking libfreetype6:ppc64el (2.13.3+dfsg-1) ...
Selecting previously unselected package libfontconfig1:ppc64el.
Preparing to unpack .../094-libfontconfig1_2.15.0-2.2_ppc64el.deb ...
Unpacking libfontconfig1:ppc64el (2.15.0-2.2) ...
Selecting previously unselected package libpixman-1-0:ppc64el.
Preparing to unpack .../095-libpixman-1-0_0.44.0-3_ppc64el.deb ...
Unpacking libpixman-1-0:ppc64el (0.44.0-3) ...
Selecting previously unselected package libxau6:ppc64el.
Preparing to unpack .../096-libxau6_1%3a1.0.11-1_ppc64el.deb ...
Unpacking libxau6:ppc64el (1:1.0.11-1) ...
Selecting previously unselected package libxdmcp6:ppc64el.
Preparing to unpack .../097-libxdmcp6_1%3a1.1.5-1_ppc64el.deb ...
Unpacking libxdmcp6:ppc64el (1:1.1.5-1) ...
Selecting previously unselected package libxcb1:ppc64el.
Preparing to unpack .../098-libxcb1_1.17.0-2+b1_ppc64el.deb ...
Unpacking libxcb1:ppc64el (1.17.0-2+b1) ...
Selecting previously unselected package libx11-data.
Preparing to unpack .../099-libx11-data_2%3a1.8.12-1_all.deb ...
Unpacking libx11-data (2:1.8.12-1) ...
Selecting previously unselected package libx11-6:ppc64el.
Preparing to unpack .../100-libx11-6_2%3a1.8.12-1_ppc64el.deb ...
Unpacking libx11-6:ppc64el (2:1.8.12-1) ...
Selecting previously unselected package libxcb-render0:ppc64el.
Preparing to unpack .../101-libxcb-render0_1.17.0-2+b1_ppc64el.deb ...
Unpacking libxcb-render0:ppc64el (1.17.0-2+b1) ...
Selecting previously unselected package libxcb-shm0:ppc64el.
Preparing to unpack .../102-libxcb-shm0_1.17.0-2+b1_ppc64el.deb ...
Unpacking libxcb-shm0:ppc64el (1.17.0-2+b1) ...
Selecting previously unselected package libxext6:ppc64el.
Preparing to unpack .../103-libxext6_2%3a1.3.4-1+b3_ppc64el.deb ...
Unpacking libxext6:ppc64el (2:1.3.4-1+b3) ...
Selecting previously unselected package libxrender1:ppc64el.
Preparing to unpack .../104-libxrender1_1%3a0.9.12-1_ppc64el.deb ...
Unpacking libxrender1:ppc64el (1:0.9.12-1) ...
Selecting previously unselected package libcairo2:ppc64el.
Preparing to unpack .../105-libcairo2_1.18.4-1+b1_ppc64el.deb ...
Unpacking libcairo2:ppc64el (1.18.4-1+b1) ...
Selecting previously unselected package libcairo-gobject2:ppc64el.
Preparing to unpack .../106-libcairo-gobject2_1.18.4-1+b1_ppc64el.deb ...
Unpacking libcairo-gobject2:ppc64el (1.18.4-1+b1) ...
Selecting previously unselected package gir1.2-freedesktop:ppc64el.
Preparing to unpack .../107-gir1.2-freedesktop_1.84.0-1_ppc64el.deb ...
Unpacking gir1.2-freedesktop:ppc64el (1.84.0-1) ...
Selecting previously unselected package gir1.2-glib-2.0-dev:ppc64el.
Preparing to unpack .../108-gir1.2-glib-2.0-dev_2.84.0-2_ppc64el.deb ...
Unpacking gir1.2-glib-2.0-dev:ppc64el (2.84.0-2) ...
Selecting previously unselected package gir1.2-freedesktop-dev:ppc64el.
Preparing to unpack .../109-gir1.2-freedesktop-dev_1.84.0-1_ppc64el.deb ...
Unpacking gir1.2-freedesktop-dev:ppc64el (1.84.0-1) ...
Selecting previously unselected package libgirepository-1.0-1:ppc64el.
Preparing to unpack .../110-libgirepository-1.0-1_1.84.0-1_ppc64el.deb ...
Unpacking libgirepository-1.0-1:ppc64el (1.84.0-1) ...
Selecting previously unselected package gir1.2-girepository-2.0:ppc64el.
Preparing to unpack .../111-gir1.2-girepository-2.0_1.84.0-1_ppc64el.deb ...
Unpacking gir1.2-girepository-2.0:ppc64el (1.84.0-1) ...
Selecting previously unselected package gir1.2-girepository-2.0-dev:ppc64el.
Preparing to unpack .../112-gir1.2-girepository-2.0-dev_1.84.0-1_ppc64el.deb ...
Unpacking gir1.2-girepository-2.0-dev:ppc64el (1.84.0-1) ...
Selecting previously unselected package libjson-glib-1.0-common.
Preparing to unpack .../113-libjson-glib-1.0-common_1.10.6+ds-2_all.deb ...
Unpacking libjson-glib-1.0-common (1.10.6+ds-2) ...
Selecting previously unselected package libjson-glib-1.0-0:ppc64el.
Preparing to unpack .../114-libjson-glib-1.0-0_1.10.6+ds-2_ppc64el.deb ...
Unpacking libjson-glib-1.0-0:ppc64el (1.10.6+ds-2) ...
Selecting previously unselected package gir1.2-json-1.0:ppc64el.
Preparing to unpack .../115-gir1.2-json-1.0_1.10.6+ds-2_ppc64el.deb ...
Unpacking gir1.2-json-1.0:ppc64el (1.10.6+ds-2) ...
Selecting previously unselected package libgmp10:ppc64el.
Preparing to unpack .../116-libgmp10_2%3a6.3.0+dfsg-3_ppc64el.deb ...
Unpacking libgmp10:ppc64el (2:6.3.0+dfsg-3) ...
Selecting previously unselected package libnettle8t64:ppc64el.
Preparing to unpack .../117-libnettle8t64_3.10.1-1_ppc64el.deb ...
Unpacking libnettle8t64:ppc64el (3.10.1-1) ...
Selecting previously unselected package libhogweed6t64:ppc64el.
Preparing to unpack .../118-libhogweed6t64_3.10.1-1_ppc64el.deb ...
Unpacking libhogweed6t64:ppc64el (3.10.1-1) ...
Selecting previously unselected package libunistring5:ppc64el.
Preparing to unpack .../119-libunistring5_1.3-2_ppc64el.deb ...
Unpacking libunistring5:ppc64el (1.3-2) ...
Selecting previously unselected package libidn2-0:ppc64el.
Preparing to unpack .../120-libidn2-0_2.3.8-2_ppc64el.deb ...
Unpacking libidn2-0:ppc64el (2.3.8-2) ...
Selecting previously unselected package libp11-kit0:ppc64el.
Preparing to unpack .../121-libp11-kit0_0.25.5-3_ppc64el.deb ...
Unpacking libp11-kit0:ppc64el (0.25.5-3) ...
Selecting previously unselected package libtasn1-6:ppc64el.
Preparing to unpack .../122-libtasn1-6_4.20.0-2_ppc64el.deb ...
Unpacking libtasn1-6:ppc64el (4.20.0-2) ...
Selecting previously unselected package libgnutls30t64:ppc64el.
Preparing to unpack .../123-libgnutls30t64_3.8.9-2_ppc64el.deb ...
Unpacking libgnutls30t64:ppc64el (3.8.9-2) ...
Selecting previously unselected package libkrb5support0:ppc64el.
Preparing to unpack .../124-libkrb5support0_1.21.3-5_ppc64el.deb ...
Unpacking libkrb5support0:ppc64el (1.21.3-5) ...
Selecting previously unselected package libk5crypto3:ppc64el.
Preparing to unpack .../125-libk5crypto3_1.21.3-5_ppc64el.deb ...
Unpacking libk5crypto3:ppc64el (1.21.3-5) ...
Selecting previously unselected package libkeyutils1:ppc64el.
Preparing to unpack .../126-libkeyutils1_1.6.3-4_ppc64el.deb ...
Unpacking libkeyutils1:ppc64el (1.6.3-4) ...
Selecting previously unselected package libzstd1:ppc64el.
Preparing to unpack .../127-libzstd1_1.5.7+dfsg-1_ppc64el.deb ...
Unpacking libzstd1:ppc64el (1.5.7+dfsg-1) ...
Selecting previously unselected package libssl3t64:ppc64el.
Preparing to unpack .../128-libssl3t64_3.4.1-1_ppc64el.deb ...
Unpacking libssl3t64:ppc64el (3.4.1-1) ...
Selecting previously unselected package libkrb5-3:ppc64el.
Preparing to unpack .../129-libkrb5-3_1.21.3-5_ppc64el.deb ...
Unpacking libkrb5-3:ppc64el (1.21.3-5) ...
Selecting previously unselected package libgssapi-krb5-2:ppc64el.
Preparing to unpack .../130-libgssapi-krb5-2_1.21.3-5_ppc64el.deb ...
Unpacking libgssapi-krb5-2:ppc64el (1.21.3-5) ...
Selecting previously unselected package libdb5.3t64:ppc64el.
Preparing to unpack .../131-libdb5.3t64_5.3.28+dfsg2-9_ppc64el.deb ...
Unpacking libdb5.3t64:ppc64el (5.3.28+dfsg2-9) ...
Selecting previously unselected package libsasl2-modules-db:ppc64el.
Preparing to unpack .../132-libsasl2-modules-db_2.1.28+dfsg1-9_ppc64el.deb ...
Unpacking libsasl2-modules-db:ppc64el (2.1.28+dfsg1-9) ...
Selecting previously unselected package libsasl2-2:ppc64el.
Preparing to unpack .../133-libsasl2-2_2.1.28+dfsg1-9_ppc64el.deb ...
Unpacking libsasl2-2:ppc64el (2.1.28+dfsg1-9) ...
Selecting previously unselected package libldap2:ppc64el.
Preparing to unpack .../134-libldap2_2.6.9+dfsg-2_ppc64el.deb ...
Unpacking libldap2:ppc64el (2.6.9+dfsg-2) ...
Selecting previously unselected package libnghttp2-14:ppc64el.
Preparing to unpack .../135-libnghttp2-14_1.64.0-1_ppc64el.deb ...
Unpacking libnghttp2-14:ppc64el (1.64.0-1) ...
Selecting previously unselected package libnghttp3-9:ppc64el.
Preparing to unpack .../136-libnghttp3-9_1.8.0-1_ppc64el.deb ...
Unpacking libnghttp3-9:ppc64el (1.8.0-1) ...
Selecting previously unselected package libngtcp2-16:ppc64el.
Preparing to unpack .../137-libngtcp2-16_1.11.0-1_ppc64el.deb ...
Unpacking libngtcp2-16:ppc64el (1.11.0-1) ...
Selecting previously unselected package libngtcp2-crypto-gnutls8:ppc64el.
Preparing to unpack .../138-libngtcp2-crypto-gnutls8_1.11.0-1_ppc64el.deb ...
Unpacking libngtcp2-crypto-gnutls8:ppc64el (1.11.0-1) ...
Selecting previously unselected package libpsl5t64:ppc64el.
Preparing to unpack .../139-libpsl5t64_0.21.2-1.1+b1_ppc64el.deb ...
Unpacking libpsl5t64:ppc64el (0.21.2-1.1+b1) ...
Selecting previously unselected package librtmp1:ppc64el.
Preparing to unpack .../140-librtmp1_2.4+20151223.gitfa8646d.1-2+b5_ppc64el.deb ...
Unpacking librtmp1:ppc64el (2.4+20151223.gitfa8646d.1-2+b5) ...
Selecting previously unselected package libssh2-1t64:ppc64el.
Preparing to unpack .../141-libssh2-1t64_1.11.1-1_ppc64el.deb ...
Unpacking libssh2-1t64:ppc64el (1.11.1-1) ...
Selecting previously unselected package libcurl3t64-gnutls:ppc64el.
Preparing to unpack .../142-libcurl3t64-gnutls_8.13.0~rc3-1_ppc64el.deb ...
Unpacking libcurl3t64-gnutls:ppc64el (8.13.0~rc3-1) ...
Selecting previously unselected package libduktape207:ppc64el.
Preparing to unpack .../143-libduktape207_2.7.0-2+b2_ppc64el.deb ...
Unpacking libduktape207:ppc64el (2.7.0-2+b2) ...
Selecting previously unselected package libproxy1v5:ppc64el.
Preparing to unpack .../144-libproxy1v5_0.5.9-1_ppc64el.deb ...
Unpacking libproxy1v5:ppc64el (0.5.9-1) ...
Selecting previously unselected package libbrotli1:amd64.
Preparing to unpack .../145-libbrotli1_1.1.0-2+b7_amd64.deb ...
Unpacking libbrotli1:amd64 (1.1.0-2+b7) ...
Selecting previously unselected package libidn2-0:amd64.
Preparing to unpack .../146-libidn2-0_2.3.8-2_amd64.deb ...
Unpacking libidn2-0:amd64 (2.3.8-2) ...
Selecting previously unselected package libp11-kit0:amd64.
Preparing to unpack .../147-libp11-kit0_0.25.5-3_amd64.deb ...
Unpacking libp11-kit0:amd64 (0.25.5-3) ...
Selecting previously unselected package libtasn1-6:amd64.
Preparing to unpack .../148-libtasn1-6_4.20.0-2_amd64.deb ...
Unpacking libtasn1-6:amd64 (4.20.0-2) ...
Selecting previously unselected package libgnutls30t64:amd64.
Preparing to unpack .../149-libgnutls30t64_3.8.9-2_amd64.deb ...
Unpacking libgnutls30t64:amd64 (3.8.9-2) ...
Selecting previously unselected package libkrb5support0:amd64.
Preparing to unpack .../150-libkrb5support0_1.21.3-5_amd64.deb ...
Unpacking libkrb5support0:amd64 (1.21.3-5) ...
Selecting previously unselected package libcom-err2:amd64.
Preparing to unpack .../151-libcom-err2_1.47.2-1+b1_amd64.deb ...
Unpacking libcom-err2:amd64 (1.47.2-1+b1) ...
Selecting previously unselected package libk5crypto3:amd64.
Preparing to unpack .../152-libk5crypto3_1.21.3-5_amd64.deb ...
Unpacking libk5crypto3:amd64 (1.21.3-5) ...
Selecting previously unselected package libkeyutils1:amd64.
Preparing to unpack .../153-libkeyutils1_1.6.3-4_amd64.deb ...
Unpacking libkeyutils1:amd64 (1.6.3-4) ...
Selecting previously unselected package libkrb5-3:amd64.
Preparing to unpack .../154-libkrb5-3_1.21.3-5_amd64.deb ...
Unpacking libkrb5-3:amd64 (1.21.3-5) ...
Selecting previously unselected package libgssapi-krb5-2:amd64.
Preparing to unpack .../155-libgssapi-krb5-2_1.21.3-5_amd64.deb ...
Unpacking libgssapi-krb5-2:amd64 (1.21.3-5) ...
Selecting previously unselected package libsasl2-modules-db:amd64.
Preparing to unpack .../156-libsasl2-modules-db_2.1.28+dfsg1-9_amd64.deb ...
Unpacking libsasl2-modules-db:amd64 (2.1.28+dfsg1-9) ...
Selecting previously unselected package libsasl2-2:amd64.
Preparing to unpack .../157-libsasl2-2_2.1.28+dfsg1-9_amd64.deb ...
Unpacking libsasl2-2:amd64 (2.1.28+dfsg1-9) ...
Selecting previously unselected package libldap2:amd64.
Preparing to unpack .../158-libldap2_2.6.9+dfsg-2_amd64.deb ...
Unpacking libldap2:amd64 (2.6.9+dfsg-2) ...
Selecting previously unselected package libnghttp2-14:amd64.
Preparing to unpack .../159-libnghttp2-14_1.64.0-1_amd64.deb ...
Unpacking libnghttp2-14:amd64 (1.64.0-1) ...
Selecting previously unselected package libnghttp3-9:amd64.
Preparing to unpack .../160-libnghttp3-9_1.8.0-1_amd64.deb ...
Unpacking libnghttp3-9:amd64 (1.8.0-1) ...
Selecting previously unselected package libngtcp2-16:amd64.
Preparing to unpack .../161-libngtcp2-16_1.11.0-1_amd64.deb ...
Unpacking libngtcp2-16:amd64 (1.11.0-1) ...
Selecting previously unselected package libngtcp2-crypto-gnutls8:amd64.
Preparing to unpack .../162-libngtcp2-crypto-gnutls8_1.11.0-1_amd64.deb ...
Unpacking libngtcp2-crypto-gnutls8:amd64 (1.11.0-1) ...
Selecting previously unselected package libpsl5t64:amd64.
Preparing to unpack .../163-libpsl5t64_0.21.2-1.1+b1_amd64.deb ...
Unpacking libpsl5t64:amd64 (0.21.2-1.1+b1) ...
Selecting previously unselected package librtmp1:amd64.
Preparing to unpack .../164-librtmp1_2.4+20151223.gitfa8646d.1-2+b5_amd64.deb ...
Unpacking librtmp1:amd64 (2.4+20151223.gitfa8646d.1-2+b5) ...
Selecting previously unselected package libssh2-1t64:amd64.
Preparing to unpack .../165-libssh2-1t64_1.11.1-1_amd64.deb ...
Unpacking libssh2-1t64:amd64 (1.11.1-1) ...
Selecting previously unselected package libcurl3t64-gnutls:amd64.
Preparing to unpack .../166-libcurl3t64-gnutls_8.13.0~rc3-1_amd64.deb ...
Unpacking libcurl3t64-gnutls:amd64 (8.13.0~rc3-1) ...
Selecting previously unselected package libduktape207:amd64.
Preparing to unpack .../167-libduktape207_2.7.0-2+b2_amd64.deb ...
Unpacking libduktape207:amd64 (2.7.0-2+b2) ...
Selecting previously unselected package libproxy1v5:amd64.
Preparing to unpack .../168-libproxy1v5_0.5.9-1_amd64.deb ...
Unpacking libproxy1v5:amd64 (0.5.9-1) ...
Selecting previously unselected package glib-networking-common.
Preparing to unpack .../169-glib-networking-common_2.80.1-1_all.deb ...
Unpacking glib-networking-common (2.80.1-1) ...
Selecting previously unselected package glib-networking-services.
Preparing to unpack .../170-glib-networking-services_2.80.1-1_amd64.deb ...
Unpacking glib-networking-services (2.80.1-1) ...
Selecting previously unselected package gsettings-desktop-schemas.
Preparing to unpack .../171-gsettings-desktop-schemas_48.0-1_all.deb ...
Unpacking gsettings-desktop-schemas (48.0-1) ...
Selecting previously unselected package glib-networking:ppc64el.
Preparing to unpack .../172-glib-networking_2.80.1-1_ppc64el.deb ...
Unpacking glib-networking:ppc64el (2.80.1-1) ...
Selecting previously unselected package libsoup-3.0-common.
Preparing to unpack .../173-libsoup-3.0-common_3.6.5-1_all.deb ...
Unpacking libsoup-3.0-common (3.6.5-1) ...
Selecting previously unselected package libsqlite3-0:ppc64el.
Preparing to unpack .../174-libsqlite3-0_3.46.1-2_ppc64el.deb ...
Unpacking libsqlite3-0:ppc64el (3.46.1-2) ...
Selecting previously unselected package libsoup-3.0-0:ppc64el.
Preparing to unpack .../175-libsoup-3.0-0_3.6.5-1_ppc64el.deb ...
Unpacking libsoup-3.0-0:ppc64el (3.6.5-1) ...
Selecting previously unselected package gir1.2-soup-3.0:ppc64el.
Preparing to unpack .../176-gir1.2-soup-3.0_3.6.5-1_ppc64el.deb ...
Unpacking gir1.2-soup-3.0:ppc64el (3.6.5-1) ...
Selecting previously unselected package libcap2:ppc64el.
Preparing to unpack .../177-libcap2_1%3a2.75-4_ppc64el.deb ...
Unpacking libcap2:ppc64el (1:2.75-4) ...
Selecting previously unselected package libsystemd0:ppc64el.
Preparing to unpack .../178-libsystemd0_257.4-7_ppc64el.deb ...
Unpacking libsystemd0:ppc64el (257.4-7) ...
Selecting previously unselected package libdbus-1-3:ppc64el.
Preparing to unpack .../179-libdbus-1-3_1.16.2-2_ppc64el.deb ...
Unpacking libdbus-1-3:ppc64el (1.16.2-2) ...
Selecting previously unselected package libdbus-glib-1-2:ppc64el.
Preparing to unpack .../180-libdbus-glib-1-2_0.114-1_ppc64el.deb ...
Unpacking libdbus-glib-1-2:ppc64el (0.114-1) ...
Selecting previously unselected package libtelepathy-glib0t64:ppc64el.
Preparing to unpack .../181-libtelepathy-glib0t64_0.24.2-2_ppc64el.deb ...
Unpacking libtelepathy-glib0t64:ppc64el (0.24.2-2) ...
Selecting previously unselected package gir1.2-telepathyglib-0.12:ppc64el.
Preparing to unpack .../182-gir1.2-telepathyglib-0.12_0.24.2-2_ppc64el.deb ...
Unpacking gir1.2-telepathyglib-0.12:ppc64el (0.24.2-2) ...
Selecting previously unselected package libstdc++6:ppc64el.
Preparing to unpack .../183-libstdc++6_14.2.0-19_ppc64el.deb ...
Unpacking libstdc++6:ppc64el (14.2.0-19) ...
Selecting previously unselected package libicu76:ppc64el.
Preparing to unpack .../184-libicu76_76.1-3_ppc64el.deb ...
Unpacking libicu76:ppc64el (76.1-3) ...
Selecting previously unselected package libstemmer0d:ppc64el.
Preparing to unpack .../185-libstemmer0d_2.2.0-4+b2_ppc64el.deb ...
Unpacking libstemmer0d:ppc64el (2.2.0-4+b2) ...
Selecting previously unselected package liblzma5:ppc64el.
Preparing to unpack .../186-liblzma5_5.6.4-1_ppc64el.deb ...
Unpacking liblzma5:ppc64el (5.6.4-1) ...
Selecting previously unselected package libxml2:ppc64el.
Preparing to unpack .../187-libxml2_2.12.7+dfsg+really2.9.14-0.4_ppc64el.deb ...
Unpacking libxml2:ppc64el (2.12.7+dfsg+really2.9.14-0.4) ...
Selecting previously unselected package libtinysparql-3.0-0:ppc64el.
Preparing to unpack .../188-libtinysparql-3.0-0_3.8.2-7_ppc64el.deb ...
Unpacking libtinysparql-3.0-0:ppc64el (3.8.2-7) ...
Selecting previously unselected package gir1.2-tracker-3.0:ppc64el.
Preparing to unpack .../189-gir1.2-tracker-3.0_3.8.2-7_ppc64el.deb ...
Unpacking gir1.2-tracker-3.0:ppc64el (3.8.2-7) ...
Selecting previously unselected package gir1.2-tsparql-3.0:ppc64el.
Preparing to unpack .../190-gir1.2-tsparql-3.0_3.8.2-7_ppc64el.deb ...
Unpacking gir1.2-tsparql-3.0:ppc64el (3.8.2-7) ...
Selecting previously unselected package libgirepository-2.0-0:ppc64el.
Preparing to unpack .../191-libgirepository-2.0-0_2.84.0-2_ppc64el.deb ...
Unpacking libgirepository-2.0-0:ppc64el (2.84.0-2) ...
Selecting previously unselected package girepository-tools:ppc64el.
Preparing to unpack .../192-girepository-tools_2.84.0-2_ppc64el.deb ...
Unpacking girepository-tools:ppc64el (2.84.0-2) ...
Selecting previously unselected package native-architecture.
Preparing to unpack .../193-native-architecture_0.2.6_all.deb ...
Unpacking native-architecture (0.2.6) ...
Selecting previously unselected package libgirepository-2.0-0:amd64.
Preparing to unpack .../194-libgirepository-2.0-0_2.84.0-2_amd64.deb ...
Unpacking libgirepository-2.0-0:amd64 (2.84.0-2) ...
Selecting previously unselected package girepository-tools:amd64.
Preparing to unpack .../195-girepository-tools_2.84.0-2_amd64.deb ...
Unpacking girepository-tools:amd64 (2.84.0-2) ...
Selecting previously unselected package libgirepository-1.0-1:amd64.
Preparing to unpack .../196-libgirepository-1.0-1_1.84.0-1_amd64.deb ...
Unpacking libgirepository-1.0-1:amd64 (1.84.0-1) ...
Selecting previously unselected package python3-markupsafe.
Preparing to unpack .../197-python3-markupsafe_2.1.5-1+b3_amd64.deb ...
Unpacking python3-markupsafe (2.1.5-1+b3) ...
Selecting previously unselected package python3-mako.
Preparing to unpack .../198-python3-mako_1.3.8-2_all.deb ...
Unpacking python3-mako (1.3.8-2) ...
Selecting previously unselected package python3-markdown.
Preparing to unpack .../199-python3-markdown_3.7-2_all.deb ...
Unpacking python3-markdown (3.7-2) ...
Selecting previously unselected package python3-autocommand.
Preparing to unpack .../200-python3-autocommand_2.2.2-3_all.deb ...
Unpacking python3-autocommand (2.2.2-3) ...
Selecting previously unselected package python3-more-itertools.
Preparing to unpack .../201-python3-more-itertools_10.6.0-1_all.deb ...
Unpacking python3-more-itertools (10.6.0-1) ...
Selecting previously unselected package python3-typing-extensions.
Preparing to unpack .../202-python3-typing-extensions_4.12.2-2_all.deb ...
Unpacking python3-typing-extensions (4.12.2-2) ...
Selecting previously unselected package python3-typeguard.
Preparing to unpack .../203-python3-typeguard_4.4.2-1_all.deb ...
Unpacking python3-typeguard (4.4.2-1) ...
Selecting previously unselected package python3-inflect.
Preparing to unpack .../204-python3-inflect_7.3.1-2_all.deb ...
Unpacking python3-inflect (7.3.1-2) ...
Selecting previously unselected package python3-jaraco.context.
Preparing to unpack .../205-python3-jaraco.context_6.0.1-1_all.deb ...
Unpacking python3-jaraco.context (6.0.1-1) ...
Selecting previously unselected package python3-jaraco.functools.
Preparing to unpack .../206-python3-jaraco.functools_4.1.0-1_all.deb ...
Unpacking python3-jaraco.functools (4.1.0-1) ...
Selecting previously unselected package python3-pkg-resources.
Preparing to unpack .../207-python3-pkg-resources_75.8.0-1_all.deb ...
Unpacking python3-pkg-resources (75.8.0-1) ...
Selecting previously unselected package python3-jaraco.text.
Preparing to unpack .../208-python3-jaraco.text_4.0.0-1_all.deb ...
Unpacking python3-jaraco.text (4.0.0-1) ...
Selecting previously unselected package python3-zipp.
Preparing to unpack .../209-python3-zipp_3.21.0-1_all.deb ...
Unpacking python3-zipp (3.21.0-1) ...
Selecting previously unselected package python3-setuptools.
Preparing to unpack .../210-python3-setuptools_75.8.0-1_all.deb ...
Unpacking python3-setuptools (75.8.0-1) ...
Selecting previously unselected package gobject-introspection-bin.
Preparing to unpack .../211-gobject-introspection-bin_1.84.0-1_amd64.deb ...
Unpacking gobject-introspection-bin (1.84.0-1) ...
Selecting previously unselected package libffi-dev:ppc64el.
Preparing to unpack .../212-libffi-dev_3.4.7-1_ppc64el.deb ...
Unpacking libffi-dev:ppc64el (3.4.7-1) ...
Selecting previously unselected package libuuid1:ppc64el.
Preparing to unpack .../213-libuuid1_2.40.4-5_ppc64el.deb ...
Unpacking libuuid1:ppc64el (2.40.4-5) ...
Selecting previously unselected package uuid-dev:ppc64el.
Preparing to unpack .../214-uuid-dev_2.40.4-5_ppc64el.deb ...
Unpacking uuid-dev:ppc64el (2.40.4-5) ...
Selecting previously unselected package libblkid-dev:ppc64el.
Preparing to unpack .../215-libblkid-dev_2.40.4-5_ppc64el.deb ...
Unpacking libblkid-dev:ppc64el (2.40.4-5) ...
Selecting previously unselected package libsepol2:ppc64el.
Preparing to unpack .../216-libsepol2_3.8.1-1_ppc64el.deb ...
Unpacking libsepol2:ppc64el (3.8.1-1) ...
Selecting previously unselected package libsepol-dev:ppc64el.
Preparing to unpack .../217-libsepol-dev_3.8.1-1_ppc64el.deb ...
Unpacking libsepol-dev:ppc64el (3.8.1-1) ...
Selecting previously unselected package libpcre2-16-0:ppc64el.
Preparing to unpack .../218-libpcre2-16-0_10.45-1_ppc64el.deb ...
Unpacking libpcre2-16-0:ppc64el (10.45-1) ...
Selecting previously unselected package libpcre2-32-0:ppc64el.
Preparing to unpack .../219-libpcre2-32-0_10.45-1_ppc64el.deb ...
Unpacking libpcre2-32-0:ppc64el (10.45-1) ...
Selecting previously unselected package libpcre2-posix3:ppc64el.
Preparing to unpack .../220-libpcre2-posix3_10.45-1_ppc64el.deb ...
Unpacking libpcre2-posix3:ppc64el (10.45-1) ...
Selecting previously unselected package libpcre2-dev:ppc64el.
Preparing to unpack .../221-libpcre2-dev_10.45-1_ppc64el.deb ...
Unpacking libpcre2-dev:ppc64el (10.45-1) ...
Selecting previously unselected package libselinux1-dev:ppc64el.
Preparing to unpack .../222-libselinux1-dev_3.8.1-1_ppc64el.deb ...
Unpacking libselinux1-dev:ppc64el (3.8.1-1) ...
Selecting previously unselected package libmount-dev:ppc64el.
Preparing to unpack .../223-libmount-dev_2.40.4-5_ppc64el.deb ...
Unpacking libmount-dev:ppc64el (2.40.4-5) ...
Selecting previously unselected package libsysprof-capture-4-dev:ppc64el.
Preparing to unpack .../224-libsysprof-capture-4-dev_48.0-2_ppc64el.deb ...
Unpacking libsysprof-capture-4-dev:ppc64el (48.0-2) ...
Selecting previously unselected package libpkgconf3:amd64.
Preparing to unpack .../225-libpkgconf3_1.8.1-4_amd64.deb ...
Unpacking libpkgconf3:amd64 (1.8.1-4) ...
Selecting previously unselected package pkgconf-bin.
Preparing to unpack .../226-pkgconf-bin_1.8.1-4_amd64.deb ...
Unpacking pkgconf-bin (1.8.1-4) ...
Selecting previously unselected package pkgconf:ppc64el.
Preparing to unpack .../227-pkgconf_1.8.1-4_ppc64el.deb ...
Unpacking pkgconf:ppc64el (1.8.1-4) ...
Selecting previously unselected package zlib1g-dev:ppc64el.
Preparing to unpack .../228-zlib1g-dev_1%3a1.3.dfsg+really1.3.1-1+b1_ppc64el.deb ...
Unpacking zlib1g-dev:ppc64el (1:1.3.dfsg+really1.3.1-1+b1) ...
Selecting previously unselected package libgio-2.0-dev:ppc64el.
Preparing to unpack .../229-libgio-2.0-dev_2.84.0-2_ppc64el.deb ...
Unpacking libgio-2.0-dev:ppc64el (2.84.0-2) ...
Selecting previously unselected package libglib2.0-data.
Preparing to unpack .../230-libglib2.0-data_2.84.0-2_all.deb ...
Unpacking libglib2.0-data (2.84.0-2) ...
Selecting previously unselected package libglib2.0-bin.
Preparing to unpack .../231-libglib2.0-bin_2.84.0-2_amd64.deb ...
Unpacking libglib2.0-bin (2.84.0-2) ...
Selecting previously unselected package python3-packaging.
Preparing to unpack .../232-python3-packaging_24.2-1_all.deb ...
Unpacking python3-packaging (24.2-1) ...
Selecting previously unselected package libgio-2.0-dev-bin.
Preparing to unpack .../233-libgio-2.0-dev-bin_2.84.0-2_amd64.deb ...
Unpacking libgio-2.0-dev-bin (2.84.0-2) ...
Selecting previously unselected package libglib2.0-dev-bin.
Preparing to unpack .../234-libglib2.0-dev-bin_2.84.0-2_amd64.deb ...
Unpacking libglib2.0-dev-bin (2.84.0-2) ...
Selecting previously unselected package libglib2.0-dev:ppc64el.
Preparing to unpack .../235-libglib2.0-dev_2.84.0-2_ppc64el.deb ...
Unpacking libglib2.0-dev:ppc64el (2.84.0-2) ...
Selecting previously unselected package gobject-introspection:ppc64el.
Preparing to unpack .../236-gobject-introspection_1.84.0-1_ppc64el.deb ...
Unpacking gobject-introspection:ppc64el (1.84.0-1) ...
Selecting previously unselected package libgdk-pixbuf2.0-common.
Preparing to unpack .../237-libgdk-pixbuf2.0-common_2.42.12+dfsg-2_all.deb ...
Unpacking libgdk-pixbuf2.0-common (2.42.12+dfsg-2) ...
Selecting previously unselected package shared-mime-info.
Preparing to unpack .../238-shared-mime-info_2.4-5+b2_amd64.deb ...
Unpacking shared-mime-info (2.4-5+b2) ...
Selecting previously unselected package libjpeg62-turbo:amd64.
Preparing to unpack .../239-libjpeg62-turbo_1%3a2.1.5-3.1_amd64.deb ...
Unpacking libjpeg62-turbo:amd64 (1:2.1.5-3.1) ...
Selecting previously unselected package libpng16-16t64:amd64.
Preparing to unpack .../240-libpng16-16t64_1.6.47-1.1_amd64.deb ...
Unpacking libpng16-16t64:amd64 (1.6.47-1.1) ...
Selecting previously unselected package libdeflate0:amd64.
Preparing to unpack .../241-libdeflate0_1.23-1+b1_amd64.deb ...
Unpacking libdeflate0:amd64 (1.23-1+b1) ...
Selecting previously unselected package libjbig0:amd64.
Preparing to unpack .../242-libjbig0_2.1-6.1+b2_amd64.deb ...
Unpacking libjbig0:amd64 (2.1-6.1+b2) ...
Selecting previously unselected package liblerc4:amd64.
Preparing to unpack .../243-liblerc4_4.0.0+ds-5_amd64.deb ...
Unpacking liblerc4:amd64 (4.0.0+ds-5) ...
Selecting previously unselected package libsharpyuv0:amd64.
Preparing to unpack .../244-libsharpyuv0_1.5.0-0.1_amd64.deb ...
Unpacking libsharpyuv0:amd64 (1.5.0-0.1) ...
Selecting previously unselected package libwebp7:amd64.
Preparing to unpack .../245-libwebp7_1.5.0-0.1_amd64.deb ...
Unpacking libwebp7:amd64 (1.5.0-0.1) ...
Selecting previously unselected package libtiff6:amd64.
Preparing to unpack .../246-libtiff6_4.7.0-2_amd64.deb ...
Unpacking libtiff6:amd64 (4.7.0-2) ...
Selecting previously unselected package libgdk-pixbuf-2.0-0:amd64.
Preparing to unpack .../247-libgdk-pixbuf-2.0-0_2.42.12+dfsg-2_amd64.deb ...
Unpacking libgdk-pixbuf-2.0-0:amd64 (2.42.12+dfsg-2) ...
Selecting previously unselected package gtk-update-icon-cache.
Preparing to unpack .../248-gtk-update-icon-cache_4.18.3+ds-1_amd64.deb ...
No diversion 'diversion of /usr/sbin/update-icon-caches to /usr/sbin/update-icon-caches.gtk2 by libgtk-3-bin', none removed.
No diversion 'diversion of /usr/share/man/man8/update-icon-caches.8.gz to /usr/share/man/man8/update-icon-caches.gtk2.8.gz by libgtk-3-bin', none removed.
Unpacking gtk-update-icon-cache (4.18.3+ds-1) ...
Selecting previously unselected package libicu76:amd64.
Preparing to unpack .../249-libicu76_76.1-3_amd64.deb ...
Unpacking libicu76:amd64 (76.1-3) ...
Selecting previously unselected package icu-devtools.
Preparing to unpack .../250-icu-devtools_76.1-3_amd64.deb ...
Unpacking icu-devtools (76.1-3) ...
Selecting previously unselected package python3-libxml2:amd64.
Preparing to unpack .../251-python3-libxml2_2.12.7+dfsg+really2.9.14-0.4_amd64.deb ...
Unpacking python3-libxml2:amd64 (2.12.7+dfsg+really2.9.14-0.4) ...
Selecting previously unselected package itstool.
Preparing to unpack .../252-itstool_2.0.6-4_all.deb ...
Unpacking itstool (2.0.6-4) ...
Selecting previously unselected package libgssrpc4t64:ppc64el.
Preparing to unpack .../253-libgssrpc4t64_1.21.3-5_ppc64el.deb ...
Unpacking libgssrpc4t64:ppc64el (1.21.3-5) ...
Selecting previously unselected package libkadm5clnt-mit12:ppc64el.
Preparing to unpack .../254-libkadm5clnt-mit12_1.21.3-5_ppc64el.deb ...
Unpacking libkadm5clnt-mit12:ppc64el (1.21.3-5) ...
Selecting previously unselected package libkdb5-10t64:ppc64el.
Preparing to unpack .../255-libkdb5-10t64_1.21.3-5_ppc64el.deb ...
Unpacking libkdb5-10t64:ppc64el (1.21.3-5) ...
Selecting previously unselected package libkadm5srv-mit12:ppc64el.
Preparing to unpack .../256-libkadm5srv-mit12_1.21.3-5_ppc64el.deb ...
Unpacking libkadm5srv-mit12:ppc64el (1.21.3-5) ...
Selecting previously unselected package krb5-multidev:ppc64el.
Preparing to unpack .../257-krb5-multidev_1.21.3-5_ppc64el.deb ...
Unpacking krb5-multidev:ppc64el (1.21.3-5) ...
Selecting previously unselected package libasan8:ppc64el.
Preparing to unpack .../258-libasan8_14.2.0-19_ppc64el.deb ...
Unpacking libasan8:ppc64el (14.2.0-19) ...
Selecting previously unselected package libbrotli-dev:ppc64el.
Preparing to unpack .../259-libbrotli-dev_1.1.0-2+b7_ppc64el.deb ...
Unpacking libbrotli-dev:ppc64el (1.1.0-2+b7) ...
Selecting previously unselected package libbz2-dev:ppc64el.
Preparing to unpack .../260-libbz2-dev_1.0.8-6_ppc64el.deb ...
Unpacking libbz2-dev:ppc64el (1.0.8-6) ...
Selecting previously unselected package liblzo2-2:ppc64el.
Preparing to unpack .../261-liblzo2-2_2.10-3+b1_ppc64el.deb ...
Unpacking liblzo2-2:ppc64el (2.10-3+b1) ...
Selecting previously unselected package libcairo-script-interpreter2:ppc64el.
Preparing to unpack .../262-libcairo-script-interpreter2_1.18.4-1+b1_ppc64el.deb ...
Unpacking libcairo-script-interpreter2:ppc64el (1.18.4-1+b1) ...
Selecting previously unselected package libexpat1-dev:ppc64el.
Preparing to unpack .../263-libexpat1-dev_2.7.1-1_ppc64el.deb ...
Unpacking libexpat1-dev:ppc64el (2.7.1-1) ...
Selecting previously unselected package libpng-dev:ppc64el.
Preparing to unpack .../264-libpng-dev_1.6.47-1.1_ppc64el.deb ...
Unpacking libpng-dev:ppc64el (1.6.47-1.1) ...
Selecting previously unselected package libfreetype-dev:ppc64el.
Preparing to unpack .../265-libfreetype-dev_2.13.3+dfsg-1_ppc64el.deb ...
Unpacking libfreetype-dev:ppc64el (2.13.3+dfsg-1) ...
Selecting previously unselected package libfontconfig-dev:ppc64el.
Preparing to unpack .../266-libfontconfig-dev_2.15.0-2.2_ppc64el.deb ...
Unpacking libfontconfig-dev:ppc64el (2.15.0-2.2) ...
Selecting previously unselected package libpixman-1-dev:ppc64el.
Preparing to unpack .../267-libpixman-1-dev_0.44.0-3_ppc64el.deb ...
Unpacking libpixman-1-dev:ppc64el (0.44.0-3) ...
Selecting previously unselected package x11-common.
Preparing to unpack .../268-x11-common_1%3a7.7+24_all.deb ...
Unpacking x11-common (1:7.7+24) ...
Selecting previously unselected package libice6:ppc64el.
Preparing to unpack .../269-libice6_2%3a1.1.1-1_ppc64el.deb ...
Unpacking libice6:ppc64el (2:1.1.1-1) ...
Selecting previously unselected package libsm6:ppc64el.
Preparing to unpack .../270-libsm6_2%3a1.2.6-1_ppc64el.deb ...
Unpacking libsm6:ppc64el (2:1.2.6-1) ...
Selecting previously unselected package xorg-sgml-doctools.
Preparing to unpack .../271-xorg-sgml-doctools_1%3a1.11-1.1_all.deb ...
Unpacking xorg-sgml-doctools (1:1.11-1.1) ...
Selecting previously unselected package x11proto-dev.
Preparing to unpack .../272-x11proto-dev_2024.1-1_all.deb ...
Unpacking x11proto-dev (2024.1-1) ...
Selecting previously unselected package libice-dev:ppc64el.
Preparing to unpack .../273-libice-dev_2%3a1.1.1-1_ppc64el.deb ...
Unpacking libice-dev:ppc64el (2:1.1.1-1) ...
Selecting previously unselected package libsm-dev:ppc64el.
Preparing to unpack .../274-libsm-dev_2%3a1.2.6-1_ppc64el.deb ...
Unpacking libsm-dev:ppc64el (2:1.2.6-1) ...
Selecting previously unselected package libxau-dev:ppc64el.
Preparing to unpack .../275-libxau-dev_1%3a1.0.11-1_ppc64el.deb ...
Unpacking libxau-dev:ppc64el (1:1.0.11-1) ...
Selecting previously unselected package libxdmcp-dev:ppc64el.
Preparing to unpack .../276-libxdmcp-dev_1%3a1.1.5-1_ppc64el.deb ...
Unpacking libxdmcp-dev:ppc64el (1:1.1.5-1) ...
Selecting previously unselected package xtrans-dev.
Preparing to unpack .../277-xtrans-dev_1.4.0-1_all.deb ...
Unpacking xtrans-dev (1.4.0-1) ...
Selecting previously unselected package libxcb1-dev:ppc64el.
Preparing to unpack .../278-libxcb1-dev_1.17.0-2+b1_ppc64el.deb ...
Unpacking libxcb1-dev:ppc64el (1.17.0-2+b1) ...
Selecting previously unselected package libx11-dev:ppc64el.
Preparing to unpack .../279-libx11-dev_2%3a1.8.12-1_ppc64el.deb ...
Unpacking libx11-dev:ppc64el (2:1.8.12-1) ...
Selecting previously unselected package libxcb-render0-dev:ppc64el.
Preparing to unpack .../280-libxcb-render0-dev_1.17.0-2+b1_ppc64el.deb ...
Unpacking libxcb-render0-dev:ppc64el (1.17.0-2+b1) ...
Selecting previously unselected package libxcb-shm0-dev:ppc64el.
Preparing to unpack .../281-libxcb-shm0-dev_1.17.0-2+b1_ppc64el.deb ...
Unpacking libxcb-shm0-dev:ppc64el (1.17.0-2+b1) ...
Selecting previously unselected package libxext-dev:ppc64el.
Preparing to unpack .../282-libxext-dev_2%3a1.3.4-1+b3_ppc64el.deb ...
Unpacking libxext-dev:ppc64el (2:1.3.4-1+b3) ...
Selecting previously unselected package libxrender-dev:ppc64el.
Preparing to unpack .../283-libxrender-dev_1%3a0.9.12-1_ppc64el.deb ...
Unpacking libxrender-dev:ppc64el (1:0.9.12-1) ...
Selecting previously unselected package libcairo2-dev:ppc64el.
Preparing to unpack .../284-libcairo2-dev_1.18.4-1+b1_ppc64el.deb ...
Unpacking libcairo2-dev:ppc64el (1.18.4-1+b1) ...
Selecting previously unselected package libcap-dev:ppc64el.
Preparing to unpack .../285-libcap-dev_1%3a2.75-4_ppc64el.deb ...
Unpacking libcap-dev:ppc64el (1:2.75-4) ...
Selecting previously unselected package libsystemd-dev:ppc64el.
Preparing to unpack .../286-libsystemd-dev_257.4-7_ppc64el.deb ...
Unpacking libsystemd-dev:ppc64el (257.4-7) ...
Selecting previously unselected package xml-core.
Preparing to unpack .../287-xml-core_0.19_all.deb ...
Unpacking xml-core (0.19) ...
Selecting previously unselected package libdbus-1-dev:ppc64el.
Preparing to unpack .../288-libdbus-1-dev_1.16.2-2_ppc64el.deb ...
Unpacking libdbus-1-dev:ppc64el (1.16.2-2) ...
Selecting previously unselected package libdbus-glib-1-2:amd64.
Preparing to unpack .../289-libdbus-glib-1-2_0.114-1_amd64.deb ...
Unpacking libdbus-glib-1-2:amd64 (0.114-1) ...
Selecting previously unselected package libdbus-glib-1-dev-bin.
Preparing to unpack .../290-libdbus-glib-1-dev-bin_0.114-1_amd64.deb ...
Unpacking libdbus-glib-1-dev-bin (0.114-1) ...
Selecting previously unselected package libdbus-glib-1-dev:ppc64el.
Preparing to unpack .../291-libdbus-glib-1-dev_0.114-1_ppc64el.deb ...
Unpacking libdbus-glib-1-dev:ppc64el (0.114-1) ...
Selecting previously unselected package libgomp1:ppc64el.
Preparing to unpack .../292-libgomp1_14.2.0-19_ppc64el.deb ...
Unpacking libgomp1:ppc64el (14.2.0-19) ...
Selecting previously unselected package libitm1:ppc64el.
Preparing to unpack .../293-libitm1_14.2.0-19_ppc64el.deb ...
Unpacking libitm1:ppc64el (14.2.0-19) ...
Selecting previously unselected package liblsan0:ppc64el.
Preparing to unpack .../294-liblsan0_14.2.0-19_ppc64el.deb ...
Unpacking liblsan0:ppc64el (14.2.0-19) ...
Selecting previously unselected package libtsan2:ppc64el.
Preparing to unpack .../295-libtsan2_14.2.0-19_ppc64el.deb ...
Unpacking libtsan2:ppc64el (14.2.0-19) ...
Selecting previously unselected package libubsan1:ppc64el.
Preparing to unpack .../296-libubsan1_14.2.0-19_ppc64el.deb ...
Unpacking libubsan1:ppc64el (14.2.0-19) ...
Selecting previously unselected package libquadmath0:ppc64el.
Preparing to unpack .../297-libquadmath0_14.2.0-19_ppc64el.deb ...
Unpacking libquadmath0:ppc64el (14.2.0-19) ...
Selecting previously unselected package libgcc-14-dev:ppc64el.
Preparing to unpack .../298-libgcc-14-dev_14.2.0-19_ppc64el.deb ...
Unpacking libgcc-14-dev:ppc64el (14.2.0-19) ...
Selecting previously unselected package libgirepository-1.0-dev:ppc64el.
Preparing to unpack .../299-libgirepository-1.0-dev_1.84.0-1_ppc64el.deb ...
Unpacking libgirepository-1.0-dev:ppc64el (1.84.0-1) ...
Selecting previously unselected package libgirepository1.0-dev:ppc64el.
Preparing to unpack .../300-libgirepository1.0-dev_1.84.0-1_ppc64el.deb ...
Unpacking libgirepository1.0-dev:ppc64el (1.84.0-1) ...
Selecting previously unselected package libmozjs-128-0:ppc64el.
Preparing to unpack .../301-libmozjs-128-0_128.8.0-1_ppc64el.deb ...
Unpacking libmozjs-128-0:ppc64el (128.8.0-1) ...
Selecting previously unselected package libtinfo6:ppc64el.
Preparing to unpack .../302-libtinfo6_6.5+20250216-2_ppc64el.deb ...
Unpacking libtinfo6:ppc64el (6.5+20250216-2) ...
Selecting previously unselected package libreadline8t64:ppc64el.
Preparing to unpack .../303-libreadline8t64_8.2-6_ppc64el.deb ...
Adding 'diversion of /lib/powerpc64le-linux-gnu/libhistory.so.8 to /lib/powerpc64le-linux-gnu/libhistory.so.8.usr-is-merged by libreadline8t64'
Adding 'diversion of /lib/powerpc64le-linux-gnu/libhistory.so.8.2 to /lib/powerpc64le-linux-gnu/libhistory.so.8.2.usr-is-merged by libreadline8t64'
Adding 'diversion of /lib/powerpc64le-linux-gnu/libreadline.so.8 to /lib/powerpc64le-linux-gnu/libreadline.so.8.usr-is-merged by libreadline8t64'
Adding 'diversion of /lib/powerpc64le-linux-gnu/libreadline.so.8.2 to /lib/powerpc64le-linux-gnu/libreadline.so.8.2.usr-is-merged by libreadline8t64'
Unpacking libreadline8t64:ppc64el (8.2-6) ...
Selecting previously unselected package libgjs0g:ppc64el.
Preparing to unpack .../304-libgjs0g_1.82.1-1_ppc64el.deb ...
Unpacking libgjs0g:ppc64el (1.82.1-1) ...
Selecting previously unselected package libmozjs-128-dev:ppc64el.
Preparing to unpack .../305-libmozjs-128-dev_128.8.0-1_ppc64el.deb ...
Unpacking libmozjs-128-dev:ppc64el (128.8.0-1) ...
Selecting previously unselected package libgjs-dev:ppc64el.
Preparing to unpack .../306-libgjs-dev_1.82.1-1_ppc64el.deb ...
Unpacking libgjs-dev:ppc64el (1.82.1-1) ...
Selecting previously unselected package libicu-dev:ppc64el.
Preparing to unpack .../307-libicu-dev_76.1-3_ppc64el.deb ...
Unpacking libicu-dev:ppc64el (76.1-3) ...
Selecting previously unselected package libjson-glib-dev:ppc64el.
Preparing to unpack .../308-libjson-glib-dev_1.10.6+ds-2_ppc64el.deb ...
Unpacking libjson-glib-dev:ppc64el (1.10.6+ds-2) ...
Selecting previously unselected package libkrb5-dev:ppc64el.
Preparing to unpack .../309-libkrb5-dev_1.21.3-5_ppc64el.deb ...
Unpacking libkrb5-dev:ppc64el (1.21.3-5) ...
Selecting previously unselected package libnghttp2-dev:ppc64el.
Preparing to unpack .../310-libnghttp2-dev_1.64.0-1_ppc64el.deb ...
Unpacking libnghttp2-dev:ppc64el (1.64.0-1) ...
Selecting previously unselected package libpsl-dev:ppc64el.
Preparing to unpack .../311-libpsl-dev_0.21.2-1.1+b1_ppc64el.deb ...
Unpacking libpsl-dev:ppc64el (0.21.2-1.1+b1) ...
Selecting previously unselected package libsqlite3-dev:ppc64el.
Preparing to unpack .../312-libsqlite3-dev_3.46.1-2_ppc64el.deb ...
Unpacking libsqlite3-dev:ppc64el (3.46.1-2) ...
Selecting previously unselected package libsoup-3.0-dev:ppc64el.
Preparing to unpack .../313-libsoup-3.0-dev_3.6.5-1_ppc64el.deb ...
Unpacking libsoup-3.0-dev:ppc64el (3.6.5-1) ...
Selecting previously unselected package libstdc++-14-dev:ppc64el.
Preparing to unpack .../314-libstdc++-14-dev_14.2.0-19_ppc64el.deb ...
Unpacking libstdc++-14-dev:ppc64el (14.2.0-19) ...
Selecting previously unselected package libtelepathy-glib-dev:ppc64el.
Preparing to unpack .../315-libtelepathy-glib-dev_0.24.2-2_ppc64el.deb ...
Unpacking libtelepathy-glib-dev:ppc64el (0.24.2-2) ...
Selecting previously unselected package libxml2-dev:ppc64el.
Preparing to unpack .../316-libxml2-dev_2.12.7+dfsg+really2.9.14-0.4_ppc64el.deb ...
Unpacking libxml2-dev:ppc64el (2.12.7+dfsg+really2.9.14-0.4) ...
Selecting previously unselected package libtinysparql-dev:ppc64el.
Preparing to unpack .../317-libtinysparql-dev_3.8.2-7_ppc64el.deb ...
Unpacking libtinysparql-dev:ppc64el (3.8.2-7) ...
Selecting previously unselected package libtracker-sparql-3.0-dev:ppc64el.
Preparing to unpack .../318-libtracker-sparql-3.0-dev_3.8.2-7_ppc64el.deb ...
Unpacking libtracker-sparql-3.0-dev:ppc64el (3.8.2-7) ...
Selecting previously unselected package libxml2-utils.
Preparing to unpack .../319-libxml2-utils_2.12.7+dfsg+really2.9.14-0.4_amd64.deb ...
Unpacking libxml2-utils (2.12.7+dfsg+really2.9.14-0.4) ...
Selecting previously unselected package ninja-build.
Preparing to unpack .../320-ninja-build_1.12.1-1_amd64.deb ...
Unpacking ninja-build (1.12.1-1) ...
Selecting previously unselected package meson.
Preparing to unpack .../321-meson_1.7.0-1_all.deb ...
Unpacking meson (1.7.0-1) ...
Selecting previously unselected package sbuild-build-depends-main-dummy:ppc64el.
Preparing to unpack .../322-sbuild-build-depends-main-dummy_0.invalid.0_ppc64el.deb ...
Unpacking sbuild-build-depends-main-dummy:ppc64el (0.invalid.0) ...
Setting up media-types (13.0.0) ...
Setting up libpipeline1:amd64 (1.5.8-1) ...
Setting up libsharpyuv0:amd64 (1.5.0-0.1) ...
Setting up systemd-sysv (257.4-7) ...
Setting up libkeyutils1:amd64 (1.6.3-4) ...
Setting up native-architecture (0.2.6) ...
Setting up liblerc4:amd64 (4.0.0+ds-5) ...
Setting up bsdextrautils (2.40.4-5) ...
Setting up gcc-14-powerpc64le-linux-gnu-base:amd64 (14.2.0-19cross1) ...
Setting up libmagic-mgc (1:5.46-4) ...
Setting up gcc-14-base:ppc64el (14.2.0-19) ...
Setting up libarchive-zip-perl (1.68-1) ...
Setting up libc6-ppc64el-cross (2.41-6cross2) ...
Setting up libdebhelper-perl (13.24.2) ...
Setting up libbrotli1:amd64 (1.1.0-2+b7) ...
Setting up libsqlite3-0:amd64 (3.46.1-2) ...
Setting up libgdk-pixbuf2.0-common (2.42.12+dfsg-2) ...
Setting up libmagic1t64:amd64 (1:5.46-4) ...
Setting up x11-common (1:7.7+24) ...
Running in chroot, ignoring request.
Setting up libnghttp2-14:amd64 (1.64.0-1) ...
Setting up libdeflate0:amd64 (1.23-1+b1) ...
Setting up gettext-base (0.23.1-1) ...
Setting up m4 (1.4.19-7) ...
Setting up gcc-14-cross-base (14.2.0-19cross1) ...
Setting up libcom-err2:amd64 (1.47.2-1+b1) ...
Setting up file (1:5.46-4) ...
Setting up libsoup-3.0-common (3.6.5-1) ...
Setting up libgomp1-ppc64el-cross (14.2.0-19cross1) ...
Setting up libjbig0:amd64 (2.1-6.1+b2) ...
Setting up libfakeroot:amd64 (1.37.1.1-1) ...
Setting up ninja-build (1.12.1-1) ...
Setting up libelf1t64:amd64 (0.192-4) ...
Setting up libkrb5support0:amd64 (1.21.3-5) ...
Setting up libsasl2-modules-db:amd64 (2.1.28+dfsg1-9) ...
Setting up fakeroot (1.37.1.1-1) ...
update-alternatives: using /usr/bin/fakeroot-sysv to provide /usr/bin/fakeroot (fakeroot) in auto mode
Setting up libsysprof-capture-4-dev:ppc64el (48.0-2) ...
Setting up xtrans-dev (1.4.0-1) ...
Setting up autotools-dev (20240727.1) ...
Setting up libglib2.0-data (2.84.0-2) ...
Setting up libpkgconf3:amd64 (1.8.1-4) ...
Setting up libjpeg62-turbo:amd64 (1:2.1.5-3.1) ...
Setting up libx11-data (2:1.8.12-1) ...
Setting up qemu-user (1:10.0.0~rc1+ds-2) ...
Setting up libdbus-1-3:amd64 (1.16.2-2) ...
Setting up libproc2-0:amd64 (2:4.0.4-7) ...
Setting up libunistring5:amd64 (1.3-2) ...
Setting up fonts-dejavu-mono (2.37-8) ...
Setting up libpng16-16t64:amd64 (1.6.47-1.1) ...
Setting up autopoint (0.23.1-1) ...
Setting up fonts-dejavu-core (2.37-8) ...
Setting up pkgconf-bin (1.8.1-4) ...
Setting up cpp-14-powerpc64le-linux-gnu (14.2.0-19cross1) ...
Setting up libncursesw6:amd64 (6.5+20250216-2) ...
Setting up libk5crypto3:amd64 (1.21.3-5) ...
Setting up libsasl2-2:amd64 (2.1.28+dfsg1-9) ...
Setting up autoconf (2.72-3) ...
Setting up libnghttp3-9:amd64 (1.8.0-1) ...
Setting up libitm1-ppc64el-cross (14.2.0-19cross1) ...
Setting up libwebp7:amd64 (1.5.0-0.1) ...
Setting up libffi8:amd64 (3.4.7-1) ...
Setting up libatomic1-ppc64el-cross (14.2.0-19cross1) ...
Setting up dwz (0.15-1+b1) ...
Setting up sensible-utils (0.0.24) ...
Setting up libduktape207:amd64 (2.7.0-2+b2) ...
Setting up libtiff6:amd64 (4.7.0-2) ...
Setting up dbus-session-bus-common (1.16.2-2) ...
Setting up libuchardet0:amd64 (0.0.8-1+b2) ...
Setting up linux-libc-dev-ppc64el-cross (6.12.17-1cross2) ...
Setting up procps (2:4.0.4-7) ...
Setting up libtasn1-6:amd64 (4.20.0-2) ...
Setting up xorg-sgml-doctools (1:1.11-1.1) ...
Setting up netbase (6.5) ...
Setting up libngtcp2-16:amd64 (1.11.0-1) ...
Setting up libjson-glib-1.0-common (1.10.6+ds-2) ...
Setting up sgml-base (1.31) ...
Setting up libgcc-s1-ppc64el-cross (14.2.0-19cross1) ...
Setting up libkrb5-3:amd64 (1.21.3-5) ...
Setting up libicu76:amd64 (76.1-3) ...
Setting up libssh2-1t64:amd64 (1.11.1-1) ...
Setting up binutils-powerpc64le-linux-gnu (2.44-3) ...
Setting up glib-networking-common (2.80.1-1) ...
Setting up dbus-system-bus-common (1.16.2-2) ...
Setting up readline-common (8.2-6) ...
Setting up libxml2:amd64 (2.12.7+dfsg+really2.9.14-0.4) ...
Setting up libldap2:amd64 (2.6.9+dfsg-2) ...
Setting up dbus-bin (1.16.2-2) ...
Setting up cpp-powerpc64le-linux-gnu (4:14.2.0-1) ...
Setting up automake (1:1.17-4) ...
update-alternatives: using /usr/bin/automake-1.17 to provide /usr/bin/automake (automake) in auto mode
Setting up x11proto-dev (2024.1-1) ...
Setting up libfile-stripnondeterminism-perl (1.14.1-2) ...
Setting up gettext (0.23.1-1) ...
Setting up libc6-dev-ppc64el-cross (2.41-6cross2) ...
Setting up libtool (2.5.4-4) ...
Setting up libquadmath0-ppc64el-cross (14.2.0-19cross1) ...
Setting up fontconfig-config (2.15.0-2.2) ...
Setting up libasan8-ppc64el-cross (14.2.0-19cross1) ...
Setting up libidn2-0:amd64 (2.3.8-2) ...
Setting up dbus-daemon (1.16.2-2) ...
Setting up liblsan0-ppc64el-cross (14.2.0-19cross1) ...
Setting up pkgconf:ppc64el (1.8.1-4) ...
Setting up intltool-debian (0.35.0+20060710.6) ...
Setting up libtsan2-ppc64el-cross (14.2.0-19cross1) ...
Setting up dh-autoreconf (20) ...
Setting up libglib2.0-0t64:amd64 (2.84.0-2) ...
Setting up libdbus-glib-1-2:amd64 (0.114-1) ...
Setting up dbus (1.16.2-2) ...
Running in chroot, ignoring request.
Setting up shared-mime-info (2.4-5+b2) ...
Setting up libp11-kit0:amd64 (0.25.5-3) ...
Setting up libgssapi-krb5-2:amd64 (1.21.3-5) ...
Setting up icu-devtools (76.1-3) ...
Setting up libstdc++6-ppc64el-cross (14.2.0-19cross1) ...
Setting up libreadline8t64:amd64 (8.2-6) ...
Setting up dh-strip-nondeterminism (1.14.1-2) ...
Setting up groff-base (1.23.0-7) ...
Setting up xml-core (0.19) ...
Setting up libpam-systemd:amd64 (257.4-7) ...
Setting up libgirepository-1.0-1:amd64 (1.84.0-1) ...
Setting up libgdk-pixbuf-2.0-0:amd64 (2.42.12+dfsg-2) ...
Setting up libxml2-utils (2.12.7+dfsg+really2.9.14-0.4) ...
Setting up libpython3.13-stdlib:amd64 (3.13.2-3) ...
Setting up libpython3-stdlib:amd64 (3.13.2-2) ...
Setting up libgnutls30t64:amd64 (3.8.9-2) ...
Setting up gtk-update-icon-cache (4.18.3+ds-1) ...
Setting up desktop-file-utils (0.28-1) ...
Setting up python3.13 (3.13.2-3) ...
Setting up libgirepository-2.0-0:amd64 (2.84.0-2) ...
Setting up libubsan1-ppc64el-cross (14.2.0-19cross1) ...
Setting up po-debconf (1.0.21+nmu1) ...
Setting up libdbus-glib-1-dev-bin (0.114-1) ...
Setting up libpsl5t64:amd64 (0.21.2-1.1+b1) ...
Setting up libglib2.0-bin (2.84.0-2) ...
Setting up python3 (3.13.2-2) ...
Setting up python3-zipp (3.21.0-1) ...
Setting up python3-autocommand (2.2.2-3) ...
Setting up man-db (2.13.0-1) ...
Not building database; man-db/auto-update is not 'true'.
Created symlink '/etc/systemd/system/timers.target.wants/man-db.timer' → '/usr/lib/systemd/system/man-db.timer'.
Setting up python3-markupsafe (2.1.5-1+b3) ...
Setting up libdconf1:amd64 (0.40.0-5) ...
Setting up python3-libxml2:amd64 (2.12.7+dfsg+really2.9.14-0.4) ...
Setting up dbus-user-session (1.16.2-2) ...
Setting up python3-packaging (24.2-1) ...
Setting up librtmp1:amd64 (2.4+20151223.gitfa8646d.1-2+b5) ...
Setting up python3-markdown (3.7-2) ...
Setting up libgcc-14-dev-ppc64el-cross (14.2.0-19cross1) ...
Setting up python3-typing-extensions (4.12.2-2) ...
Setting up libstdc++-14-dev-ppc64el-cross (14.2.0-19cross1) ...
Setting up libngtcp2-crypto-gnutls8:amd64 (1.11.0-1) ...
Setting up python3-mako (1.3.8-2) ...
Setting up gcc-14-powerpc64le-linux-gnu (14.2.0-19cross1) ...
Setting up python3-more-itertools (10.6.0-1) ...
Setting up libgio-2.0-dev-bin (2.84.0-2) ...
Setting up girepository-tools:amd64 (2.84.0-2) ...
Setting up python3-jaraco.functools (4.1.0-1) ...
Setting up g++-14-powerpc64le-linux-gnu (14.2.0-19cross1) ...
Setting up python3-jaraco.context (6.0.1-1) ...
Setting up itstool (2.0.6-4) ...
Setting up python3-typeguard (4.4.2-1) ...
Setting up libcurl3t64-gnutls:amd64 (8.13.0~rc3-1) ...
Setting up debhelper (13.24.2) ...
Setting up dconf-service (0.40.0-5) ...
Setting up python3-inflect (7.3.1-2) ...
Setting up gcc-powerpc64le-linux-gnu (4:14.2.0-1) ...
Setting up python3-jaraco.text (4.0.0-1) ...
Setting up g++-powerpc64le-linux-gnu (4:14.2.0-1) ...
Setting up python3-pkg-resources (75.8.0-1) ...
Setting up libglib2.0-dev-bin (2.84.0-2) ...
Setting up libproxy1v5:amd64 (0.5.9-1) ...
Setting up python3-setuptools (75.8.0-1) ...
Setting up dconf-gsettings-backend:amd64 (0.40.0-5) ...
Setting up gobject-introspection-bin (1.84.0-1) ...
Setting up meson (1.7.0-1) ...
Setting up crossbuild-essential-ppc64el (12.12) ...
Setting up gsettings-desktop-schemas (48.0-1) ...
Setting up glib-networking-services (2.80.1-1) ...
Setting up libgcc-s1:ppc64el (14.2.0-19) ...
Setting up libc6:ppc64el (2.41-6) ...
Setting up libnghttp3-9:ppc64el (1.8.0-1) ...
Setting up libdb5.3t64:ppc64el (5.3.28+dfsg2-9) ...
Setting up libffi8:ppc64el (3.4.7-1) ...
Setting up libduktape207:ppc64el (2.7.0-2+b2) ...
Setting up libasan8:ppc64el (14.2.0-19) ...
Setting up libtasn1-6:ppc64el (4.20.0-2) ...
Setting up libngtcp2-16:ppc64el (1.11.0-1) ...
Setting up libstemmer0d:ppc64el (2.2.0-4+b2) ...
Setting up libtsan2:ppc64el (14.2.0-19) ...
Setting up libbz2-1.0:ppc64el (1.0.8-6) ...
Setting up libblkid1:ppc64el (2.40.4-5) ...
Setting up libstdc++6:ppc64el (14.2.0-19) ...
Setting up liblsan0:ppc64el (14.2.0-19) ...
Setting up libitm1:ppc64el (14.2.0-19) ...
Setting up libtinfo6:ppc64el (6.5+20250216-2) ...
Setting up libexpat1:ppc64el (2.7.1-1) ...
Setting up libpixman-1-0:ppc64el (0.44.0-3) ...
Setting up libzstd1:ppc64el (1.5.7+dfsg-1) ...
Setting up libice6:ppc64el (2:1.1.1-1) ...
Setting up libxau6:ppc64el (1:1.0.11-1) ...
Setting up libxdmcp6:ppc64el (1:1.1.5-1) ...
Setting up libkeyutils1:ppc64el (1.6.3-4) ...
Setting up libxcb1:ppc64el (1.17.0-2+b1) ...
Setting up libpixman-1-dev:ppc64el (0.44.0-3) ...
Setting up libxau-dev:ppc64el (1:1.0.11-1) ...
Setting up liblzma5:ppc64el (5.6.4-1) ...
Setting up libice-dev:ppc64el (2:1.1.1-1) ...
Setting up libxcb-render0:ppc64el (1.17.0-2+b1) ...
Setting up libbrotli1:ppc64el (1.1.0-2+b7) ...
Setting up libsqlite3-0:ppc64el (3.46.1-2) ...
Setting up libnghttp2-14:ppc64el (1.64.0-1) ...
Setting up liblzo2-2:ppc64el (2.10-3+b1) ...
Setting up zlib1g:ppc64el (1:1.3.dfsg+really1.3.1-1+b1) ...
Setting up libcrypt1:ppc64el (1:4.4.38-1) ...
Setting up libxcb-shm0:ppc64el (1.17.0-2+b1) ...
Setting up libcom-err2:ppc64el (1.47.2-1+b1) ...
Setting up libgomp1:ppc64el (14.2.0-19) ...
Setting up libffi-dev:ppc64el (3.4.7-1) ...
Setting up libpcre2-16-0:ppc64el (10.45-1) ...
Setting up libcap2:ppc64el (1:2.75-4) ...
Setting up libkrb5support0:ppc64el (1.21.3-5) ...
Setting up libsasl2-modules-db:ppc64el (2.1.28+dfsg1-9) ...
Setting up libxdmcp-dev:ppc64el (1:1.1.5-1) ...
Setting up libnettle8t64:ppc64el (3.10.1-1) ...
Setting up libpcre2-32-0:ppc64el (10.45-1) ...
Setting up libgmp10:ppc64el (2:6.3.0+dfsg-3) ...
Setting up libquadmath0:ppc64el (14.2.0-19) ...
Setting up libp11-kit0:ppc64el (0.25.5-3) ...
Setting up libunistring5:ppc64el (1.3-2) ...
Setting up libpng16-16t64:ppc64el (1.6.47-1.1) ...
Setting up libatomic1:ppc64el (14.2.0-19) ...
Setting up libuuid1:ppc64el (2.40.4-5) ...
Setting up libsepol2:ppc64el (3.8.1-1) ...
Setting up libsepol-dev:ppc64el (3.8.1-1) ...
Setting up libmozjs-128-0:ppc64el (128.8.0-1) ...
Setting up libpcre2-8-0:ppc64el (10.45-1) ...
Setting up cross-exe-wrapper:ppc64el (0.2.6) ...
Setting up libk5crypto3:ppc64el (1.21.3-5) ...
Setting up libreadline8t64:ppc64el (8.2-6) ...
Setting up libubsan1:ppc64el (14.2.0-19) ...
Setting up libmozjs-128-dev:ppc64el (128.8.0-1) ...
Setting up libpcre2-posix3:ppc64el (10.45-1) ...
Setting up libhogweed6t64:ppc64el (3.10.1-1) ...
Setting up libcrypt-dev:ppc64el (1:4.4.38-1) ...
Setting up libc6-dev:ppc64el (2.41-6) ...
Setting up libx11-6:ppc64el (2:1.8.12-1) ...
Setting up libicu76:ppc64el (76.1-3) ...
Setting up libgcc-14-dev:ppc64el (14.2.0-19) ...
Setting up libcap-dev:ppc64el (1:2.75-4) ...
Setting up libstdc++-14-dev:ppc64el (14.2.0-19) ...
Setting up libsm6:ppc64el (2:1.2.6-1) ...
Setting up libicu-dev:ppc64el (76.1-3) ...
Setting up libxml2:ppc64el (2.12.7+dfsg+really2.9.14-0.4) ...
Setting up libbrotli-dev:ppc64el (1.1.0-2+b7) ...
Setting up libbz2-dev:ppc64el (1.0.8-6) ...
Setting up libnghttp2-dev:ppc64el (1.64.0-1) ...
Setting up libxcb1-dev:ppc64el (1.17.0-2+b1) ...
Setting up libpcre2-dev:ppc64el (10.45-1) ...
Setting up libxrender1:ppc64el (1:0.9.12-1) ...
Setting up libssl3t64:ppc64el (3.4.1-1) ...
Setting up libx11-dev:ppc64el (2:1.8.12-1) ...
Setting up libxext6:ppc64el (2:1.3.4-1+b3) ...
Setting up libidn2-0:ppc64el (2.3.8-2) ...
Setting up libsystemd0:ppc64el (257.4-7) ...
Setting up libselinux1:ppc64el (3.8.1-1) ...
Setting up libxcb-shm0-dev:ppc64el (1.17.0-2+b1) ...
Setting up libxml2-dev:ppc64el (2.12.7+dfsg+really2.9.14-0.4) ...
Setting up libexpat1-dev:ppc64el (2.7.1-1) ...
Setting up libsqlite3-dev:ppc64el (3.46.1-2) ...
Setting up libfreetype6:ppc64el (2.13.3+dfsg-1) ...
Setting up uuid-dev:ppc64el (2.40.4-5) ...
Setting up libdbus-1-3:ppc64el (1.16.2-2) ...
Setting up comerr-dev:ppc64el (2.1-1.47.2-1+b1) ...
Setting up libxcb-render0-dev:ppc64el (1.17.0-2+b1) ...
Setting up libsasl2-2:ppc64el (2.1.28+dfsg1-9) ...
Setting up libxext-dev:ppc64el (2:1.3.4-1+b3) ...
Setting up zlib1g-dev:ppc64el (1:1.3.dfsg+really1.3.1-1+b1) ...
Setting up libmount1:ppc64el (2.40.4-5) ...
Setting up libkrb5-3:ppc64el (1.21.3-5) ...
Setting up libfontconfig1:ppc64el (2.15.0-2.2) ...
Setting up libssh2-1t64:ppc64el (1.11.1-1) ...
Setting up libxrender-dev:ppc64el (1:0.9.12-1) ...
Setting up libldap2:ppc64el (2.6.9+dfsg-2) ...
Setting up libsystemd-dev:ppc64el (257.4-7) ...
Setting up libgnutls30t64:ppc64el (3.8.9-2) ...
Setting up libblkid-dev:ppc64el (2.40.4-5) ...
Setting up libsm-dev:ppc64el (2:1.2.6-1) ...
Setting up libselinux1-dev:ppc64el (3.8.1-1) ...
Setting up libpng-dev:ppc64el (1.6.47-1.1) ...
Setting up libpsl5t64:ppc64el (0.21.2-1.1+b1) ...
Setting up libcairo2:ppc64el (1.18.4-1+b1) ...
Setting up libpsl-dev:ppc64el (0.21.2-1.1+b1) ...
Setting up libfreetype-dev:ppc64el (2.13.3+dfsg-1) ...
Setting up libglib2.0-0t64:ppc64el (2.84.0-2) ...
/var/lib/dpkg/info/libglib2.0-0t64:ppc64el.postinst: 37: /usr/lib/powerpc64le-linux-gnu/glib-2.0/glib-compile-schemas: Exec format error
/var/lib/dpkg/info/libglib2.0-0t64:ppc64el.postinst: 38: /usr/lib/powerpc64le-linux-gnu/glib-2.0/gio-querymodules: Exec format error
Setting up librtmp1:ppc64el (2.4+20151223.gitfa8646d.1-2+b5) ...
Setting up libdbus-glib-1-2:ppc64el (0.114-1) ...
Setting up libgssapi-krb5-2:ppc64el (1.21.3-5) ...
Setting up gir1.2-glib-2.0:ppc64el (2.84.0-2) ...
Setting up gir1.2-glib-2.0-dev:ppc64el (2.84.0-2) ...
Setting up libgirepository-1.0-1:ppc64el (1.84.0-1) ...
Setting up libcairo-gobject2:ppc64el (1.18.4-1+b1) ...
Setting up libtelepathy-glib0t64:ppc64el (0.24.2-2) ...
Setting up libmount-dev:ppc64el (2.40.4-5) ...
Setting up libngtcp2-crypto-gnutls8:ppc64el (1.11.0-1) ...
Setting up libcairo-script-interpreter2:ppc64el (1.18.4-1+b1) ...
Setting up gir1.2-freedesktop:ppc64el (1.84.0-1) ...
Setting up libgio-2.0-dev:ppc64el (2.84.0-2) ...
Setting up libgirepository-2.0-0:ppc64el (2.84.0-2) ...
Setting up libfontconfig-dev:ppc64el (2.15.0-2.2) ...
Setting up gir1.2-telepathyglib-0.12:ppc64el (0.24.2-2) ...
Setting up libcurl3t64-gnutls:ppc64el (8.13.0~rc3-1) ...
Setting up libjson-glib-1.0-0:ppc64el (1.10.6+ds-2) ...
Setting up gir1.2-girepository-2.0:ppc64el (1.84.0-1) ...
Setting up libgssrpc4t64:ppc64el (1.21.3-5) ...
Setting up gir1.2-freedesktop-dev:ppc64el (1.84.0-1) ...
Setting up gir1.2-json-1.0:ppc64el (1.10.6+ds-2) ...
Setting up libkadm5clnt-mit12:ppc64el (1.21.3-5) ...
Setting up libproxy1v5:ppc64el (0.5.9-1) ...
Setting up girepository-tools:ppc64el (2.84.0-2) ...
Setting up libgjs0g:ppc64el (1.82.1-1) ...
Setting up libkdb5-10t64:ppc64el (1.21.3-5) ...
Setting up gir1.2-girepository-2.0-dev:ppc64el (1.84.0-1) ...
Setting up libglib2.0-dev:ppc64el (2.84.0-2) ...
Setting up libkadm5srv-mit12:ppc64el (1.21.3-5) ...
Setting up libcairo2-dev:ppc64el (1.18.4-1+b1) ...
Setting up glib-networking:ppc64el (2.80.1-1) ...
Setting up krb5-multidev:ppc64el (1.21.3-5) ...
Setting up libjson-glib-dev:ppc64el (1.10.6+ds-2) ...
Setting up libsoup-3.0-0:ppc64el (3.6.5-1) ...
Setting up gobject-introspection:ppc64el (1.84.0-1) ...
Setting up libkrb5-dev:ppc64el (1.21.3-5) ...
Setting up libtinysparql-3.0-0:ppc64el (3.8.2-7) ...
Setting up gir1.2-tsparql-3.0:ppc64el (3.8.2-7) ...
Setting up gir1.2-tracker-3.0:ppc64el (3.8.2-7) ...
Setting up libgirepository-1.0-dev:ppc64el (1.84.0-1) ...
Setting up gir1.2-soup-3.0:ppc64el (3.6.5-1) ...
Setting up libsoup-3.0-dev:ppc64el (3.6.5-1) ...
Setting up libgirepository1.0-dev:ppc64el (1.84.0-1) ...
Setting up libgjs-dev:ppc64el (1.82.1-1) ...
Setting up libtinysparql-dev:ppc64el (3.8.2-7) ...
Setting up libtracker-sparql-3.0-dev:ppc64el (3.8.2-7) ...
Processing triggers for libc-bin (2.41-6) ...
Processing triggers for systemd (257.4-7) ...
Processing triggers for sgml-base (1.31) ...
Setting up libdbus-1-dev:ppc64el (1.16.2-2) ...
Setting up libdbus-glib-1-dev:ppc64el (0.114-1) ...
Setting up libtelepathy-glib-dev:ppc64el (0.24.2-2) ...
Setting up sbuild-build-depends-main-dummy:ppc64el (0.invalid.0) ...

+------------------------------------------------------------------------------+
| Check architectures                                                          |
+------------------------------------------------------------------------------+

Arch check ok (ppc64el included in any)

+------------------------------------------------------------------------------+
| Build environment                                                            |
+------------------------------------------------------------------------------+

Kernel: Linux 6.1.0-31-amd64 #1 SMP PREEMPT_DYNAMIC Debian 6.1.128-1 (2025-02-07) amd64 (x86_64)
Toolchain package versions: binutils_2.44-3 dpkg-dev_1.22.18 g++-14_14.2.0-19 gcc-14_14.2.0-19 libc6-dev_2.41-6 libstdc++-14-dev_14.2.0-19 libstdc++-14-dev-ppc64el-cross_14.2.0-19cross1 libstdc++6_14.2.0-19 libstdc++6-ppc64el-cross_14.2.0-19cross1 linux-libc-dev_6.12.20-1
Package versions: apt_2.9.35 apt-utils_2.9.35 autoconf_2.72-3 automake_1:1.17-4 autopoint_0.23.1-1 autotools-dev_20240727.1 base-files_13.7 base-passwd_3.6.7 bash_5.2.37-1.1+b2 binutils_2.44-3 binutils-common_2.44-3 binutils-powerpc64le-linux-gnu_2.44-3 binutils-x86-64-linux-gnu_2.44-3 bsdextrautils_2.40.4-5 bsdutils_1:2.40.4-5 build-essential_12.12 bzip2_1.0.8-6 comerr-dev_2.1-1.47.2-1+b1 coreutils_9.5-1+b1 cpp_4:14.2.0-1 cpp-14_14.2.0-19 cpp-14-powerpc64le-linux-gnu_14.2.0-19cross1 cpp-14-x86-64-linux-gnu_14.2.0-19 cpp-powerpc64le-linux-gnu_4:14.2.0-1 cpp-x86-64-linux-gnu_4:14.2.0-1 cross-exe-wrapper_0.2.6 crossbuild-essential-ppc64el_12.12 dash_0.5.12-12 dbus_1.16.2-2 dbus-bin_1.16.2-2 dbus-daemon_1.16.2-2 dbus-session-bus-common_1.16.2-2 dbus-system-bus-common_1.16.2-2 dbus-user-session_1.16.2-2 dconf-gsettings-backend_0.40.0-5 dconf-service_0.40.0-5 debconf_1.5.91 debhelper_13.24.2 debian-archive-keyring_2023.4 debianutils_5.21 desktop-file-utils_0.28-1 dh-autoreconf_20 dh-strip-nondeterminism_1.14.1-2 diffutils_1:3.10-3 dpkg_1.22.18 dpkg-dev_1.22.18 dwz_0.15-1+b1 fakeroot_1.37.1.1-1 file_1:5.46-4 findutils_4.10.0-3 fontconfig-config_2.15.0-2.2 fonts-dejavu-core_2.37-8 fonts-dejavu-mono_2.37-8 g++_4:14.2.0-1 g++-14_14.2.0-19 g++-14-powerpc64le-linux-gnu_14.2.0-19cross1 g++-14-x86-64-linux-gnu_14.2.0-19 g++-powerpc64le-linux-gnu_4:14.2.0-1 g++-x86-64-linux-gnu_4:14.2.0-1 gcc_4:14.2.0-1 gcc-14_14.2.0-19 gcc-14-base_14.2.0-19 gcc-14-cross-base_14.2.0-19cross1 gcc-14-powerpc64le-linux-gnu_14.2.0-19cross1 gcc-14-powerpc64le-linux-gnu-base_14.2.0-19cross1 gcc-14-x86-64-linux-gnu_14.2.0-19 gcc-powerpc64le-linux-gnu_4:14.2.0-1 gcc-x86-64-linux-gnu_4:14.2.0-1 gettext_0.23.1-1 gettext-base_0.23.1-1 gir1.2-freedesktop_1.84.0-1 gir1.2-freedesktop-dev_1.84.0-1 gir1.2-girepository-2.0_1.84.0-1 gir1.2-girepository-2.0-dev_1.84.0-1 gir1.2-glib-2.0_2.84.0-2 gir1.2-glib-2.0-dev_2.84.0-2 gir1.2-json-1.0_1.10.6+ds-2 gir1.2-soup-3.0_3.6.5-1 gir1.2-telepathyglib-0.12_0.24.2-2 gir1.2-tracker-3.0_3.8.2-7 gir1.2-tsparql-3.0_3.8.2-7 girepository-tools_2.84.0-2 glib-networking_2.80.1-1 glib-networking-common_2.80.1-1 glib-networking-services_2.80.1-1 gobject-introspection_1.84.0-1 gobject-introspection-bin_1.84.0-1 grep_3.11-4 groff-base_1.23.0-7 gsettings-desktop-schemas_48.0-1 gtk-update-icon-cache_4.18.3+ds-1 gzip_1.13-1 hostname_3.25 icu-devtools_76.1-3 init-system-helpers_1.68 intltool-debian_0.35.0+20060710.6 itstool_2.0.6-4 krb5-multidev_1.21.3-5 libacl1_2.3.2-2+b1 libapparmor1_4.1.0~beta5-5 libapt-pkg7.0_2.9.35 libarchive-zip-perl_1.68-1 libasan8_14.2.0-19 libasan8-ppc64el-cross_14.2.0-19cross1 libatomic1_14.2.0-19 libatomic1-ppc64el-cross_14.2.0-19cross1 libattr1_1:2.5.2-3 libaudit-common_1:4.0.2-2 libaudit1_1:4.0.2-2+b2 libbinutils_2.44-3 libblkid-dev_2.40.4-5 libblkid1_2.40.4-5 libbrotli-dev_1.1.0-2+b7 libbrotli1_1.1.0-2+b7 libbsd0_0.12.2-2 libbz2-1.0_1.0.8-6 libbz2-dev_1.0.8-6 libc-bin_2.41-6 libc-dev-bin_2.41-6 libc6_2.41-6 libc6-dev_2.41-6 libc6-dev-ppc64el-cross_2.41-6cross2 libc6-ppc64el-cross_2.41-6cross2 libcairo-gobject2_1.18.4-1+b1 libcairo-script-interpreter2_1.18.4-1+b1 libcairo2_1.18.4-1+b1 libcairo2-dev_1.18.4-1+b1 libcap-dev_1:2.75-4 libcap-ng0_0.8.5-4+b1 libcap2_1:2.75-4 libcc1-0_14.2.0-19 libcom-err2_1.47.2-1+b1 libcrypt-dev_1:4.4.38-1 libcrypt1_1:4.4.38-1 libctf-nobfd0_2.44-3 libctf0_2.44-3 libcurl3t64-gnutls_8.13.0~rc3-1 libdb5.3t64_5.3.28+dfsg2-9 libdbus-1-3_1.16.2-2 libdbus-1-dev_1.16.2-2 libdbus-glib-1-2_0.114-1 libdbus-glib-1-dev_0.114-1 libdbus-glib-1-dev-bin_0.114-1 libdconf1_0.40.0-5 libdebconfclient0_0.277 libdebhelper-perl_13.24.2 libdeflate0_1.23-1+b1 libdpkg-perl_1.22.18 libduktape207_2.7.0-2+b2 libelf1t64_0.192-4 libexpat1_2.7.1-1 libexpat1-dev_2.7.1-1 libfakeroot_1.37.1.1-1 libffi-dev_3.4.7-1 libffi8_3.4.7-1 libfile-stripnondeterminism-perl_1.14.1-2 libfontconfig-dev_2.15.0-2.2 libfontconfig1_2.15.0-2.2 libfreetype-dev_2.13.3+dfsg-1 libfreetype6_2.13.3+dfsg-1 libgcc-14-dev_14.2.0-19 libgcc-14-dev-ppc64el-cross_14.2.0-19cross1 libgcc-s1_14.2.0-19 libgcc-s1-ppc64el-cross_14.2.0-19cross1 libgdbm-compat4t64_1.24-2 libgdbm6t64_1.24-2 libgdk-pixbuf-2.0-0_2.42.12+dfsg-2 libgdk-pixbuf2.0-common_2.42.12+dfsg-2 libgio-2.0-dev_2.84.0-2 libgio-2.0-dev-bin_2.84.0-2 libgirepository-1.0-1_1.84.0-1 libgirepository-1.0-dev_1.84.0-1 libgirepository-2.0-0_2.84.0-2 libgirepository1.0-dev_1.84.0-1 libgjs-dev_1.82.1-1 libgjs0g_1.82.1-1 libglib2.0-0t64_2.84.0-2 libglib2.0-bin_2.84.0-2 libglib2.0-data_2.84.0-2 libglib2.0-dev_2.84.0-2 libglib2.0-dev-bin_2.84.0-2 libgmp10_2:6.3.0+dfsg-3 libgnutls30t64_3.8.9-2 libgomp1_14.2.0-19 libgomp1-ppc64el-cross_14.2.0-19cross1 libgprofng0_2.44-3 libgssapi-krb5-2_1.21.3-5 libgssrpc4t64_1.21.3-5 libhogweed6t64_3.10.1-1 libhwasan0_14.2.0-19 libice-dev_2:1.1.1-1 libice6_2:1.1.1-1 libicu-dev_76.1-3 libicu76_76.1-3 libidn2-0_2.3.8-2 libisl23_0.27-1 libitm1_14.2.0-19 libitm1-ppc64el-cross_14.2.0-19cross1 libjansson4_2.14-2+b3 libjbig0_2.1-6.1+b2 libjpeg62-turbo_1:2.1.5-3.1 libjson-glib-1.0-0_1.10.6+ds-2 libjson-glib-1.0-common_1.10.6+ds-2 libjson-glib-dev_1.10.6+ds-2 libk5crypto3_1.21.3-5 libkadm5clnt-mit12_1.21.3-5 libkadm5srv-mit12_1.21.3-5 libkdb5-10t64_1.21.3-5 libkeyutils1_1.6.3-4 libkrb5-3_1.21.3-5 libkrb5-dev_1.21.3-5 libkrb5support0_1.21.3-5 libldap2_2.6.9+dfsg-2 liblerc4_4.0.0+ds-5 liblsan0_14.2.0-19 liblsan0-ppc64el-cross_14.2.0-19cross1 liblz4-1_1.10.0-4 liblzma5_5.6.4-1 liblzo2-2_2.10-3+b1 libmagic-mgc_1:5.46-4 libmagic1t64_1:5.46-4 libmd0_1.1.0-2+b1 libmount-dev_2.40.4-5 libmount1_2.40.4-5 libmozjs-128-0_128.8.0-1 libmozjs-128-dev_128.8.0-1 libmpc3_1.3.1-1+b3 libmpfr6_4.2.2-1 libncursesw6_6.5+20250216-2 libnettle8t64_3.10.1-1 libnghttp2-14_1.64.0-1 libnghttp2-dev_1.64.0-1 libnghttp3-9_1.8.0-1 libngtcp2-16_1.11.0-1 libngtcp2-crypto-gnutls8_1.11.0-1 libp11-kit0_0.25.5-3 libpam-modules_1.7.0-3 libpam-modules-bin_1.7.0-3 libpam-runtime_1.7.0-3 libpam-systemd_257.4-7 libpam0g_1.7.0-3 libpcre2-16-0_10.45-1 libpcre2-32-0_10.45-1 libpcre2-8-0_10.45-1 libpcre2-dev_10.45-1 libpcre2-posix3_10.45-1 libperl5.40_5.40.1-2 libpipeline1_1.5.8-1 libpixman-1-0_0.44.0-3 libpixman-1-dev_0.44.0-3 libpkgconf3_1.8.1-4 libpng-dev_1.6.47-1.1 libpng16-16t64_1.6.47-1.1 libproc2-0_2:4.0.4-7 libproxy1v5_0.5.9-1 libpsl-dev_0.21.2-1.1+b1 libpsl5t64_0.21.2-1.1+b1 libpython3-stdlib_3.13.2-2 libpython3.13-minimal_3.13.2-3 libpython3.13-stdlib_3.13.2-3 libquadmath0_14.2.0-19 libquadmath0-ppc64el-cross_14.2.0-19cross1 libreadline8t64_8.2-6 librtmp1_2.4+20151223.gitfa8646d.1-2+b5 libsasl2-2_2.1.28+dfsg1-9 libsasl2-modules-db_2.1.28+dfsg1-9 libseccomp2_2.6.0-2 libselinux1_3.8.1-1 libselinux1-dev_3.8.1-1 libsemanage-common_3.8.1-1 libsemanage2_3.8.1-1 libsepol-dev_3.8.1-1 libsepol2_3.8.1-1 libsframe1_2.44-3 libsharpyuv0_1.5.0-0.1 libsm-dev_2:1.2.6-1 libsm6_2:1.2.6-1 libsmartcols1_2.40.4-5 libsoup-3.0-0_3.6.5-1 libsoup-3.0-common_3.6.5-1 libsoup-3.0-dev_3.6.5-1 libsqlite3-0_3.46.1-2 libsqlite3-dev_3.46.1-2 libssh2-1t64_1.11.1-1 libssl3t64_3.4.1-1 libstdc++-14-dev_14.2.0-19 libstdc++-14-dev-ppc64el-cross_14.2.0-19cross1 libstdc++6_14.2.0-19 libstdc++6-ppc64el-cross_14.2.0-19cross1 libstemmer0d_2.2.0-4+b2 libsysprof-capture-4-dev_48.0-2 libsystemd-dev_257.4-7 libsystemd-shared_257.4-7 libsystemd0_257.4-7 libtasn1-6_4.20.0-2 libtelepathy-glib-dev_0.24.2-2 libtelepathy-glib0t64_0.24.2-2 libtiff6_4.7.0-2 libtinfo6_6.5+20250216-2 libtinysparql-3.0-0_3.8.2-7 libtinysparql-dev_3.8.2-7 libtool_2.5.4-4 libtracker-sparql-3.0-dev_3.8.2-7 libtsan2_14.2.0-19 libtsan2-ppc64el-cross_14.2.0-19cross1 libubsan1_14.2.0-19 libubsan1-ppc64el-cross_14.2.0-19cross1 libuchardet0_0.0.8-1+b2 libudev1_257.4-7 libunistring5_1.3-2 libuuid1_2.40.4-5 libwebp7_1.5.0-0.1 libx11-6_2:1.8.12-1 libx11-data_2:1.8.12-1 libx11-dev_2:1.8.12-1 libxau-dev_1:1.0.11-1 libxau6_1:1.0.11-1 libxcb-render0_1.17.0-2+b1 libxcb-render0-dev_1.17.0-2+b1 libxcb-shm0_1.17.0-2+b1 libxcb-shm0-dev_1.17.0-2+b1 libxcb1_1.17.0-2+b1 libxcb1-dev_1.17.0-2+b1 libxdmcp-dev_1:1.1.5-1 libxdmcp6_1:1.1.5-1 libxext-dev_2:1.3.4-1+b3 libxext6_2:1.3.4-1+b3 libxml2_2.12.7+dfsg+really2.9.14-0.4 libxml2-dev_2.12.7+dfsg+really2.9.14-0.4 libxml2-utils_2.12.7+dfsg+really2.9.14-0.4 libxrender-dev_1:0.9.12-1 libxrender1_1:0.9.12-1 libxxhash0_0.8.3-2 libzstd1_1.5.7+dfsg-1 linux-libc-dev_6.12.20-1 linux-libc-dev-ppc64el-cross_6.12.17-1cross2 login_1:4.16.0-2+really2.40.4-5 login.defs_1:4.17.3-3 m4_1.4.19-7 make_4.4.1-1 man-db_2.13.0-1 mawk_1.3.4.20250131-1 media-types_13.0.0 meson_1.7.0-1 mount_2.40.4-5 native-architecture_0.2.6 ncurses-base_6.5+20250216-2 ncurses-bin_6.5+20250216-2 netbase_6.5 ninja-build_1.12.1-1 openssl-provider-legacy_3.4.1-1 passwd_1:4.17.3-3 patch_2.7.6-7 perl_5.40.1-2 perl-base_5.40.1-2 perl-modules-5.40_5.40.1-2 pkgconf_1.8.1-4 pkgconf-bin_1.8.1-4 po-debconf_1.0.21+nmu1 procps_2:4.0.4-7 python3_3.13.2-2 python3-autocommand_2.2.2-3 python3-inflect_7.3.1-2 python3-jaraco.context_6.0.1-1 python3-jaraco.functools_4.1.0-1 python3-jaraco.text_4.0.0-1 python3-libxml2_2.12.7+dfsg+really2.9.14-0.4 python3-mako_1.3.8-2 python3-markdown_3.7-2 python3-markupsafe_2.1.5-1+b3 python3-minimal_3.13.2-2 python3-more-itertools_10.6.0-1 python3-packaging_24.2-1 python3-pkg-resources_75.8.0-1 python3-setuptools_75.8.0-1 python3-typeguard_4.4.2-1 python3-typing-extensions_4.12.2-2 python3-zipp_3.21.0-1 python3.13_3.13.2-3 python3.13-minimal_3.13.2-3 qemu-user_1:10.0.0~rc1+ds-2 readline-common_8.2-6 rpcsvc-proto_1.4.3-1 sbuild-build-depends-main-dummy_0.invalid.0 sed_4.9-2 sensible-utils_0.0.24 sgml-base_1.31 shared-mime-info_2.4-5+b2 sqv_1.2.1-6+b1 systemd_257.4-7 systemd-sysv_257.4-7 sysvinit-utils_3.14-4 tar_1.35+dfsg-3.1 tzdata_2025b-1 util-linux_2.40.4-5 uuid-dev_2.40.4-5 x11-common_1:7.7+24 x11proto-dev_2024.1-1 xml-core_0.19 xorg-sgml-doctools_1:1.11-1.1 xtrans-dev_1.4.0-1 xz-utils_5.6.4-1 zlib1g_1:1.3.dfsg+really1.3.1-1+b1 zlib1g-dev_1:1.3.dfsg+really1.3.1-1+b1

+------------------------------------------------------------------------------+
| Build                                                                        |
+------------------------------------------------------------------------------+


Unpack source
-------------

-----BEGIN PGP SIGNED MESSAGE-----
Hash: SHA512

Format: 3.0 (quilt)
Source: polari
Binary: polari
Architecture: any
Version: 46.0-2
Maintainer: Debian GNOME Maintainers <pkg-gnome-maintainers@lists.alioth.debian.org>
Uploaders: Jeremy Bícha <jbicha@ubuntu.com>, Laurent Bigonville <bigon@debian.org>, Tim Lunn <tim@feathertop.org>, Brandon Snider <brandonjsnider@gmail.com>
Homepage: https://wiki.gnome.org/Apps/Polari
Standards-Version: 4.7.0
Vcs-Browser: https://salsa.debian.org/gnome-team/polari
Vcs-Git: https://salsa.debian.org/gnome-team/polari.git
Build-Depends: debhelper-compat (= 13), dh-sequence-gir, appstream <!nocheck>, appstream-util <!nocheck>, desktop-file-utils, gtk-update-icon-cache, itstool, json-glib-tools <!nocheck>, libgirepository1.0-dev, libgjs-dev (>= 1.73.1), libglib2.0-dev (>= 2.43.4), libtelepathy-glib-dev, libtracker-sparql-3.0-dev, libxml2-utils, meson (>= 0.53.0)
Package-List:
 polari deb gnome optional arch=any
Checksums-Sha1:
 e10db6e3bee2a7af6929947359d220c0e8a62e81 1067376 polari_46.0.orig.tar.xz
 7883717d1544ad277832c7bcf88cabff82ca847b 5516 polari_46.0-2.debian.tar.xz
Checksums-Sha256:
 d2b1709e379189294f53d4ef15f03f8bcbbbe8c52f0f415e62f7d5f00c360a31 1067376 polari_46.0.orig.tar.xz
 436ee2c8ce63a63f269a0a46f272d18ccfe237989853383385802720989e1315 5516 polari_46.0-2.debian.tar.xz
Files:
 61da1fa512be82555ffbc0a2cc69515c 1067376 polari_46.0.orig.tar.xz
 5105cfff721527a33a9a32b93c90ae3c 5516 polari_46.0-2.debian.tar.xz

-----BEGIN PGP SIGNATURE-----

iQIzBAEBCgAdFiEETQvhLw5HdtiqzpaW5mx3Wuv+bH0FAmfRkLwACgkQ5mx3Wuv+
bH2e/xAA0sTd168vZ5SuK1Ilhe9UP+EP0uUH5pU+rIp57BFqkL5ah6GDCFB1B8wj
dklKsLWD3pBS43OE7rbWMqDoFThBtguixhP91p5gxtEjptqWk7CHHMwkm3a18+ZP
IdrlM2Y88OjhpRVsDamctcf1xkW0oMx7k7l9HUPAjsmpUSuvugp7QtO+k8W7QB1e
FgNL0h9L2QZVXeR2A8vEL8br1SJLczJ3Om6x6JBbbJVXnXxaLaT5tHWrF7sQ/SXO
I7R1eDnDCyNp3dgzON4JS6719VhamqWYqqRfU7oDW2eA4deYJf5lhq1LpGiZj/5u
H+pK83vQDwoZ7SYt8de3IvoCiB4ncH7WbBvFtKAeH8iTd/3WKpnjyMRshv/rxB6Z
t1OeQIiQ/PMHjcUUNIkqGbiFRhR1fU63w9wdMqhcuaF42gvX4dnIdtKCeb7HClRy
PscgFkD1MhF0T+7yncmCF9v00Tj1/KL/lpZb/X+1Gpjr8p9CCPcXYEOCRJikc+C+
mRPs87meeQx7Pr6frVI+q0+p+bsSvO0b59avqXreytJqUudYqPuOQZAnlqdOleq0
mrWjnTAeYR7wz1oz/16yE8gJss+KOv7bVonDZOgR0OFNMJ9d8otLsW6WrDuulz5F
ZJfRWbqidoIFYcuw1u+ZEISncNJfz7WJd4bHBuu5/g1J3jzgSdg=
=xU3D
-----END PGP SIGNATURE-----

dpkg-source: warning: cannot verify inline signature for ./polari_46.0-2.dsc: unsupported subcommand
dpkg-source: info: extracting polari in /<<PKGBUILDDIR>>
dpkg-source: info: unpacking polari_46.0.orig.tar.xz
dpkg-source: info: unpacking polari_46.0-2.debian.tar.xz

Check disk space
----------------

Sufficient free space for build

User Environment
----------------

APT_CONFIG=/var/lib/sbuild/apt.conf
CONFIG_SITE=/etc/dpkg-cross/cross-config.ppc64el
DEB_BUILD_OPTIONS=nocheck
HOME=/sbuild-nonexistent
LANG=en_US.UTF-8
LC_ALL=C.UTF-8
LOGNAME=crossqa
OLDPWD=/home/crossqa
PATH=/usr/local/sbin:/usr/local/bin:/usr/sbin:/usr/bin:/sbin:/bin:/usr/games
SBUILD_CONFIG=/tmp/tmp.hPCqoZxyGg/sbuild.conf
SCHROOT_ALIAS_NAME=unstable-amd64-sbuild
SCHROOT_CHROOT_NAME=sid-amd64-sbuild
SCHROOT_COMMAND=env
SCHROOT_GID=1000
SCHROOT_GROUP=crossqa
SCHROOT_SESSION_ID=sid-amd64-sbuild-6364f937-3aff-4a8b-bcf3-dff2a074cd8d
SCHROOT_UID=1000
SCHROOT_USER=crossqa
SHELL=/bin/sh
USER=crossqa
XDG_SESSION_CLASS=user

dpkg-buildpackage
-----------------

Command: dpkg-buildpackage --sanitize-env -appc64el -Pcross,nocheck -us -uc -B -rfakeroot --jobs-try=1
dpkg-buildpackage: info: source package polari
dpkg-buildpackage: info: source version 46.0-2
dpkg-buildpackage: info: source distribution unstable
dpkg-buildpackage: info: source changed by Jeremy Bícha <jbicha@ubuntu.com>
dpkg-architecture: warning: specified GNU system type powerpc64le-linux-gnu does not match CC system type x86_64-linux-gnu, try setting a correct CC environment variable
 dpkg-source --before-build .
dpkg-buildpackage: info: host architecture ppc64el
 debian/rules clean
dh clean
   dh_clean
 debian/rules binary-arch
dh binary-arch
   dh_update_autotools_config -a
   dh_autoreconf -a
   dh_auto_configure -a
	cd obj-powerpc64le-linux-gnu && DEB_PYTHON_INSTALL_LAYOUT=deb LC_ALL=C.UTF-8 meson setup .. --wrap-mode=nodownload --buildtype=plain --prefix=/usr --sysconfdir=/etc --localstatedir=/var --libdir=lib/powerpc64le-linux-gnu -Dpython.bytecompile=-1 --cross-file /<<PKGBUILDDIR>>/debian/.debhelper/generated/_source/meson-cross-file.conf
DEPRECATION: "pkgconfig" entry is deprecated and should be replaced by "pkg-config"
DEPRECATION: c_args in the [properties] section of the machine file is deprecated, use the [built-in options] section.
DEPRECATION: cpp_args in the [properties] section of the machine file is deprecated, use the [built-in options] section.
DEPRECATION: c_link_args in the [properties] section of the machine file is deprecated, use the [built-in options] section.
DEPRECATION: cpp_link_args in the [properties] section of the machine file is deprecated, use the [built-in options] section.
The Meson build system
Version: 1.7.0
Source dir: /<<PKGBUILDDIR>>
Build dir: /<<PKGBUILDDIR>>/obj-powerpc64le-linux-gnu
Build type: cross build
Project name: polari
Project version: 46.0
C compiler for the host machine: /usr/bin/powerpc64le-linux-gnu-gcc (gcc 14.2.0 "powerpc64le-linux-gnu-gcc (Debian 14.2.0-19) 14.2.0")
C linker for the host machine: /usr/bin/powerpc64le-linux-gnu-gcc ld.bfd 2.44
C compiler for the build machine: cc (gcc 14.2.0 "cc (Debian 14.2.0-19) 14.2.0")
C linker for the build machine: cc ld.bfd 2.44
Build machine cpu family: x86_64
Build machine cpu: x86_64
Host machine cpu family: ppc64
Host machine cpu: ppc64el
Target machine cpu family: ppc64
Target machine cpu: ppc64el
Program desktop-file-validate found: YES (/usr/bin/desktop-file-validate)
Program json-glib-validate found: NO
Program appstream-util found: NO
Program appstreamcli found: NO
Program meson/check-version.py found: YES (/<<PKGBUILDDIR>>/meson/check-version.py)
Found pkg-config: YES (/usr/bin/powerpc64le-linux-gnu-pkg-config) 1.8.1
Run-time dependency gio-2.0 found: YES 2.84.0
Run-time dependency telepathy-glib found: YES 0.24.2
Run-time dependency tracker-sparql-3.0 found: YES 3.8.2
Run-time dependency gobject-introspection-1.0 found: YES 1.84.0
Run-time dependency gjs-1.0 found: YES 1.82.1
Checking for function "strcasestr" : YES 
Configuring config.h using configuration
Found pkg-config: YES (/usr/bin/pkg-config) 1.8.1
Did not find CMake 'cmake'
Found CMake: NO
Build-time dependency gio-2.0 found: NO (tried pkgconfig and cmake)
Program glib-compile-schemas found: YES (/usr/bin/glib-compile-schemas)
Program gtk4-update-icon-cache found: YES (/usr/bin/gtk4-update-icon-cache)
Program update-desktop-database found: YES (/usr/bin/update-desktop-database)
Program msgfmt found: YES (/usr/bin/msgfmt)
WARNING: Could not detect glib version, assuming 2.54. You may get build errors if your glib is older.
Build-time dependency gio-2.0 found: NO (tried pkgconfig and cmake)
Program glib-compile-resources found: YES (/usr/bin/glib-compile-resources)
Build-time dependency gio-2.0 found: NO (tried pkgconfig and cmake)
Program glib-compile-resources found: YES (/usr/bin/glib-compile-resources)
Configuring org.freedesktop.Telepathy.Client.Polari.service using configuration
Configuring org.gnome.Polari.service using configuration
Configuring config.js.in using configuration
Build-time dependency gio-2.0 found: NO (tried pkgconfig and cmake)
Program glib-compile-resources found: YES (/usr/bin/glib-compile-resources)
Dependency gobject-introspection-1.0 found: YES 1.84.0 (cached)
Build-time dependency gobject-introspection-1.0 found: NO (tried pkgconfig and cmake)
Program g-ir-scanner found: YES (/usr/bin/g-ir-scanner)
Build-time dependency gobject-introspection-1.0 found: NO (tried pkgconfig and cmake)
Program g-ir-compiler found: NO

../src/meson.build:67:6: ERROR: Program 'g-ir-compiler' not found or not executable

A full log can be found at /<<PKGBUILDDIR>>/obj-powerpc64le-linux-gnu/meson-logs/meson-log.txt
	cd obj-powerpc64le-linux-gnu && tail -v -n \+0 meson-logs/meson-log.txt
==> meson-logs/meson-log.txt <==
Build started at 2025-03-30T07:53:25.456409
Main binary: /usr/bin/python3
Build Options: -Dpython.bytecompile=-1 -Dprefix=/usr -Dlibdir=lib/powerpc64le-linux-gnu -Dlocalstatedir=/var -Dsysconfdir=/etc -Dbuildtype=plain -Dwrap_mode=nodownload --cross-file=/<<PKGBUILDDIR>>/debian/.debhelper/generated/_source/meson-cross-file.conf
Python system: Linux
The Meson build system
Version: 1.7.0
Source dir: /<<PKGBUILDDIR>>
Build dir: /<<PKGBUILDDIR>>/obj-powerpc64le-linux-gnu
Build type: cross build
Project name: polari
Project version: 46.0
-----------
Detecting compiler via: `/usr/bin/powerpc64le-linux-gnu-gcc --version` -> 0
stdout:
powerpc64le-linux-gnu-gcc (Debian 14.2.0-19) 14.2.0
Copyright (C) 2024 Free Software Foundation, Inc.
This is free software; see the source for copying conditions.  There is NO
warranty; not even for MERCHANTABILITY or FITNESS FOR A PARTICULAR PURPOSE.
-----------
Running command: -cpp -x c -E -dM -
-----
-----------
Detecting linker via: `/usr/bin/powerpc64le-linux-gnu-gcc -Wl,--version -g -O2 -Werror=implicit-function-declaration -ffile-prefix-map=/<<PKGBUILDDIR>>=. -fstack-protector-strong -Wformat -Werror=format-security -Wl,-z,relro -Wl,-z,now -Wl,-z,defs` -> 0
stdout:
GNU ld (GNU Binutils for Debian) 2.44
Copyright (C) 2025 Free Software Foundation, Inc.
This program is free software; you may redistribute it under the terms of
the GNU General Public License version 3 or (at your option) a later version.
This program has absolutely no warranty.
-----------
stderr:
collect2 version 14.2.0
/usr/lib/gcc-cross/powerpc64le-linux-gnu/14/../../../../powerpc64le-linux-gnu/bin/ld -plugin /usr/libexec/gcc-cross/powerpc64le-linux-gnu/14/liblto_plugin.so -plugin-opt=/usr/libexec/gcc-cross/powerpc64le-linux-gnu/14/lto-wrapper -plugin-opt=-fresolution=/tmp/ccSyJgey.res -plugin-opt=-pass-through=-lgcc -plugin-opt=-pass-through=-lgcc_s -plugin-opt=-pass-through=-lc -plugin-opt=-pass-through=-lgcc -plugin-opt=-pass-through=-lgcc_s --sysroot=/ --build-id --eh-frame-hdr -m elf64lppc --hash-style=gnu --as-needed -dynamic-linker /lib64/ld64.so.2 -pie /usr/lib/gcc-cross/powerpc64le-linux-gnu/14/../../../../powerpc64le-linux-gnu/lib/../lib/Scrt1.o /usr/lib/gcc-cross/powerpc64le-linux-gnu/14/../../../../powerpc64le-linux-gnu/lib/../lib/crti.o /usr/lib/gcc-cross/powerpc64le-linux-gnu/14/crtbeginS.o -L/usr/lib/gcc-cross/powerpc64le-linux-gnu/14 -L/usr/lib/gcc-cross/powerpc64le-linux-gnu/14/../../../../powerpc64le-linux-gnu/lib/../lib -L/lib/powerpc64le-linux-gnu -L/lib/../lib -L/usr/lib/powerpc64le-linux-gnu -L/usr/lib/../lib -L/usr/lib/gcc-cross/powerpc64le-linux-gnu/14/../../../../powerpc64le-linux-gnu/lib --version -z relro -z now -z defs -lgcc --push-state --as-needed -lgcc_s --pop-state -lc -lgcc --push-state --as-needed -lgcc_s --pop-state /usr/lib/gcc-cross/powerpc64le-linux-gnu/14/crtendS.o /usr/lib/gcc-cross/powerpc64le-linux-gnu/14/../../../../powerpc64le-linux-gnu/lib/../lib/crtn.o
-----------
Sanity testing C compiler: /usr/bin/powerpc64le-linux-gnu-gcc
Is cross compiler: True.
Sanity check compiler command line: /usr/bin/powerpc64le-linux-gnu-gcc sanitycheckc.c -o sanitycheckc_cross.exe -Wdate-time -D_FORTIFY_SOURCE=2 -g -O2 -Werror=implicit-function-declaration -ffile-prefix-map=/<<PKGBUILDDIR>>=. -fstack-protector-strong -Wformat -Werror=format-security -D_FILE_OFFSET_BITS=64 -c
Sanity check compile stdout:

-----
Sanity check compile stderr:

-----
C compiler for the host machine: /usr/bin/powerpc64le-linux-gnu-gcc (gcc 14.2.0 "powerpc64le-linux-gnu-gcc (Debian 14.2.0-19) 14.2.0")
C linker for the host machine: /usr/bin/powerpc64le-linux-gnu-gcc ld.bfd 2.44
-----------
Detecting archiver via: `/usr/bin/powerpc64le-linux-gnu-ar --version` -> 0
stdout:
GNU ar (GNU Binutils for Debian) 2.44
Copyright (C) 2025 Free Software Foundation, Inc.
This program is free software; you may redistribute it under the terms of
the GNU General Public License version 3 or (at your option) any later version.
This program has absolutely no warranty.
-----------
-----------
Detecting compiler via: `cc --version` -> 0
stdout:
cc (Debian 14.2.0-19) 14.2.0
Copyright (C) 2024 Free Software Foundation, Inc.
This is free software; see the source for copying conditions.  There is NO
warranty; not even for MERCHANTABILITY or FITNESS FOR A PARTICULAR PURPOSE.
-----------
Running command: -cpp -x c -E -dM -
-----
-----------
Detecting linker via: `cc -Wl,--version -g -O2` -> 0
stdout:
GNU ld (GNU Binutils for Debian) 2.44
Copyright (C) 2025 Free Software Foundation, Inc.
This program is free software; you may redistribute it under the terms of
the GNU General Public License version 3 or (at your option) a later version.
This program has absolutely no warranty.
-----------
stderr:
collect2 version 14.2.0
/usr/bin/ld -plugin /usr/libexec/gcc/x86_64-linux-gnu/14/liblto_plugin.so -plugin-opt=/usr/libexec/gcc/x86_64-linux-gnu/14/lto-wrapper -plugin-opt=-fresolution=/tmp/ccPDM9gE.res -plugin-opt=-pass-through=-lgcc -plugin-opt=-pass-through=-lgcc_s -plugin-opt=-pass-through=-lc -plugin-opt=-pass-through=-lgcc -plugin-opt=-pass-through=-lgcc_s --build-id --eh-frame-hdr -m elf_x86_64 --hash-style=gnu --as-needed -dynamic-linker /lib64/ld-linux-x86-64.so.2 -pie /usr/lib/gcc/x86_64-linux-gnu/14/../../../x86_64-linux-gnu/Scrt1.o /usr/lib/gcc/x86_64-linux-gnu/14/../../../x86_64-linux-gnu/crti.o /usr/lib/gcc/x86_64-linux-gnu/14/crtbeginS.o -L/usr/lib/gcc/x86_64-linux-gnu/14 -L/usr/lib/gcc/x86_64-linux-gnu/14/../../../x86_64-linux-gnu -L/usr/lib/gcc/x86_64-linux-gnu/14/../../../../lib -L/lib/x86_64-linux-gnu -L/lib/../lib -L/usr/lib/x86_64-linux-gnu -L/usr/lib/../lib -L/usr/lib/gcc/x86_64-linux-gnu/14/../../.. --version -lgcc --push-state --as-needed -lgcc_s --pop-state -lc -lgcc --push-state --as-needed -lgcc_s --pop-state /usr/lib/gcc/x86_64-linux-gnu/14/crtendS.o /usr/lib/gcc/x86_64-linux-gnu/14/../../../x86_64-linux-gnu/crtn.o
-----------
Sanity testing C compiler: cc
Is cross compiler: False.
Sanity check compiler command line: cc sanitycheckc.c -o sanitycheckc.exe -g -O2 -D_FILE_OFFSET_BITS=64
Sanity check compile stdout:

-----
Sanity check compile stderr:

-----
Running test binary command:  /<<PKGBUILDDIR>>/obj-powerpc64le-linux-gnu/meson-private/sanitycheckc.exe
C compiler for the build machine: cc (gcc 14.2.0 "cc (Debian 14.2.0-19) 14.2.0")
C linker for the build machine: cc ld.bfd 2.44
-----------
Detecting archiver via: `gcc-ar --version` -> 0
stdout:
GNU ar (GNU Binutils for Debian) 2.44
Copyright (C) 2025 Free Software Foundation, Inc.
This program is free software; you may redistribute it under the terms of
the GNU General Public License version 3 or (at your option) any later version.
This program has absolutely no warranty.
-----------
Build machine cpu family: x86_64
Build machine cpu: x86_64
Host machine cpu family: ppc64
Host machine cpu: ppc64el
Target machine cpu family: ppc64
Target machine cpu: ppc64el
Program desktop-file-validate found: YES (/usr/bin/desktop-file-validate)
Program json-glib-validate found: NO
Program appstream-util found: NO
Program appstreamcli found: NO
Program meson/check-version.py found: YES (/<<PKGBUILDDIR>>/meson/check-version.py)
Pkg-config binary for host machine specified from cross file, native file, or env var as ['/usr/bin/powerpc64le-linux-gnu-pkg-config']
Found pkg-config: YES (/usr/bin/powerpc64le-linux-gnu-pkg-config) 1.8.1
Determining dependency 'gio-2.0' with pkg-config executable '/usr/bin/powerpc64le-linux-gnu-pkg-config'
env[PKG_CONFIG_PATH]: 
env[PKG_CONFIG]: /usr/bin/powerpc64le-linux-gnu-pkg-config
-----------
Called: `/usr/bin/powerpc64le-linux-gnu-pkg-config --modversion gio-2.0` -> 0
stdout:
2.84.0
-----------
env[PKG_CONFIG_PATH]: 
env[PKG_CONFIG]: /usr/bin/powerpc64le-linux-gnu-pkg-config
-----------
Called: `/usr/bin/powerpc64le-linux-gnu-pkg-config --cflags gio-2.0` -> 0
stdout:
-I/usr/include/glib-2.0 -I/usr/lib/powerpc64le-linux-gnu/glib-2.0/include -I/usr/include/sysprof-6 -I/usr/include/libmount -I/usr/include/blkid -pthread
-----------
env[PKG_CONFIG_ALLOW_SYSTEM_LIBS]: 1
env[PKG_CONFIG_PATH]: 
env[PKG_CONFIG]: /usr/bin/powerpc64le-linux-gnu-pkg-config
-----------
Called: `/usr/bin/powerpc64le-linux-gnu-pkg-config --libs gio-2.0` -> 0
stdout:
-L/usr/lib/powerpc64le-linux-gnu -lgio-2.0 -lgobject-2.0 -lglib-2.0
-----------
env[PKG_CONFIG_PATH]: 
env[PKG_CONFIG]: /usr/bin/powerpc64le-linux-gnu-pkg-config
-----------
Called: `/usr/bin/powerpc64le-linux-gnu-pkg-config --libs gio-2.0` -> 0
stdout:
-lgio-2.0 -lgobject-2.0 -lglib-2.0
-----------
Running compile:
Working directory:  /<<PKGBUILDDIR>>/obj-powerpc64le-linux-gnu/meson-private/tmpnh1kz30j
Code:

        #include <stddef.h>
        int main(void) {
            void * something;
            return 0;
        }
-----------
Command line: `/usr/bin/powerpc64le-linux-gnu-gcc /<<PKGBUILDDIR>>/obj-powerpc64le-linux-gnu/meson-private/tmpnh1kz30j/testfile.c -o /<<PKGBUILDDIR>>/obj-powerpc64le-linux-gnu/meson-private/tmpnh1kz30j/output.obj -c -Wdate-time -D_FORTIFY_SOURCE=2 -g -O2 -Werror=implicit-function-declaration -ffile-prefix-map=/<<PKGBUILDDIR>>=. -fstack-protector-strong -Wformat -Werror=format-security -D_FILE_OFFSET_BITS=64 -O0` -> 0
Running compile:
Working directory:  /tmp/tmpw5zc033u
Code:

        
        #ifndef sizeof(void *)
        # define sizeof(void *) "MESON_GET_DEFINE_UNDEFINED_SENTINEL"
        #endif
        "MESON_GET_DEFINE_DELIMITER_START"
sizeof(void *)
"MESON_GET_DEFINE_DELIMITER_END"
-----------
Command line: `/usr/bin/powerpc64le-linux-gnu-gcc /tmp/tmpw5zc033u/testfile.c -E -P -Wdate-time -D_FORTIFY_SOURCE=2 -g -O2 -Werror=implicit-function-declaration -ffile-prefix-map=/<<PKGBUILDDIR>>=. -fstack-protector-strong -Wformat -Werror=format-security -D_FILE_OFFSET_BITS=64 -P -O0` -> 1
stdout:
"MESON_GET_DEFINE_DELIMITER_START"
sizeof(void *)
"MESON_GET_DEFINE_DELIMITER_END"
-----------
stderr:
/tmp/tmpw5zc033u/testfile.c:3:23: warning: extra tokens at end of #ifndef directive
    3 |         #ifndef sizeof(void *)
      |                       ^
/tmp/tmpw5zc033u/testfile.c:4:30: error: expected ',' or ')', found "*"
    4 |         # define sizeof(void *) "MESON_GET_DEFINE_UNDEFINED_SENTINEL"
      |                              ^
-----------
Running compile:
Working directory:  /<<PKGBUILDDIR>>/obj-powerpc64le-linux-gnu/meson-private/tmp0dle0rxx
Code:

        #include <stddef.h>
        int main(void) { static int a[1-2*!(sizeof(void *) >= 0)]; a[0]=0; return 0; }
-----------
Command line: `/usr/bin/powerpc64le-linux-gnu-gcc /<<PKGBUILDDIR>>/obj-powerpc64le-linux-gnu/meson-private/tmp0dle0rxx/testfile.c -o /<<PKGBUILDDIR>>/obj-powerpc64le-linux-gnu/meson-private/tmp0dle0rxx/output.obj -c -Wdate-time -D_FORTIFY_SOURCE=2 -g -O2 -Werror=implicit-function-declaration -ffile-prefix-map=/<<PKGBUILDDIR>>=. -fstack-protector-strong -Wformat -Werror=format-security -D_FILE_OFFSET_BITS=64 -O0` -> 0
Running compile:
Working directory:  /<<PKGBUILDDIR>>/obj-powerpc64le-linux-gnu/meson-private/tmphqm4dc11
Code:

        #include <stddef.h>
        int main(void) { static int a[1-2*!(sizeof(void *) > 0)]; a[0]=0; return 0; }
-----------
Command line: `/usr/bin/powerpc64le-linux-gnu-gcc /<<PKGBUILDDIR>>/obj-powerpc64le-linux-gnu/meson-private/tmphqm4dc11/testfile.c -o /<<PKGBUILDDIR>>/obj-powerpc64le-linux-gnu/meson-private/tmphqm4dc11/output.obj -c -Wdate-time -D_FORTIFY_SOURCE=2 -g -O2 -Werror=implicit-function-declaration -ffile-prefix-map=/<<PKGBUILDDIR>>=. -fstack-protector-strong -Wformat -Werror=format-security -D_FILE_OFFSET_BITS=64 -O0` -> 0
Running compile:
Working directory:  /<<PKGBUILDDIR>>/obj-powerpc64le-linux-gnu/meson-private/tmp1c1afgkw
Code:

        #include <stddef.h>
        int main(void) { static int a[1-2*!(sizeof(void *) > 1)]; a[0]=0; return 0; }
-----------
Command line: `/usr/bin/powerpc64le-linux-gnu-gcc /<<PKGBUILDDIR>>/obj-powerpc64le-linux-gnu/meson-private/tmp1c1afgkw/testfile.c -o /<<PKGBUILDDIR>>/obj-powerpc64le-linux-gnu/meson-private/tmp1c1afgkw/output.obj -c -Wdate-time -D_FORTIFY_SOURCE=2 -g -O2 -Werror=implicit-function-declaration -ffile-prefix-map=/<<PKGBUILDDIR>>=. -fstack-protector-strong -Wformat -Werror=format-security -D_FILE_OFFSET_BITS=64 -O0` -> 0
Running compile:
Working directory:  /<<PKGBUILDDIR>>/obj-powerpc64le-linux-gnu/meson-private/tmprw0hjse1
Code:

        #include <stddef.h>
        int main(void) { static int a[1-2*!(sizeof(void *) > 3)]; a[0]=0; return 0; }
-----------
Command line: `/usr/bin/powerpc64le-linux-gnu-gcc /<<PKGBUILDDIR>>/obj-powerpc64le-linux-gnu/meson-private/tmprw0hjse1/testfile.c -o /<<PKGBUILDDIR>>/obj-powerpc64le-linux-gnu/meson-private/tmprw0hjse1/output.obj -c -Wdate-time -D_FORTIFY_SOURCE=2 -g -O2 -Werror=implicit-function-declaration -ffile-prefix-map=/<<PKGBUILDDIR>>=. -fstack-protector-strong -Wformat -Werror=format-security -D_FILE_OFFSET_BITS=64 -O0` -> 0
Running compile:
Working directory:  /<<PKGBUILDDIR>>/obj-powerpc64le-linux-gnu/meson-private/tmp8btspa1u
Code:

        #include <stddef.h>
        int main(void) { static int a[1-2*!(sizeof(void *) > 7)]; a[0]=0; return 0; }
-----------
Command line: `/usr/bin/powerpc64le-linux-gnu-gcc /<<PKGBUILDDIR>>/obj-powerpc64le-linux-gnu/meson-private/tmp8btspa1u/testfile.c -o /<<PKGBUILDDIR>>/obj-powerpc64le-linux-gnu/meson-private/tmp8btspa1u/output.obj -c -Wdate-time -D_FORTIFY_SOURCE=2 -g -O2 -Werror=implicit-function-declaration -ffile-prefix-map=/<<PKGBUILDDIR>>=. -fstack-protector-strong -Wformat -Werror=format-security -D_FILE_OFFSET_BITS=64 -O0` -> 0
Running compile:
Working directory:  /<<PKGBUILDDIR>>/obj-powerpc64le-linux-gnu/meson-private/tmp3qh3c_ce
Code:

        #include <stddef.h>
        int main(void) { static int a[1-2*!(sizeof(void *) > 15)]; a[0]=0; return 0; }
-----------
Command line: `/usr/bin/powerpc64le-linux-gnu-gcc /<<PKGBUILDDIR>>/obj-powerpc64le-linux-gnu/meson-private/tmp3qh3c_ce/testfile.c -o /<<PKGBUILDDIR>>/obj-powerpc64le-linux-gnu/meson-private/tmp3qh3c_ce/output.obj -c -Wdate-time -D_FORTIFY_SOURCE=2 -g -O2 -Werror=implicit-function-declaration -ffile-prefix-map=/<<PKGBUILDDIR>>=. -fstack-protector-strong -Wformat -Werror=format-security -D_FILE_OFFSET_BITS=64 -O0` -> 1
stderr:
/<<PKGBUILDDIR>>/obj-powerpc64le-linux-gnu/meson-private/tmp3qh3c_ce/testfile.c: In function 'main':
/<<PKGBUILDDIR>>/obj-powerpc64le-linux-gnu/meson-private/tmp3qh3c_ce/testfile.c:3:37: error: size of array 'a' is negative
    3 |         int main(void) { static int a[1-2*!(sizeof(void *) > 15)]; a[0]=0; return 0; }
      |                                     ^
-----------
Running compile:
Working directory:  /<<PKGBUILDDIR>>/obj-powerpc64le-linux-gnu/meson-private/tmp76yr8cta
Code:

        #include <stddef.h>
        int main(void) { static int a[1-2*!(sizeof(void *) <= 11)]; a[0]=0; return 0; }
-----------
Command line: `/usr/bin/powerpc64le-linux-gnu-gcc /<<PKGBUILDDIR>>/obj-powerpc64le-linux-gnu/meson-private/tmp76yr8cta/testfile.c -o /<<PKGBUILDDIR>>/obj-powerpc64le-linux-gnu/meson-private/tmp76yr8cta/output.obj -c -Wdate-time -D_FORTIFY_SOURCE=2 -g -O2 -Werror=implicit-function-declaration -ffile-prefix-map=/<<PKGBUILDDIR>>=. -fstack-protector-strong -Wformat -Werror=format-security -D_FILE_OFFSET_BITS=64 -O0` -> 0
Running compile:
Working directory:  /<<PKGBUILDDIR>>/obj-powerpc64le-linux-gnu/meson-private/tmppypuobv2
Code:

        #include <stddef.h>
        int main(void) { static int a[1-2*!(sizeof(void *) <= 9)]; a[0]=0; return 0; }
-----------
Command line: `/usr/bin/powerpc64le-linux-gnu-gcc /<<PKGBUILDDIR>>/obj-powerpc64le-linux-gnu/meson-private/tmppypuobv2/testfile.c -o /<<PKGBUILDDIR>>/obj-powerpc64le-linux-gnu/meson-private/tmppypuobv2/output.obj -c -Wdate-time -D_FORTIFY_SOURCE=2 -g -O2 -Werror=implicit-function-declaration -ffile-prefix-map=/<<PKGBUILDDIR>>=. -fstack-protector-strong -Wformat -Werror=format-security -D_FILE_OFFSET_BITS=64 -O0` -> 0
Running compile:
Working directory:  /<<PKGBUILDDIR>>/obj-powerpc64le-linux-gnu/meson-private/tmpdp16jnoz
Code:

        #include <stddef.h>
        int main(void) { static int a[1-2*!(sizeof(void *) <= 8)]; a[0]=0; return 0; }
-----------
Command line: `/usr/bin/powerpc64le-linux-gnu-gcc /<<PKGBUILDDIR>>/obj-powerpc64le-linux-gnu/meson-private/tmpdp16jnoz/testfile.c -o /<<PKGBUILDDIR>>/obj-powerpc64le-linux-gnu/meson-private/tmpdp16jnoz/output.obj -c -Wdate-time -D_FORTIFY_SOURCE=2 -g -O2 -Werror=implicit-function-declaration -ffile-prefix-map=/<<PKGBUILDDIR>>=. -fstack-protector-strong -Wformat -Werror=format-security -D_FILE_OFFSET_BITS=64 -O0` -> 0
Running compile:
Working directory:  /<<PKGBUILDDIR>>/obj-powerpc64le-linux-gnu/meson-private/tmpkv6gupyk
Code:

-----------
Command line: `/usr/bin/powerpc64le-linux-gnu-gcc /<<PKGBUILDDIR>>/obj-powerpc64le-linux-gnu/meson-private/tmpkv6gupyk/testfile.c -o /<<PKGBUILDDIR>>/obj-powerpc64le-linux-gnu/meson-private/tmpkv6gupyk/output.obj -c -Wdate-time -D_FORTIFY_SOURCE=2 -g -O2 -Werror=implicit-function-declaration -ffile-prefix-map=/<<PKGBUILDDIR>>=. -fstack-protector-strong -Wformat -Werror=format-security -D_FILE_OFFSET_BITS=64 -O0 --print-search-dirs` -> 0
stdout:
install: /usr/lib/gcc-cross/powerpc64le-linux-gnu/14/
programs: =/usr/libexec/gcc-cross/powerpc64le-linux-gnu/14/:/usr/libexec/gcc-cross/powerpc64le-linux-gnu/14/:/usr/libexec/gcc-cross/powerpc64le-linux-gnu/:/usr/lib/gcc-cross/powerpc64le-linux-gnu/14/:/usr/lib/gcc-cross/powerpc64le-linux-gnu/:/usr/lib/gcc-cross/powerpc64le-linux-gnu/14/../../../../powerpc64le-linux-gnu/bin/powerpc64le-linux-gnu/14/:/usr/lib/gcc-cross/powerpc64le-linux-gnu/14/../../../../powerpc64le-linux-gnu/bin/powerpc64le-linux-gnu/:/usr/lib/gcc-cross/powerpc64le-linux-gnu/14/../../../../powerpc64le-linux-gnu/bin/
libraries: =/usr/lib/gcc-cross/powerpc64le-linux-gnu/14/:/usr/lib/gcc-cross/powerpc64le-linux-gnu/14/../../../../powerpc64le-linux-gnu/lib/powerpc64le-linux-gnu/14/:/usr/lib/gcc-cross/powerpc64le-linux-gnu/14/../../../../powerpc64le-linux-gnu/lib/powerpc64le-linux-gnu/:/usr/lib/gcc-cross/powerpc64le-linux-gnu/14/../../../../powerpc64le-linux-gnu/lib/../lib/:/lib/powerpc64le-linux-gnu/14/:/lib/powerpc64le-linux-gnu/:/lib/../lib/:/usr/lib/powerpc64le-linux-gnu/14/:/usr/lib/powerpc64le-linux-gnu/:/usr/lib/../lib/:/usr/lib/gcc-cross/powerpc64le-linux-gnu/14/../../../../powerpc64le-linux-gnu/lib/:/lib/:/usr/lib/
-----------
Run-time dependency gio-2.0 found: YES 2.84.0
Determining dependency 'telepathy-glib' with pkg-config executable '/usr/bin/powerpc64le-linux-gnu-pkg-config'
env[PKG_CONFIG_PATH]: 
env[PKG_CONFIG]: /usr/bin/powerpc64le-linux-gnu-pkg-config
-----------
Called: `/usr/bin/powerpc64le-linux-gnu-pkg-config --modversion telepathy-glib` -> 0
stdout:
0.24.2
-----------
env[PKG_CONFIG_PATH]: 
env[PKG_CONFIG]: /usr/bin/powerpc64le-linux-gnu-pkg-config
-----------
Called: `/usr/bin/powerpc64le-linux-gnu-pkg-config --cflags telepathy-glib` -> 0
stdout:
-I/usr/include/telepathy-1.0 -I/usr/include/dbus-1.0 -I/usr/lib/powerpc64le-linux-gnu/dbus-1.0/include -I/usr/include/glib-2.0 -I/usr/lib/powerpc64le-linux-gnu/glib-2.0/include -I/usr/include/sysprof-6 -I/usr/include/libmount -I/usr/include/blkid -pthread
-----------
env[PKG_CONFIG_ALLOW_SYSTEM_LIBS]: 1
env[PKG_CONFIG_PATH]: 
env[PKG_CONFIG]: /usr/bin/powerpc64le-linux-gnu-pkg-config
-----------
Called: `/usr/bin/powerpc64le-linux-gnu-pkg-config --libs telepathy-glib` -> 0
stdout:
-L/usr/lib/powerpc64le-linux-gnu -ltelepathy-glib
-----------
env[PKG_CONFIG_PATH]: 
env[PKG_CONFIG]: /usr/bin/powerpc64le-linux-gnu-pkg-config
-----------
Called: `/usr/bin/powerpc64le-linux-gnu-pkg-config --libs telepathy-glib` -> 0
stdout:
-ltelepathy-glib
-----------
Run-time dependency telepathy-glib found: YES 0.24.2
Determining dependency 'tracker-sparql-3.0' with pkg-config executable '/usr/bin/powerpc64le-linux-gnu-pkg-config'
env[PKG_CONFIG_PATH]: 
env[PKG_CONFIG]: /usr/bin/powerpc64le-linux-gnu-pkg-config
-----------
Called: `/usr/bin/powerpc64le-linux-gnu-pkg-config --modversion tracker-sparql-3.0` -> 0
stdout:
3.8.2
-----------
env[PKG_CONFIG_PATH]: 
env[PKG_CONFIG]: /usr/bin/powerpc64le-linux-gnu-pkg-config
-----------
Called: `/usr/bin/powerpc64le-linux-gnu-pkg-config --cflags tracker-sparql-3.0` -> 0
stdout:
-I/usr/include/tinysparql-3.0 -I/usr/include/tinysparql-3.0/libtracker-sparql -I/usr/include/glib-2.0 -I/usr/lib/powerpc64le-linux-gnu/glib-2.0/include -I/usr/include/sysprof-6 -I/usr/include/libmount -I/usr/include/blkid -I/usr/include/gio-unix-2.0 -I/usr/include/json-glib-1.0 -I/usr/include/libxml2 -pthread
-----------
env[PKG_CONFIG_ALLOW_SYSTEM_LIBS]: 1
env[PKG_CONFIG_PATH]: 
env[PKG_CONFIG]: /usr/bin/powerpc64le-linux-gnu-pkg-config
-----------
Called: `/usr/bin/powerpc64le-linux-gnu-pkg-config --libs tracker-sparql-3.0` -> 0
stdout:
-lm -ldl -L/usr/lib/powerpc64le-linux-gnu -ltinysparql-3.0 -lgio-2.0 -lgobject-2.0 -lglib-2.0
-----------
env[PKG_CONFIG_PATH]: 
env[PKG_CONFIG]: /usr/bin/powerpc64le-linux-gnu-pkg-config
-----------
Called: `/usr/bin/powerpc64le-linux-gnu-pkg-config --libs tracker-sparql-3.0` -> 0
stdout:
-lm -ldl -ltinysparql-3.0 -lgio-2.0 -lgobject-2.0 -lglib-2.0
-----------
Running compile:
Working directory:  /<<PKGBUILDDIR>>/obj-powerpc64le-linux-gnu/meson-private/tmp0wwg8wig
Code:
int main(void) { return 0; }

-----------
Command line: `/usr/bin/powerpc64le-linux-gnu-gcc /<<PKGBUILDDIR>>/obj-powerpc64le-linux-gnu/meson-private/tmp0wwg8wig/testfile.c -o /<<PKGBUILDDIR>>/obj-powerpc64le-linux-gnu/meson-private/tmp0wwg8wig/output.exe -Wdate-time -D_FORTIFY_SOURCE=2 -g -O2 -Werror=implicit-function-declaration -ffile-prefix-map=/<<PKGBUILDDIR>>=. -fstack-protector-strong -Wformat -Werror=format-security -D_FILE_OFFSET_BITS=64 -O0 -lm -Wl,--allow-shlib-undefined -Wl,-z,relro -Wl,-z,now -Wl,-z,defs` -> 0
Running compile:
Working directory:  /<<PKGBUILDDIR>>/obj-powerpc64le-linux-gnu/meson-private/tmptpcnpoj5
Code:
int main(void) { return 0; }

-----------
Command line: `/usr/bin/powerpc64le-linux-gnu-gcc /<<PKGBUILDDIR>>/obj-powerpc64le-linux-gnu/meson-private/tmptpcnpoj5/testfile.c -o /<<PKGBUILDDIR>>/obj-powerpc64le-linux-gnu/meson-private/tmptpcnpoj5/output.exe -Wdate-time -D_FORTIFY_SOURCE=2 -g -O2 -Werror=implicit-function-declaration -ffile-prefix-map=/<<PKGBUILDDIR>>=. -fstack-protector-strong -Wformat -Werror=format-security -D_FILE_OFFSET_BITS=64 -O0 -ldl -Wl,--allow-shlib-undefined -Wl,-z,relro -Wl,-z,now -Wl,-z,defs` -> 0
Run-time dependency tracker-sparql-3.0 found: YES 3.8.2
Determining dependency 'gobject-introspection-1.0' with pkg-config executable '/usr/bin/powerpc64le-linux-gnu-pkg-config'
env[PKG_CONFIG_PATH]: 
env[PKG_CONFIG]: /usr/bin/powerpc64le-linux-gnu-pkg-config
-----------
Called: `/usr/bin/powerpc64le-linux-gnu-pkg-config --modversion gobject-introspection-1.0` -> 0
stdout:
1.84.0
-----------
env[PKG_CONFIG_PATH]: 
env[PKG_CONFIG]: /usr/bin/powerpc64le-linux-gnu-pkg-config
-----------
Called: `/usr/bin/powerpc64le-linux-gnu-pkg-config --cflags gobject-introspection-1.0` -> 0
stdout:
-I/usr/include/gobject-introspection-1.0 -I/usr/include/glib-2.0 -I/usr/lib/powerpc64le-linux-gnu/glib-2.0/include -I/usr/include/sysprof-6 -pthread
-----------
env[PKG_CONFIG_ALLOW_SYSTEM_LIBS]: 1
env[PKG_CONFIG_PATH]: 
env[PKG_CONFIG]: /usr/bin/powerpc64le-linux-gnu-pkg-config
-----------
Called: `/usr/bin/powerpc64le-linux-gnu-pkg-config --libs gobject-introspection-1.0` -> 0
stdout:
-L/usr/lib/powerpc64le-linux-gnu -lgirepository-1.0 -lgobject-2.0 -lglib-2.0
-----------
env[PKG_CONFIG_PATH]: 
env[PKG_CONFIG]: /usr/bin/powerpc64le-linux-gnu-pkg-config
-----------
Called: `/usr/bin/powerpc64le-linux-gnu-pkg-config --libs gobject-introspection-1.0` -> 0
stdout:
-lgirepository-1.0 -lgobject-2.0 -lglib-2.0
-----------
Run-time dependency gobject-introspection-1.0 found: YES 1.84.0
Determining dependency 'gjs-1.0' with pkg-config executable '/usr/bin/powerpc64le-linux-gnu-pkg-config'
env[PKG_CONFIG_PATH]: 
env[PKG_CONFIG]: /usr/bin/powerpc64le-linux-gnu-pkg-config
-----------
Called: `/usr/bin/powerpc64le-linux-gnu-pkg-config --modversion gjs-1.0` -> 0
stdout:
1.82.1
-----------
env[PKG_CONFIG_PATH]: 
env[PKG_CONFIG]: /usr/bin/powerpc64le-linux-gnu-pkg-config
-----------
Called: `/usr/bin/powerpc64le-linux-gnu-pkg-config --cflags gjs-1.0` -> 0
stdout:
-I/usr/include/gjs-1.0 -I/usr/include/glib-2.0 -I/usr/lib/powerpc64le-linux-gnu/glib-2.0/include -I/usr/include/sysprof-6 -I/usr/include/libmount -I/usr/include/blkid -I/usr/include/gobject-introspection-1.0 -I/usr/include/cairo -I/usr/include/libpng16 -I/usr/include/freetype2 -I/usr/include/pixman-1 -pthread -isystem /usr/include/powerpc64le-linux-gnu/mozjs-128
-----------
env[PKG_CONFIG_ALLOW_SYSTEM_LIBS]: 1
env[PKG_CONFIG_PATH]: 
env[PKG_CONFIG]: /usr/bin/powerpc64le-linux-gnu-pkg-config
-----------
Called: `/usr/bin/powerpc64le-linux-gnu-pkg-config --libs gjs-1.0` -> 0
stdout:
-L/usr/lib/powerpc64le-linux-gnu -lgjs -lgio-2.0 -lgobject-2.0 -lglib-2.0
-----------
env[PKG_CONFIG_PATH]: 
env[PKG_CONFIG]: /usr/bin/powerpc64le-linux-gnu-pkg-config
-----------
Called: `/usr/bin/powerpc64le-linux-gnu-pkg-config --libs gjs-1.0` -> 0
stdout:
-lgjs -lgio-2.0 -lgobject-2.0 -lglib-2.0
-----------
Run-time dependency gjs-1.0 found: YES 1.82.1
Running compile:
Working directory:  /<<PKGBUILDDIR>>/obj-powerpc64le-linux-gnu/meson-private/tmphcpojno6
Code:

#include <gjs/gjs.h>
void main(void) { g_autoptr(GjsContext) context = NULL; }

-----------
Command line: `/usr/bin/powerpc64le-linux-gnu-gcc -I/usr/include/gjs-1.0 -I/usr/include/glib-2.0 -I/usr/lib/powerpc64le-linux-gnu/glib-2.0/include -I/usr/include/sysprof-6 -I/usr/include/libmount -I/usr/include/blkid -I/usr/include/gobject-introspection-1.0 -I/usr/include/cairo -I/usr/include/libpng16 -I/usr/include/freetype2 -I/usr/include/pixman-1 /<<PKGBUILDDIR>>/obj-powerpc64le-linux-gnu/meson-private/tmphcpojno6/testfile.c -o /<<PKGBUILDDIR>>/obj-powerpc64le-linux-gnu/meson-private/tmphcpojno6/output.obj -c -pthread -isystem /usr/include/powerpc64le-linux-gnu/mozjs-128 -Wdate-time -D_FORTIFY_SOURCE=2 -g -O2 -Werror=implicit-function-declaration -ffile-prefix-map=/<<PKGBUILDDIR>>=. -fstack-protector-strong -Wformat -Werror=format-security -D_FILE_OFFSET_BITS=64 -O0` -> 0
Running compile:
Working directory:  /<<PKGBUILDDIR>>/obj-powerpc64le-linux-gnu/meson-private/tmpu6g5fuku
Code:

        #define strcasestr meson_disable_define_of_strcasestr
        
        #include <limits.h>
        #undef strcasestr
        
        #ifdef __cplusplus
        extern "C"
        #endif
        char strcasestr (void);
        
        #if defined __stub_strcasestr || defined __stub___strcasestr
        fail fail fail this function is not going to work
        #endif
        
        int main(void) {
          return strcasestr ();
        }
-----------
Command line: `/usr/bin/powerpc64le-linux-gnu-gcc /<<PKGBUILDDIR>>/obj-powerpc64le-linux-gnu/meson-private/tmpu6g5fuku/testfile.c -o /<<PKGBUILDDIR>>/obj-powerpc64le-linux-gnu/meson-private/tmpu6g5fuku/output.exe -Wdate-time -D_FORTIFY_SOURCE=2 -g -O2 -Werror=implicit-function-declaration -ffile-prefix-map=/<<PKGBUILDDIR>>=. -fstack-protector-strong -Wformat -Werror=format-security -D_FILE_OFFSET_BITS=64 -O0 -Wl,-z,relro -Wl,-z,now -Wl,-z,defs` -> 0
Checking for function "strcasestr" : YES 
Configuring config.h using configuration
Pkg-config binary missing from cross or native file, or env var undefined.
Trying a default Pkg-config fallback at pkg-config
Found pkg-config: YES (/usr/bin/pkg-config) 1.8.1
Determining dependency 'gio-2.0' with pkg-config executable '/usr/bin/pkg-config'
env[PKG_CONFIG_PATH]: 
env[PKG_CONFIG]: /usr/bin/pkg-config
-----------
Called: `/usr/bin/pkg-config --modversion gio-2.0` -> 1
stderr:
Package gio-2.0 was not found in the pkg-config search path.
Perhaps you should add the directory containing `gio-2.0.pc'
to the PKG_CONFIG_PATH environment variable
Package 'gio-2.0', required by 'virtual:world', not found
-----------
CMake binary for build machine is not cached
CMake binary missing from cross or native file, or env var undefined.
Trying a default CMake fallback at cmake
Did not find CMake 'cmake'
Found CMake: NO
CMake binary for machine build machine not found. Giving up.
Build-time dependency gio-2.0 found: NO (tried pkgconfig and cmake)
Program glib-compile-schemas found: YES (/usr/bin/glib-compile-schemas)
Program gtk4-update-icon-cache found: YES (/usr/bin/gtk4-update-icon-cache)
Program update-desktop-database found: YES (/usr/bin/update-desktop-database)
Program msgfmt found: YES (/usr/bin/msgfmt)
Determining dependency 'glib-2.0' with pkg-config executable '/usr/bin/pkg-config'
env[PKG_CONFIG_PATH]: 
env[PKG_CONFIG]: /usr/bin/pkg-config
-----------
Called: `/usr/bin/pkg-config --modversion glib-2.0` -> 1
stderr:
Package glib-2.0 was not found in the pkg-config search path.
Perhaps you should add the directory containing `glib-2.0.pc'
to the PKG_CONFIG_PATH environment variable
Package 'glib-2.0', required by 'virtual:world', not found
-----------
WARNING: Could not detect glib version, assuming 2.54. You may get build errors if your glib is older.
CMake binary for build machine is cached as not found
CMake binary for machine build machine not found. Giving up.
Build-time dependency gio-2.0 found: NO (tried pkgconfig and cmake)
Program glib-compile-resources found: YES (/usr/bin/glib-compile-resources)
CMake binary for build machine is cached as not found
CMake binary for machine build machine not found. Giving up.
Build-time dependency gio-2.0 found: NO (tried pkgconfig and cmake)
Program glib-compile-resources found: YES (/usr/bin/glib-compile-resources)
Adding test "Validating org.gnome.Polari.desktop"
Configuring org.freedesktop.Telepathy.Client.Polari.service using configuration
Configuring org.gnome.Polari.service using configuration
Configuring config.js.in using configuration
CMake binary for build machine is cached as not found
CMake binary for machine build machine not found. Giving up.
Build-time dependency gio-2.0 found: NO (tried pkgconfig and cmake)
Program glib-compile-resources found: YES (/usr/bin/glib-compile-resources)
Dependency gobject-introspection-1.0 found: YES 1.84.0 (cached)
Determining dependency 'gobject-introspection-1.0' with pkg-config executable '/usr/bin/pkg-config'
env[PKG_CONFIG_PATH]: 
env[PKG_CONFIG]: /usr/bin/pkg-config
-----------
Called: `/usr/bin/pkg-config --modversion gobject-introspection-1.0` -> 1
stderr:
Package gobject-introspection-1.0 was not found in the pkg-config search path.
Perhaps you should add the directory containing `gobject-introspection-1.0.pc'
to the PKG_CONFIG_PATH environment variable
Package 'gobject-introspection-1.0', required by 'virtual:world', not found
-----------
CMake binary for build machine is cached as not found
CMake binary for machine build machine not found. Giving up.
Build-time dependency gobject-introspection-1.0 found: NO (tried pkgconfig and cmake)
Program g-ir-scanner found: YES (/usr/bin/g-ir-scanner)
CMake binary for build machine is cached as not found
CMake binary for machine build machine not found. Giving up.
Build-time dependency gobject-introspection-1.0 found: NO (tried pkgconfig and cmake)
Program g-ir-compiler found: NO

../src/meson.build:67:6: ERROR: Program 'g-ir-compiler' not found or not executable
dh_auto_configure: error: cd obj-powerpc64le-linux-gnu && DEB_PYTHON_INSTALL_LAYOUT=deb LC_ALL=C.UTF-8 meson setup .. --wrap-mode=nodownload --buildtype=plain --prefix=/usr --sysconfdir=/etc --localstatedir=/var --libdir=lib/powerpc64le-linux-gnu -Dpython.bytecompile=-1 --cross-file /<<PKGBUILDDIR>>/debian/.debhelper/generated/_source/meson-cross-file.conf returned exit code 1
make: *** [debian/rules:7: binary-arch] Error 25
dpkg-buildpackage: error: debian/rules binary-arch subprocess returned exit status 2
--------------------------------------------------------------------------------
Build finished at 2025-03-30T07:53:26Z

+------------------------------------------------------------------------------+
| Finished Timed Build Commands                                                |
+------------------------------------------------------------------------------+


rm -Rf /<<PKGBUILDDIR>>/
----------------------------------------


I: Finished running 'rm -Rf /<<PKGBUILDDIR>>/'.

Finished processing commands.
--------------------------------------------------------------------------------

Finished
--------


+------------------------------------------------------------------------------+
| Cleanup                                                                      |
+------------------------------------------------------------------------------+

Purging /<<BUILDDIR>>
Not cleaning session: cloned chroot in use
E: Build failure (dpkg-buildpackage died)

+------------------------------------------------------------------------------+
| Summary                                                                      |
+------------------------------------------------------------------------------+

Build Architecture: amd64
Build Profiles: cross nocheck
Build Type: any
Build-Space: n/a
Build-Time: 2
Distribution: unstable
Fail-Stage: build
Foreign Architectures: ppc64el
Host Architecture: ppc64el
Install-Time: 29
Job: polari_46.0-2
Machine Architecture: amd64
Package: polari
Package-Time: 41
Source-Version: 46.0-2
Space: n/a
Status: attempted
Version: 46.0-2
--------------------------------------------------------------------------------
Finished at 2025-03-30T07:53:26Z
Build needed 00:00:41, no disk space