sbuild (Debian sbuild) 0.85.0 (04 January 2023) on debian-ci-siliconvalley

+==============================================================================+
| ros2-rcutils 6.9.4-1 (ppc64el)               Wed, 12 Mar 2025 23:31:12 +0000 |
+==============================================================================+

Package: ros2-rcutils
Version: 6.9.4-1
Source Version: 6.9.4-1
Distribution: unstable
Machine Architecture: amd64
Host Architecture: ppc64el
Build Architecture: amd64
Build Profiles: cross nocheck
Build Type: any

I: NOTICE: Log filtering will replace 'var/run/schroot/mount/sid-amd64-sbuild-629de859-f434-48c9-9a26-faa27b243eaa' with '<<CHROOT>>'
I: NOTICE: Log filtering will replace 'build/ros2-rcutils-sf2Fjj/resolver-hbkgFE' with '<<RESOLVERDIR>>'

+------------------------------------------------------------------------------+
| Update chroot                                                                |
+------------------------------------------------------------------------------+

Hit:1 http://localhost:3142/debian unstable InRelease
Get:2 http://localhost:3142/debian unstable/main ppc64el Packages [9919 kB]
Fetched 9919 kB in 1s (11.7 MB/s)
Reading package lists...
Reading package lists...
Building dependency tree...
Reading state information...
Calculating upgrade...
0 upgraded, 0 newly installed, 0 to remove and 0 not upgraded.

+------------------------------------------------------------------------------+
| Fetch source files                                                           |
+------------------------------------------------------------------------------+


Check APT
---------

Checking available source versions...

Download source files with APT
------------------------------

Reading package lists...
NOTICE: 'ros2-rcutils' packaging is maintained in the 'Git' version control system at:
https://salsa.debian.org/robotics-team/ros2-rcutils.git
Please use:
git clone https://salsa.debian.org/robotics-team/ros2-rcutils.git
to retrieve the latest (possibly unreleased) updates to the package.
Need to get 160 kB of source archives.
Get:1 http://localhost:3142/debian unstable/main ros2-rcutils 6.9.4-1 (dsc) [2550 B]
Get:2 http://localhost:3142/debian unstable/main ros2-rcutils 6.9.4-1 (tar) [151 kB]
Get:3 http://localhost:3142/debian unstable/main ros2-rcutils 6.9.4-1 (diff) [6256 B]
Fetched 160 kB in 0s (361 kB/s)
Download complete and in download only mode
I: NOTICE: Log filtering will replace 'build/ros2-rcutils-sf2Fjj/ros2-rcutils-6.9.4' with '<<PKGBUILDDIR>>'
I: NOTICE: Log filtering will replace 'build/ros2-rcutils-sf2Fjj' with '<<BUILDDIR>>'

+------------------------------------------------------------------------------+
| Install package build dependencies                                           |
+------------------------------------------------------------------------------+


Setup apt archive
-----------------

Merged Build-Depends: ament-cmake-python, ament-cmake-ros, cmake, debhelper-compat (= 13), dh-ros, dh-sequence-python3, python3-empy, libc-dev, libstdc++-dev, build-essential:amd64, fakeroot:amd64, crossbuild-essential-ppc64el:amd64, libc-dev:ppc64el, libstdc++-dev:ppc64el
Filtered Build-Depends: ament-cmake-python, ament-cmake-ros, cmake, debhelper-compat (= 13), dh-ros, dh-sequence-python3, python3-empy, libc-dev, libstdc++-dev, build-essential:amd64, fakeroot:amd64, crossbuild-essential-ppc64el:amd64, libc-dev:ppc64el, libstdc++-dev:ppc64el
dpkg-deb: warning: root directory /<<RESOLVERDIR>>/sbuild-build-depends-main-dummy has unusual owner or group 1000:119
dpkg-deb: hint: you might need to pass --root-owner-group, see <https://wiki.debian.org/Teams/Dpkg/RootlessBuilds> for further details
dpkg-deb: warning: ignoring 1 warning about the control file(s)
dpkg-deb: building package 'sbuild-build-depends-main-dummy' in '/<<RESOLVERDIR>>/apt_archive/sbuild-build-depends-main-dummy.deb'.
Ign:1 copy:/<<RESOLVERDIR>>/apt_archive ./ InRelease
Get:2 copy:/<<RESOLVERDIR>>/apt_archive ./ Release [609 B]
Ign:3 copy:/<<RESOLVERDIR>>/apt_archive ./ Release.gpg
Get:4 copy:/<<RESOLVERDIR>>/apt_archive ./ Sources [807 B]
Get:5 copy:/<<RESOLVERDIR>>/apt_archive ./ Packages [852 B]
Fetched 2268 B in 0s (0 B/s)
Reading package lists...
Reading package lists...

Install main build dependencies (apt-based resolver)
----------------------------------------------------

Installing build dependencies
Reading package lists...
Building dependency tree...
Reading state information...
Execute external solver...
The following additional packages will be installed:
  ament-cmake ament-cmake-core ament-cmake-googletest ament-cmake-pytest
  ament-cmake-python ament-cmake-ros autoconf automake autopoint autotools-dev
  binutils-powerpc64le-linux-gnu bsdextrautils cmake cmake-data
  cpp-14-powerpc64le-linux-gnu cpp-powerpc64le-linux-gnu
  crossbuild-essential-ppc64el debhelper dh-autoreconf dh-python dh-ros
  dh-strip-nondeterminism docutils-common dwz fakeroot file
  g++-14-powerpc64le-linux-gnu g++-powerpc64le-linux-gnu gcc-14-base:ppc64el
  gcc-14-cross-base gcc-14-powerpc64le-linux-gnu
  gcc-14-powerpc64le-linux-gnu-base gcc-powerpc64le-linux-gnu gettext
  gettext-base googletest groff-base intltool-debian libarchive-zip-perl
  libarchive13t64 libasan8:ppc64el libasan8-ppc64el-cross libatomic1:ppc64el
  libatomic1-ppc64el-cross libbrotli1 libc6:ppc64el libc6-dev:ppc64el
  libc6-dev-ppc64el-cross libc6-ppc64el-cross libcom-err2 libcrypt-dev:ppc64el
  libcrypt1:ppc64el libcurl4t64 libdebhelper-perl libelf1t64 libexpat1
  libfakeroot libffi8 libfile-stripnondeterminism-perl libgcc-14-dev:ppc64el
  libgcc-14-dev-ppc64el-cross libgcc-s1:ppc64el libgcc-s1-ppc64el-cross
  libgmock-dev libgnutls30t64 libgomp1:ppc64el libgomp1-ppc64el-cross
  libgssapi-krb5-2 libgtest-dev libicu72 libidn2-0 libitm1:ppc64el
  libitm1-ppc64el-cross libjsoncpp26 libk5crypto3 libkeyutils1 libkrb5-3
  libkrb5support0 libldap2 liblsan0:ppc64el liblsan0-ppc64el-cross
  libmagic-mgc libmagic1t64 libncursesw6 libnghttp2-14 libnghttp3-9
  libp11-kit0 libpipeline1 libproc2-0 libpsl5t64 libpython3-stdlib
  libpython3.13-minimal libpython3.13-stdlib libquadmath0:ppc64el
  libquadmath0-ppc64el-cross libreadline8t64 librhash1 librtmp1 libsasl2-2
  libsasl2-modules-db libsqlite3-0 libssh2-1t64 libstdc++-14-dev:ppc64el
  libstdc++-14-dev-ppc64el-cross libstdc++6:ppc64el libstdc++6-ppc64el-cross
  libtasn1-6 libtool libtsan2:ppc64el libtsan2-ppc64el-cross libubsan1:ppc64el
  libubsan1-ppc64el-cross libuchardet0 libunistring5 libuv1t64 libxml2
  linux-libc-dev-ppc64el-cross m4 man-db media-types netbase po-debconf procps
  python3 python3-ament-cmake-test python3-ament-package python3-autocommand
  python3-catkin-pkg python3-dateutil python3-docutils
  python3-domain-coordinator python3-empy python3-inflect python3-iniconfig
  python3-jaraco.context python3-jaraco.functools python3-jaraco.text
  python3-minimal python3-more-itertools python3-packaging
  python3-pkg-resources python3-pluggy python3-pyparsing python3-pytest
  python3-roman python3-setuptools python3-typeguard python3-typing-extensions
  python3-zipp python3.13 python3.13-minimal readline-common sensible-utils
  sgml-base xml-core
Suggested packages:
  autoconf-archive gnu-standards autoconf-doc binutils-doc cmake-doc
  cmake-format elpa-cmake-mode ninja-build gcc-14-locales cpp-14-doc cpp-doc
  dh-make flit python3-build python3-installer python3-wheel gcc-14-doc
  manpages-dev flex bison gdb-powerpc64le-linux-gnu gcc-doc gettext-doc
  libasprintf-dev libgettextpo-dev groff lrzip glibc-doc:ppc64el
  libc-l10n:ppc64el locales:ppc64el libnss-nis:ppc64el libnss-nisplus:ppc64el
  manpages-dev:ppc64el gnutls-bin krb5-doc krb5-user libstdc++-14-doc:ppc64el
  libtool-doc gfortran | fortran95-compiler gcj-jdk m4-doc apparmor less
  www-browser libmail-box-perl python3-doc python3-tk python3-venv
  docutils-doc fonts-linuxlibertine | ttf-linux-libertine texlive-lang-french
  texlive-latex-base texlive-latex-recommended python-pyparsing-doc
  python-setuptools-doc python3.13-venv python3.13-doc binfmt-support
  readline-doc sgml-base-doc
Recommended packages:
  curl | wget | lynx libidn2-0:ppc64el ca-certificates libarchive-cpio-perl
  krb5-locales libldap-common libgpm2 publicsuffix libsasl2-modules
  libltdl-dev libmail-sendmail-perl psmisc linux-sysctl-defaults
  libpaper-utils python3-pil python3-pygments
The following NEW packages will be installed:
  ament-cmake ament-cmake-core ament-cmake-googletest ament-cmake-pytest
  ament-cmake-python ament-cmake-ros autoconf automake autopoint autotools-dev
  binutils-powerpc64le-linux-gnu bsdextrautils cmake cmake-data
  cpp-14-powerpc64le-linux-gnu cpp-powerpc64le-linux-gnu
  crossbuild-essential-ppc64el debhelper dh-autoreconf dh-python dh-ros
  dh-strip-nondeterminism docutils-common dwz fakeroot file
  g++-14-powerpc64le-linux-gnu g++-powerpc64le-linux-gnu gcc-14-base:ppc64el
  gcc-14-cross-base gcc-14-powerpc64le-linux-gnu
  gcc-14-powerpc64le-linux-gnu-base gcc-powerpc64le-linux-gnu gettext
  gettext-base googletest groff-base intltool-debian libarchive-zip-perl
  libarchive13t64 libasan8:ppc64el libasan8-ppc64el-cross libatomic1:ppc64el
  libatomic1-ppc64el-cross libbrotli1 libc6:ppc64el libc6-dev:ppc64el
  libc6-dev-ppc64el-cross libc6-ppc64el-cross libcom-err2 libcrypt-dev:ppc64el
  libcrypt1:ppc64el libcurl4t64 libdebhelper-perl libelf1t64 libexpat1
  libfakeroot libffi8 libfile-stripnondeterminism-perl libgcc-14-dev:ppc64el
  libgcc-14-dev-ppc64el-cross libgcc-s1:ppc64el libgcc-s1-ppc64el-cross
  libgmock-dev libgnutls30t64 libgomp1:ppc64el libgomp1-ppc64el-cross
  libgssapi-krb5-2 libgtest-dev libicu72 libidn2-0 libitm1:ppc64el
  libitm1-ppc64el-cross libjsoncpp26 libk5crypto3 libkeyutils1 libkrb5-3
  libkrb5support0 libldap2 liblsan0:ppc64el liblsan0-ppc64el-cross
  libmagic-mgc libmagic1t64 libncursesw6 libnghttp2-14 libnghttp3-9
  libp11-kit0 libpipeline1 libproc2-0 libpsl5t64 libpython3-stdlib
  libpython3.13-minimal libpython3.13-stdlib libquadmath0:ppc64el
  libquadmath0-ppc64el-cross libreadline8t64 librhash1 librtmp1 libsasl2-2
  libsasl2-modules-db libsqlite3-0 libssh2-1t64 libstdc++-14-dev:ppc64el
  libstdc++-14-dev-ppc64el-cross libstdc++6:ppc64el libstdc++6-ppc64el-cross
  libtasn1-6 libtool libtsan2:ppc64el libtsan2-ppc64el-cross libubsan1:ppc64el
  libubsan1-ppc64el-cross libuchardet0 libunistring5 libuv1t64 libxml2
  linux-libc-dev-ppc64el-cross m4 man-db media-types netbase po-debconf procps
  python3 python3-ament-cmake-test python3-ament-package python3-autocommand
  python3-catkin-pkg python3-dateutil python3-docutils
  python3-domain-coordinator python3-empy python3-inflect python3-iniconfig
  python3-jaraco.context python3-jaraco.functools python3-jaraco.text
  python3-minimal python3-more-itertools python3-packaging
  python3-pkg-resources python3-pluggy python3-pyparsing python3-pytest
  python3-roman python3-setuptools python3-typeguard python3-typing-extensions
  python3-zipp python3.13 python3.13-minimal readline-common
  sbuild-build-depends-main-dummy:ppc64el sensible-utils sgml-base xml-core
0 upgraded, 156 newly installed, 0 to remove and 0 not upgraded.
Need to get 130 MB of archives.
After this operation, 530 MB of additional disk space will be used.
Get:1 copy:/<<RESOLVERDIR>>/apt_archive ./ sbuild-build-depends-main-dummy 0.invalid.0 [964 B]
Get:2 http://localhost:3142/debian unstable/main amd64 libpython3.13-minimal amd64 3.13.2-1 [859 kB]
Get:3 http://localhost:3142/debian unstable/main amd64 libexpat1 amd64 2.6.4-1 [106 kB]
Get:4 http://localhost:3142/debian unstable/main amd64 python3.13-minimal amd64 3.13.2-1 [2205 kB]
Get:5 http://localhost:3142/debian unstable/main amd64 python3-minimal amd64 3.13.2-2 [27.1 kB]
Get:6 http://localhost:3142/debian unstable/main amd64 media-types all 13.0.0 [29.3 kB]
Get:7 http://localhost:3142/debian unstable/main amd64 netbase all 6.4 [12.8 kB]
Get:8 http://localhost:3142/debian unstable/main amd64 libffi8 amd64 3.4.7-1 [23.9 kB]
Get:9 http://localhost:3142/debian unstable/main amd64 libncursesw6 amd64 6.5+20250216-2 [135 kB]
Get:10 http://localhost:3142/debian unstable/main amd64 readline-common all 8.2-6 [69.4 kB]
Get:11 http://localhost:3142/debian unstable/main amd64 libreadline8t64 amd64 8.2-6 [169 kB]
Get:12 http://localhost:3142/debian unstable/main amd64 libsqlite3-0 amd64 3.46.1-2 [913 kB]
Get:13 http://localhost:3142/debian unstable/main amd64 libpython3.13-stdlib amd64 3.13.2-1 [1979 kB]
Get:14 http://localhost:3142/debian unstable/main amd64 python3.13 amd64 3.13.2-1 [745 kB]
Get:15 http://localhost:3142/debian unstable/main amd64 libpython3-stdlib amd64 3.13.2-2 [10.1 kB]
Get:16 http://localhost:3142/debian unstable/main amd64 python3 amd64 3.13.2-2 [28.1 kB]
Get:17 http://localhost:3142/debian unstable/main amd64 sgml-base all 1.31 [15.4 kB]
Get:18 http://localhost:3142/debian unstable/main amd64 libproc2-0 amd64 2:4.0.4-7 [64.9 kB]
Get:19 http://localhost:3142/debian unstable/main amd64 procps amd64 2:4.0.4-7 [878 kB]
Get:20 http://localhost:3142/debian unstable/main amd64 sensible-utils all 0.0.24 [24.8 kB]
Get:21 http://localhost:3142/debian unstable/main amd64 libmagic-mgc amd64 1:5.45-3+b1 [314 kB]
Get:22 http://localhost:3142/debian unstable/main amd64 libmagic1t64 amd64 1:5.45-3+b1 [108 kB]
Get:23 http://localhost:3142/debian unstable/main amd64 file amd64 1:5.45-3+b1 [43.3 kB]
Get:24 http://localhost:3142/debian unstable/main amd64 gettext-base amd64 0.23.1-1 [243 kB]
Get:25 http://localhost:3142/debian unstable/main amd64 libuchardet0 amd64 0.0.8-1+b2 [68.9 kB]
Get:26 http://localhost:3142/debian unstable/main amd64 groff-base amd64 1.23.0-7 [1185 kB]
Get:27 http://localhost:3142/debian unstable/main amd64 bsdextrautils amd64 2.40.4-5 [92.4 kB]
Get:28 http://localhost:3142/debian unstable/main amd64 libpipeline1 amd64 1.5.8-1 [42.0 kB]
Get:29 http://localhost:3142/debian unstable/main amd64 man-db amd64 2.13.0-1 [1420 kB]
Get:30 http://localhost:3142/debian unstable/main amd64 cmake-data all 3.31.6-1 [2268 kB]
Get:31 http://localhost:3142/debian unstable/main amd64 libicu72 amd64 72.1-6 [9421 kB]
Get:32 http://localhost:3142/debian unstable/main amd64 libxml2 amd64 2.12.7+dfsg+really2.9.14-0.2+b2 [699 kB]
Get:33 http://localhost:3142/debian unstable/main amd64 libarchive13t64 amd64 3.7.4-1.1 [349 kB]
Get:34 http://localhost:3142/debian unstable/main amd64 libbrotli1 amd64 1.1.0-2+b7 [307 kB]
Get:35 http://localhost:3142/debian unstable/main amd64 libkrb5support0 amd64 1.21.3-4 [32.8 kB]
Get:36 http://localhost:3142/debian unstable/main amd64 libcom-err2 amd64 1.47.2-1 [24.0 kB]
Get:37 http://localhost:3142/debian unstable/main amd64 libk5crypto3 amd64 1.21.3-4 [80.9 kB]
Get:38 http://localhost:3142/debian unstable/main amd64 libkeyutils1 amd64 1.6.3-4 [9092 B]
Get:39 http://localhost:3142/debian unstable/main amd64 libkrb5-3 amd64 1.21.3-4 [326 kB]
Get:40 http://localhost:3142/debian unstable/main amd64 libgssapi-krb5-2 amd64 1.21.3-4 [138 kB]
Get:41 http://localhost:3142/debian unstable/main amd64 libunistring5 amd64 1.3-1 [476 kB]
Get:42 http://localhost:3142/debian unstable/main amd64 libidn2-0 amd64 2.3.8-1 [109 kB]
Get:43 http://localhost:3142/debian unstable/main amd64 libsasl2-modules-db amd64 2.1.28+dfsg1-9 [19.8 kB]
Get:44 http://localhost:3142/debian unstable/main amd64 libsasl2-2 amd64 2.1.28+dfsg1-9 [57.5 kB]
Get:45 http://localhost:3142/debian unstable/main amd64 libldap2 amd64 2.6.9+dfsg-2 [194 kB]
Get:46 http://localhost:3142/debian unstable/main amd64 libnghttp2-14 amd64 1.64.0-1 [75.5 kB]
Get:47 http://localhost:3142/debian unstable/main amd64 libnghttp3-9 amd64 1.8.0-1 [67.7 kB]
Get:48 http://localhost:3142/debian unstable/main amd64 libpsl5t64 amd64 0.21.2-1.1+b1 [57.2 kB]
Get:49 http://localhost:3142/debian unstable/main amd64 libp11-kit0 amd64 0.25.5-3 [425 kB]
Get:50 http://localhost:3142/debian unstable/main amd64 libtasn1-6 amd64 4.20.0-2 [49.9 kB]
Get:51 http://localhost:3142/debian unstable/main amd64 libgnutls30t64 amd64 3.8.9-2 [1464 kB]
Get:52 http://localhost:3142/debian unstable/main amd64 librtmp1 amd64 2.4+20151223.gitfa8646d.1-2+b5 [58.8 kB]
Get:53 http://localhost:3142/debian unstable/main amd64 libssh2-1t64 amd64 1.11.1-1 [245 kB]
Get:54 http://localhost:3142/debian unstable/main amd64 libcurl4t64 amd64 8.12.1-3 [369 kB]
Get:55 http://localhost:3142/debian unstable/main amd64 libjsoncpp26 amd64 1.9.6-3 [81.7 kB]
Get:56 http://localhost:3142/debian unstable/main amd64 librhash1 amd64 1.4.5-1 [132 kB]
Get:57 http://localhost:3142/debian unstable/main amd64 libuv1t64 amd64 1.50.0-2 [154 kB]
Get:58 http://localhost:3142/debian unstable/main amd64 cmake amd64 3.31.6-1 [12.0 MB]
Get:59 http://localhost:3142/debian unstable/main amd64 python3-ament-package all 0.17.1-1 [16.7 kB]
Get:60 http://localhost:3142/debian unstable/main amd64 python3-dateutil all 2.9.0-3 [79.3 kB]
Get:61 http://localhost:3142/debian unstable/main amd64 xml-core all 0.19 [20.1 kB]
Get:62 http://localhost:3142/debian unstable/main amd64 docutils-common all 0.21.2+dfsg-2 [128 kB]
Get:63 http://localhost:3142/debian unstable/main amd64 python3-roman all 5.0-1 [10.6 kB]
Get:64 http://localhost:3142/debian unstable/main amd64 python3-docutils all 0.21.2+dfsg-2 [403 kB]
Get:65 http://localhost:3142/debian unstable/main amd64 python3-autocommand all 2.2.2-3 [13.6 kB]
Get:66 http://localhost:3142/debian unstable/main amd64 python3-more-itertools all 10.6.0-1 [65.3 kB]
Get:67 http://localhost:3142/debian unstable/main amd64 python3-typing-extensions all 4.12.2-2 [73.0 kB]
Get:68 http://localhost:3142/debian unstable/main amd64 python3-typeguard all 4.4.2-1 [37.3 kB]
Get:69 http://localhost:3142/debian unstable/main amd64 python3-inflect all 7.3.1-2 [32.4 kB]
Get:70 http://localhost:3142/debian unstable/main amd64 python3-jaraco.functools all 4.1.0-1 [12.0 kB]
Get:71 http://localhost:3142/debian unstable/main amd64 python3-jaraco.text all 4.0.0-1 [11.4 kB]
Get:72 http://localhost:3142/debian unstable/main amd64 python3-zipp all 3.21.0-1 [10.6 kB]
Get:73 http://localhost:3142/debian unstable/main amd64 python3-setuptools all 75.8.0-1 [724 kB]
Get:74 http://localhost:3142/debian unstable/main amd64 python3-jaraco.context all 6.0.1-1 [8276 B]
Get:75 http://localhost:3142/debian unstable/main amd64 python3-pkg-resources all 75.8.0-1 [222 kB]
Get:76 http://localhost:3142/debian unstable/main amd64 python3-pyparsing all 3.1.2-1 [146 kB]
Get:77 http://localhost:3142/debian unstable/main amd64 python3-catkin-pkg all 1.0.0-2 [48.6 kB]
Get:78 http://localhost:3142/debian unstable/main amd64 ament-cmake-core all 2.7.2-1 [23.7 kB]
Get:79 http://localhost:3142/debian unstable/main amd64 ament-cmake-python all 2.7.2-1 [8060 B]
Get:80 http://localhost:3142/debian unstable/main amd64 python3-ament-cmake-test all 2.7.2-1 [11.6 kB]
Get:81 http://localhost:3142/debian unstable/main amd64 ament-cmake all 2.7.2-1 [28.3 kB]
Get:82 http://localhost:3142/debian unstable/main amd64 googletest all 1.16.0-1 [517 kB]
Get:83 http://localhost:3142/debian unstable/main amd64 libgtest-dev amd64 1.16.0-1 [259 kB]
Get:84 http://localhost:3142/debian unstable/main amd64 libgmock-dev amd64 1.16.0-1 [133 kB]
Get:85 http://localhost:3142/debian unstable/main amd64 ament-cmake-googletest amd64 2.7.2-1 [7916 B]
Get:86 http://localhost:3142/debian unstable/main amd64 python3-iniconfig all 1.1.1-2 [6396 B]
Get:87 http://localhost:3142/debian unstable/main amd64 python3-packaging all 24.2-1 [55.3 kB]
Get:88 http://localhost:3142/debian unstable/main amd64 python3-pluggy all 1.5.0-1 [26.9 kB]
Get:89 http://localhost:3142/debian unstable/main amd64 python3-pytest all 8.3.5-1 [250 kB]
Get:90 http://localhost:3142/debian unstable/main amd64 ament-cmake-pytest all 2.7.2-1 [7668 B]
Get:91 http://localhost:3142/debian unstable/main amd64 python3-domain-coordinator all 0.13.1-2 [4924 B]
Get:92 http://localhost:3142/debian unstable/main amd64 ament-cmake-ros all 0.13.1-2 [6384 B]
Get:93 http://localhost:3142/debian unstable/main amd64 m4 amd64 1.4.19-7 [294 kB]
Get:94 http://localhost:3142/debian unstable/main amd64 autoconf all 2.72-3 [493 kB]
Get:95 http://localhost:3142/debian unstable/main amd64 autotools-dev all 20220109.1 [51.6 kB]
Get:96 http://localhost:3142/debian unstable/main amd64 automake all 1:1.17-3 [862 kB]
Get:97 http://localhost:3142/debian unstable/main amd64 autopoint all 0.23.1-1 [770 kB]
Get:98 http://localhost:3142/debian unstable/main amd64 binutils-powerpc64le-linux-gnu amd64 2.44-3 [1514 kB]
Get:99 http://localhost:3142/debian unstable/main amd64 gcc-14-powerpc64le-linux-gnu-base amd64 14.2.0-12cross1 [48.5 kB]
Get:100 http://localhost:3142/debian unstable/main amd64 cpp-14-powerpc64le-linux-gnu amd64 14.2.0-12cross1 [10.2 MB]
Get:101 http://localhost:3142/debian unstable/main amd64 cpp-powerpc64le-linux-gnu amd64 4:14.2.0-1 [4860 B]
Get:102 http://localhost:3142/debian unstable/main amd64 gcc-14-cross-base all 14.2.0-12cross1 [43.7 kB]
Get:103 http://localhost:3142/debian unstable/main amd64 libc6-ppc64el-cross all 2.41-4cross1 [1427 kB]
Get:104 http://localhost:3142/debian unstable/main amd64 libgcc-s1-ppc64el-cross all 14.2.0-12cross1 [35.5 kB]
Get:105 http://localhost:3142/debian unstable/main amd64 libgomp1-ppc64el-cross all 14.2.0-12cross1 [135 kB]
Get:106 http://localhost:3142/debian unstable/main amd64 libitm1-ppc64el-cross all 14.2.0-12cross1 [28.0 kB]
Get:107 http://localhost:3142/debian unstable/main amd64 libatomic1-ppc64el-cross all 14.2.0-12cross1 [9628 B]
Get:108 http://localhost:3142/debian unstable/main amd64 libasan8-ppc64el-cross all 14.2.0-12cross1 [2644 kB]
Get:109 http://localhost:3142/debian unstable/main amd64 liblsan0-ppc64el-cross all 14.2.0-12cross1 [1202 kB]
Get:110 http://localhost:3142/debian unstable/main amd64 libtsan2-ppc64el-cross all 14.2.0-12cross1 [2409 kB]
Get:111 http://localhost:3142/debian unstable/main amd64 libstdc++6-ppc64el-cross all 14.2.0-12cross1 [747 kB]
Get:112 http://localhost:3142/debian unstable/main amd64 libubsan1-ppc64el-cross all 14.2.0-12cross1 [1079 kB]
Get:113 http://localhost:3142/debian unstable/main amd64 libquadmath0-ppc64el-cross all 14.2.0-12cross1 [151 kB]
Get:114 http://localhost:3142/debian unstable/main amd64 libgcc-14-dev-ppc64el-cross all 14.2.0-12cross1 [1417 kB]
Get:115 http://localhost:3142/debian unstable/main amd64 gcc-14-powerpc64le-linux-gnu amd64 14.2.0-12cross1 [19.6 MB]
Get:116 http://localhost:3142/debian unstable/main amd64 gcc-powerpc64le-linux-gnu amd64 4:14.2.0-1 [1460 B]
Get:117 http://localhost:3142/debian unstable/main amd64 linux-libc-dev-ppc64el-cross all 6.12.17-1cross1 [2356 kB]
Get:118 http://localhost:3142/debian unstable/main amd64 libc6-dev-ppc64el-cross all 2.41-4cross1 [1894 kB]
Get:119 http://localhost:3142/debian unstable/main amd64 libstdc++-14-dev-ppc64el-cross all 14.2.0-12cross1 [2504 kB]
Get:120 http://localhost:3142/debian unstable/main amd64 g++-14-powerpc64le-linux-gnu amd64 14.2.0-12cross1 [11.2 MB]
Get:121 http://localhost:3142/debian unstable/main amd64 g++-powerpc64le-linux-gnu amd64 4:14.2.0-1 [1212 B]
Get:122 http://localhost:3142/debian unstable/main amd64 crossbuild-essential-ppc64el all 12.12 [3560 B]
Get:123 http://localhost:3142/debian unstable/main amd64 libdebhelper-perl all 13.24.1 [90.9 kB]
Get:124 http://localhost:3142/debian unstable/main amd64 libtool all 2.5.4-4 [539 kB]
Get:125 http://localhost:3142/debian unstable/main amd64 dh-autoreconf all 20 [17.1 kB]
Get:126 http://localhost:3142/debian unstable/main amd64 libarchive-zip-perl all 1.68-1 [104 kB]
Get:127 http://localhost:3142/debian unstable/main amd64 libfile-stripnondeterminism-perl all 1.14.1-2 [19.7 kB]
Get:128 http://localhost:3142/debian unstable/main amd64 dh-strip-nondeterminism all 1.14.1-2 [8620 B]
Get:129 http://localhost:3142/debian unstable/main amd64 libelf1t64 amd64 0.192-4 [189 kB]
Get:130 http://localhost:3142/debian unstable/main amd64 dwz amd64 0.15-1+b1 [110 kB]
Get:131 http://localhost:3142/debian unstable/main amd64 gettext amd64 0.23.1-1 [1680 kB]
Get:132 http://localhost:3142/debian unstable/main amd64 intltool-debian all 0.35.0+20060710.6 [22.9 kB]
Get:133 http://localhost:3142/debian unstable/main amd64 po-debconf all 1.0.21+nmu1 [248 kB]
Get:134 http://localhost:3142/debian unstable/main amd64 debhelper all 13.24.1 [920 kB]
Get:135 http://localhost:3142/debian unstable/main amd64 dh-python all 6.20250308 [115 kB]
Get:136 http://localhost:3142/debian unstable/main amd64 dh-ros all 0.14.1 [13.9 kB]
Get:137 http://localhost:3142/debian unstable/main amd64 libfakeroot amd64 1.37-1 [29.7 kB]
Get:138 http://localhost:3142/debian unstable/main amd64 fakeroot amd64 1.37-1 [75.6 kB]
Get:139 http://localhost:3142/debian unstable/main ppc64el gcc-14-base ppc64el 14.2.0-18 [49.4 kB]
Get:140 http://localhost:3142/debian unstable/main ppc64el libgcc-s1 ppc64el 14.2.0-18 [35.5 kB]
Get:141 http://localhost:3142/debian unstable/main ppc64el libc6 ppc64el 2.41-4 [2758 kB]
Get:142 http://localhost:3142/debian unstable/main ppc64el libasan8 ppc64el 14.2.0-18 [2650 kB]
Get:143 http://localhost:3142/debian unstable/main ppc64el libatomic1 ppc64el 14.2.0-18 [9952 B]
Get:144 http://localhost:3142/debian unstable/main ppc64el libcrypt1 ppc64el 1:4.4.38-1 [98.0 kB]
Get:145 http://localhost:3142/debian unstable/main ppc64el libcrypt-dev ppc64el 1:4.4.38-1 [132 kB]
Get:146 http://localhost:3142/debian unstable/main ppc64el libc6-dev ppc64el 2.41-4 [1900 kB]
Get:147 http://localhost:3142/debian unstable/main ppc64el libgomp1 ppc64el 14.2.0-18 [143 kB]
Get:148 http://localhost:3142/debian unstable/main ppc64el libitm1 ppc64el 14.2.0-18 [28.5 kB]
Get:149 http://localhost:3142/debian unstable/main ppc64el liblsan0 ppc64el 14.2.0-18 [1202 kB]
Get:150 http://localhost:3142/debian unstable/main ppc64el libtsan2 ppc64el 14.2.0-18 [2416 kB]
Get:151 http://localhost:3142/debian unstable/main ppc64el libstdc++6 ppc64el 14.2.0-18 [797 kB]
Get:152 http://localhost:3142/debian unstable/main ppc64el libubsan1 ppc64el 14.2.0-18 [1079 kB]
Get:153 http://localhost:3142/debian unstable/main ppc64el libquadmath0 ppc64el 14.2.0-18 [151 kB]
Get:154 http://localhost:3142/debian unstable/main ppc64el libgcc-14-dev ppc64el 14.2.0-18 [1410 kB]
Get:155 http://localhost:3142/debian unstable/main ppc64el libstdc++-14-dev ppc64el 14.2.0-18 [2507 kB]
Get:156 http://localhost:3142/debian unstable/main amd64 python3-empy all 3.3.4-2 [66.1 kB]
Preconfiguring packages ...
Fetched 130 MB in 1s (198 MB/s)
Selecting previously unselected package libpython3.13-minimal:amd64.
(Reading database ... 12838 files and directories currently installed.)
Preparing to unpack .../libpython3.13-minimal_3.13.2-1_amd64.deb ...
Unpacking libpython3.13-minimal:amd64 (3.13.2-1) ...
Selecting previously unselected package libexpat1:amd64.
Preparing to unpack .../libexpat1_2.6.4-1_amd64.deb ...
Unpacking libexpat1:amd64 (2.6.4-1) ...
Selecting previously unselected package python3.13-minimal.
Preparing to unpack .../python3.13-minimal_3.13.2-1_amd64.deb ...
Unpacking python3.13-minimal (3.13.2-1) ...
Setting up libpython3.13-minimal:amd64 (3.13.2-1) ...
Setting up libexpat1:amd64 (2.6.4-1) ...
Setting up python3.13-minimal (3.13.2-1) ...
Selecting previously unselected package python3-minimal.
(Reading database ... 13172 files and directories currently installed.)
Preparing to unpack .../00-python3-minimal_3.13.2-2_amd64.deb ...
Unpacking python3-minimal (3.13.2-2) ...
Selecting previously unselected package media-types.
Preparing to unpack .../01-media-types_13.0.0_all.deb ...
Unpacking media-types (13.0.0) ...
Selecting previously unselected package netbase.
Preparing to unpack .../02-netbase_6.4_all.deb ...
Unpacking netbase (6.4) ...
Selecting previously unselected package libffi8:amd64.
Preparing to unpack .../03-libffi8_3.4.7-1_amd64.deb ...
Unpacking libffi8:amd64 (3.4.7-1) ...
Selecting previously unselected package libncursesw6:amd64.
Preparing to unpack .../04-libncursesw6_6.5+20250216-2_amd64.deb ...
Unpacking libncursesw6:amd64 (6.5+20250216-2) ...
Selecting previously unselected package readline-common.
Preparing to unpack .../05-readline-common_8.2-6_all.deb ...
Unpacking readline-common (8.2-6) ...
Selecting previously unselected package libreadline8t64:amd64.
Preparing to unpack .../06-libreadline8t64_8.2-6_amd64.deb ...
Adding 'diversion of /lib/x86_64-linux-gnu/libhistory.so.8 to /lib/x86_64-linux-gnu/libhistory.so.8.usr-is-merged by libreadline8t64'
Adding 'diversion of /lib/x86_64-linux-gnu/libhistory.so.8.2 to /lib/x86_64-linux-gnu/libhistory.so.8.2.usr-is-merged by libreadline8t64'
Adding 'diversion of /lib/x86_64-linux-gnu/libreadline.so.8 to /lib/x86_64-linux-gnu/libreadline.so.8.usr-is-merged by libreadline8t64'
Adding 'diversion of /lib/x86_64-linux-gnu/libreadline.so.8.2 to /lib/x86_64-linux-gnu/libreadline.so.8.2.usr-is-merged by libreadline8t64'
Unpacking libreadline8t64:amd64 (8.2-6) ...
Selecting previously unselected package libsqlite3-0:amd64.
Preparing to unpack .../07-libsqlite3-0_3.46.1-2_amd64.deb ...
Unpacking libsqlite3-0:amd64 (3.46.1-2) ...
Selecting previously unselected package libpython3.13-stdlib:amd64.
Preparing to unpack .../08-libpython3.13-stdlib_3.13.2-1_amd64.deb ...
Unpacking libpython3.13-stdlib:amd64 (3.13.2-1) ...
Selecting previously unselected package python3.13.
Preparing to unpack .../09-python3.13_3.13.2-1_amd64.deb ...
Unpacking python3.13 (3.13.2-1) ...
Selecting previously unselected package libpython3-stdlib:amd64.
Preparing to unpack .../10-libpython3-stdlib_3.13.2-2_amd64.deb ...
Unpacking libpython3-stdlib:amd64 (3.13.2-2) ...
Setting up python3-minimal (3.13.2-2) ...
Selecting previously unselected package python3.
(Reading database ... 13683 files and directories currently installed.)
Preparing to unpack .../000-python3_3.13.2-2_amd64.deb ...
Unpacking python3 (3.13.2-2) ...
Selecting previously unselected package sgml-base.
Preparing to unpack .../001-sgml-base_1.31_all.deb ...
Unpacking sgml-base (1.31) ...
Selecting previously unselected package libproc2-0:amd64.
Preparing to unpack .../002-libproc2-0_2%3a4.0.4-7_amd64.deb ...
Unpacking libproc2-0:amd64 (2:4.0.4-7) ...
Selecting previously unselected package procps.
Preparing to unpack .../003-procps_2%3a4.0.4-7_amd64.deb ...
Unpacking procps (2:4.0.4-7) ...
Selecting previously unselected package sensible-utils.
Preparing to unpack .../004-sensible-utils_0.0.24_all.deb ...
Unpacking sensible-utils (0.0.24) ...
Selecting previously unselected package libmagic-mgc.
Preparing to unpack .../005-libmagic-mgc_1%3a5.45-3+b1_amd64.deb ...
Unpacking libmagic-mgc (1:5.45-3+b1) ...
Selecting previously unselected package libmagic1t64:amd64.
Preparing to unpack .../006-libmagic1t64_1%3a5.45-3+b1_amd64.deb ...
Unpacking libmagic1t64:amd64 (1:5.45-3+b1) ...
Selecting previously unselected package file.
Preparing to unpack .../007-file_1%3a5.45-3+b1_amd64.deb ...
Unpacking file (1:5.45-3+b1) ...
Selecting previously unselected package gettext-base.
Preparing to unpack .../008-gettext-base_0.23.1-1_amd64.deb ...
Unpacking gettext-base (0.23.1-1) ...
Selecting previously unselected package libuchardet0:amd64.
Preparing to unpack .../009-libuchardet0_0.0.8-1+b2_amd64.deb ...
Unpacking libuchardet0:amd64 (0.0.8-1+b2) ...
Selecting previously unselected package groff-base.
Preparing to unpack .../010-groff-base_1.23.0-7_amd64.deb ...
Unpacking groff-base (1.23.0-7) ...
Selecting previously unselected package bsdextrautils.
Preparing to unpack .../011-bsdextrautils_2.40.4-5_amd64.deb ...
Unpacking bsdextrautils (2.40.4-5) ...
Selecting previously unselected package libpipeline1:amd64.
Preparing to unpack .../012-libpipeline1_1.5.8-1_amd64.deb ...
Unpacking libpipeline1:amd64 (1.5.8-1) ...
Selecting previously unselected package man-db.
Preparing to unpack .../013-man-db_2.13.0-1_amd64.deb ...
Unpacking man-db (2.13.0-1) ...
Selecting previously unselected package cmake-data.
Preparing to unpack .../014-cmake-data_3.31.6-1_all.deb ...
Unpacking cmake-data (3.31.6-1) ...
Selecting previously unselected package libicu72:amd64.
Preparing to unpack .../015-libicu72_72.1-6_amd64.deb ...
Unpacking libicu72:amd64 (72.1-6) ...
Selecting previously unselected package libxml2:amd64.
Preparing to unpack .../016-libxml2_2.12.7+dfsg+really2.9.14-0.2+b2_amd64.deb ...
Unpacking libxml2:amd64 (2.12.7+dfsg+really2.9.14-0.2+b2) ...
Selecting previously unselected package libarchive13t64:amd64.
Preparing to unpack .../017-libarchive13t64_3.7.4-1.1_amd64.deb ...
Unpacking libarchive13t64:amd64 (3.7.4-1.1) ...
Selecting previously unselected package libbrotli1:amd64.
Preparing to unpack .../018-libbrotli1_1.1.0-2+b7_amd64.deb ...
Unpacking libbrotli1:amd64 (1.1.0-2+b7) ...
Selecting previously unselected package libkrb5support0:amd64.
Preparing to unpack .../019-libkrb5support0_1.21.3-4_amd64.deb ...
Unpacking libkrb5support0:amd64 (1.21.3-4) ...
Selecting previously unselected package libcom-err2:amd64.
Preparing to unpack .../020-libcom-err2_1.47.2-1_amd64.deb ...
Unpacking libcom-err2:amd64 (1.47.2-1) ...
Selecting previously unselected package libk5crypto3:amd64.
Preparing to unpack .../021-libk5crypto3_1.21.3-4_amd64.deb ...
Unpacking libk5crypto3:amd64 (1.21.3-4) ...
Selecting previously unselected package libkeyutils1:amd64.
Preparing to unpack .../022-libkeyutils1_1.6.3-4_amd64.deb ...
Unpacking libkeyutils1:amd64 (1.6.3-4) ...
Selecting previously unselected package libkrb5-3:amd64.
Preparing to unpack .../023-libkrb5-3_1.21.3-4_amd64.deb ...
Unpacking libkrb5-3:amd64 (1.21.3-4) ...
Selecting previously unselected package libgssapi-krb5-2:amd64.
Preparing to unpack .../024-libgssapi-krb5-2_1.21.3-4_amd64.deb ...
Unpacking libgssapi-krb5-2:amd64 (1.21.3-4) ...
Selecting previously unselected package libunistring5:amd64.
Preparing to unpack .../025-libunistring5_1.3-1_amd64.deb ...
Unpacking libunistring5:amd64 (1.3-1) ...
Selecting previously unselected package libidn2-0:amd64.
Preparing to unpack .../026-libidn2-0_2.3.8-1_amd64.deb ...
Unpacking libidn2-0:amd64 (2.3.8-1) ...
Selecting previously unselected package libsasl2-modules-db:amd64.
Preparing to unpack .../027-libsasl2-modules-db_2.1.28+dfsg1-9_amd64.deb ...
Unpacking libsasl2-modules-db:amd64 (2.1.28+dfsg1-9) ...
Selecting previously unselected package libsasl2-2:amd64.
Preparing to unpack .../028-libsasl2-2_2.1.28+dfsg1-9_amd64.deb ...
Unpacking libsasl2-2:amd64 (2.1.28+dfsg1-9) ...
Selecting previously unselected package libldap2:amd64.
Preparing to unpack .../029-libldap2_2.6.9+dfsg-2_amd64.deb ...
Unpacking libldap2:amd64 (2.6.9+dfsg-2) ...
Selecting previously unselected package libnghttp2-14:amd64.
Preparing to unpack .../030-libnghttp2-14_1.64.0-1_amd64.deb ...
Unpacking libnghttp2-14:amd64 (1.64.0-1) ...
Selecting previously unselected package libnghttp3-9:amd64.
Preparing to unpack .../031-libnghttp3-9_1.8.0-1_amd64.deb ...
Unpacking libnghttp3-9:amd64 (1.8.0-1) ...
Selecting previously unselected package libpsl5t64:amd64.
Preparing to unpack .../032-libpsl5t64_0.21.2-1.1+b1_amd64.deb ...
Unpacking libpsl5t64:amd64 (0.21.2-1.1+b1) ...
Selecting previously unselected package libp11-kit0:amd64.
Preparing to unpack .../033-libp11-kit0_0.25.5-3_amd64.deb ...
Unpacking libp11-kit0:amd64 (0.25.5-3) ...
Selecting previously unselected package libtasn1-6:amd64.
Preparing to unpack .../034-libtasn1-6_4.20.0-2_amd64.deb ...
Unpacking libtasn1-6:amd64 (4.20.0-2) ...
Selecting previously unselected package libgnutls30t64:amd64.
Preparing to unpack .../035-libgnutls30t64_3.8.9-2_amd64.deb ...
Unpacking libgnutls30t64:amd64 (3.8.9-2) ...
Selecting previously unselected package librtmp1:amd64.
Preparing to unpack .../036-librtmp1_2.4+20151223.gitfa8646d.1-2+b5_amd64.deb ...
Unpacking librtmp1:amd64 (2.4+20151223.gitfa8646d.1-2+b5) ...
Selecting previously unselected package libssh2-1t64:amd64.
Preparing to unpack .../037-libssh2-1t64_1.11.1-1_amd64.deb ...
Unpacking libssh2-1t64:amd64 (1.11.1-1) ...
Selecting previously unselected package libcurl4t64:amd64.
Preparing to unpack .../038-libcurl4t64_8.12.1-3_amd64.deb ...
Unpacking libcurl4t64:amd64 (8.12.1-3) ...
Selecting previously unselected package libjsoncpp26:amd64.
Preparing to unpack .../039-libjsoncpp26_1.9.6-3_amd64.deb ...
Unpacking libjsoncpp26:amd64 (1.9.6-3) ...
Selecting previously unselected package librhash1:amd64.
Preparing to unpack .../040-librhash1_1.4.5-1_amd64.deb ...
Unpacking librhash1:amd64 (1.4.5-1) ...
Selecting previously unselected package libuv1t64:amd64.
Preparing to unpack .../041-libuv1t64_1.50.0-2_amd64.deb ...
Unpacking libuv1t64:amd64 (1.50.0-2) ...
Selecting previously unselected package cmake.
Preparing to unpack .../042-cmake_3.31.6-1_amd64.deb ...
Unpacking cmake (3.31.6-1) ...
Selecting previously unselected package python3-ament-package.
Preparing to unpack .../043-python3-ament-package_0.17.1-1_all.deb ...
Unpacking python3-ament-package (0.17.1-1) ...
Selecting previously unselected package python3-dateutil.
Preparing to unpack .../044-python3-dateutil_2.9.0-3_all.deb ...
Unpacking python3-dateutil (2.9.0-3) ...
Selecting previously unselected package xml-core.
Preparing to unpack .../045-xml-core_0.19_all.deb ...
Unpacking xml-core (0.19) ...
Selecting previously unselected package docutils-common.
Preparing to unpack .../046-docutils-common_0.21.2+dfsg-2_all.deb ...
Unpacking docutils-common (0.21.2+dfsg-2) ...
Selecting previously unselected package python3-roman.
Preparing to unpack .../047-python3-roman_5.0-1_all.deb ...
Unpacking python3-roman (5.0-1) ...
Selecting previously unselected package python3-docutils.
Preparing to unpack .../048-python3-docutils_0.21.2+dfsg-2_all.deb ...
Unpacking python3-docutils (0.21.2+dfsg-2) ...
Selecting previously unselected package python3-autocommand.
Preparing to unpack .../049-python3-autocommand_2.2.2-3_all.deb ...
Unpacking python3-autocommand (2.2.2-3) ...
Selecting previously unselected package python3-more-itertools.
Preparing to unpack .../050-python3-more-itertools_10.6.0-1_all.deb ...
Unpacking python3-more-itertools (10.6.0-1) ...
Selecting previously unselected package python3-typing-extensions.
Preparing to unpack .../051-python3-typing-extensions_4.12.2-2_all.deb ...
Unpacking python3-typing-extensions (4.12.2-2) ...
Selecting previously unselected package python3-typeguard.
Preparing to unpack .../052-python3-typeguard_4.4.2-1_all.deb ...
Unpacking python3-typeguard (4.4.2-1) ...
Selecting previously unselected package python3-inflect.
Preparing to unpack .../053-python3-inflect_7.3.1-2_all.deb ...
Unpacking python3-inflect (7.3.1-2) ...
Selecting previously unselected package python3-jaraco.functools.
Preparing to unpack .../054-python3-jaraco.functools_4.1.0-1_all.deb ...
Unpacking python3-jaraco.functools (4.1.0-1) ...
Selecting previously unselected package python3-jaraco.text.
Preparing to unpack .../055-python3-jaraco.text_4.0.0-1_all.deb ...
Unpacking python3-jaraco.text (4.0.0-1) ...
Selecting previously unselected package python3-zipp.
Preparing to unpack .../056-python3-zipp_3.21.0-1_all.deb ...
Unpacking python3-zipp (3.21.0-1) ...
Selecting previously unselected package python3-setuptools.
Preparing to unpack .../057-python3-setuptools_75.8.0-1_all.deb ...
Unpacking python3-setuptools (75.8.0-1) ...
Selecting previously unselected package python3-jaraco.context.
Preparing to unpack .../058-python3-jaraco.context_6.0.1-1_all.deb ...
Unpacking python3-jaraco.context (6.0.1-1) ...
Selecting previously unselected package python3-pkg-resources.
Preparing to unpack .../059-python3-pkg-resources_75.8.0-1_all.deb ...
Unpacking python3-pkg-resources (75.8.0-1) ...
Selecting previously unselected package python3-pyparsing.
Preparing to unpack .../060-python3-pyparsing_3.1.2-1_all.deb ...
Unpacking python3-pyparsing (3.1.2-1) ...
Selecting previously unselected package python3-catkin-pkg.
Preparing to unpack .../061-python3-catkin-pkg_1.0.0-2_all.deb ...
Unpacking python3-catkin-pkg (1.0.0-2) ...
Selecting previously unselected package ament-cmake-core.
Preparing to unpack .../062-ament-cmake-core_2.7.2-1_all.deb ...
Unpacking ament-cmake-core (2.7.2-1) ...
Selecting previously unselected package ament-cmake-python.
Preparing to unpack .../063-ament-cmake-python_2.7.2-1_all.deb ...
Unpacking ament-cmake-python (2.7.2-1) ...
Selecting previously unselected package python3-ament-cmake-test.
Preparing to unpack .../064-python3-ament-cmake-test_2.7.2-1_all.deb ...
Unpacking python3-ament-cmake-test (2.7.2-1) ...
Selecting previously unselected package ament-cmake.
Preparing to unpack .../065-ament-cmake_2.7.2-1_all.deb ...
Unpacking ament-cmake (2.7.2-1) ...
Selecting previously unselected package googletest.
Preparing to unpack .../066-googletest_1.16.0-1_all.deb ...
Unpacking googletest (1.16.0-1) ...
Selecting previously unselected package libgtest-dev:amd64.
Preparing to unpack .../067-libgtest-dev_1.16.0-1_amd64.deb ...
Unpacking libgtest-dev:amd64 (1.16.0-1) ...
Selecting previously unselected package libgmock-dev:amd64.
Preparing to unpack .../068-libgmock-dev_1.16.0-1_amd64.deb ...
Unpacking libgmock-dev:amd64 (1.16.0-1) ...
Selecting previously unselected package ament-cmake-googletest.
Preparing to unpack .../069-ament-cmake-googletest_2.7.2-1_amd64.deb ...
Unpacking ament-cmake-googletest (2.7.2-1) ...
Selecting previously unselected package python3-iniconfig.
Preparing to unpack .../070-python3-iniconfig_1.1.1-2_all.deb ...
Unpacking python3-iniconfig (1.1.1-2) ...
Selecting previously unselected package python3-packaging.
Preparing to unpack .../071-python3-packaging_24.2-1_all.deb ...
Unpacking python3-packaging (24.2-1) ...
Selecting previously unselected package python3-pluggy.
Preparing to unpack .../072-python3-pluggy_1.5.0-1_all.deb ...
Unpacking python3-pluggy (1.5.0-1) ...
Selecting previously unselected package python3-pytest.
Preparing to unpack .../073-python3-pytest_8.3.5-1_all.deb ...
Unpacking python3-pytest (8.3.5-1) ...
Selecting previously unselected package ament-cmake-pytest.
Preparing to unpack .../074-ament-cmake-pytest_2.7.2-1_all.deb ...
Unpacking ament-cmake-pytest (2.7.2-1) ...
Selecting previously unselected package python3-domain-coordinator.
Preparing to unpack .../075-python3-domain-coordinator_0.13.1-2_all.deb ...
Unpacking python3-domain-coordinator (0.13.1-2) ...
Selecting previously unselected package ament-cmake-ros.
Preparing to unpack .../076-ament-cmake-ros_0.13.1-2_all.deb ...
Unpacking ament-cmake-ros (0.13.1-2) ...
Selecting previously unselected package m4.
Preparing to unpack .../077-m4_1.4.19-7_amd64.deb ...
Unpacking m4 (1.4.19-7) ...
Selecting previously unselected package autoconf.
Preparing to unpack .../078-autoconf_2.72-3_all.deb ...
Unpacking autoconf (2.72-3) ...
Selecting previously unselected package autotools-dev.
Preparing to unpack .../079-autotools-dev_20220109.1_all.deb ...
Unpacking autotools-dev (20220109.1) ...
Selecting previously unselected package automake.
Preparing to unpack .../080-automake_1%3a1.17-3_all.deb ...
Unpacking automake (1:1.17-3) ...
Selecting previously unselected package autopoint.
Preparing to unpack .../081-autopoint_0.23.1-1_all.deb ...
Unpacking autopoint (0.23.1-1) ...
Selecting previously unselected package binutils-powerpc64le-linux-gnu.
Preparing to unpack .../082-binutils-powerpc64le-linux-gnu_2.44-3_amd64.deb ...
Unpacking binutils-powerpc64le-linux-gnu (2.44-3) ...
Selecting previously unselected package gcc-14-powerpc64le-linux-gnu-base:amd64.
Preparing to unpack .../083-gcc-14-powerpc64le-linux-gnu-base_14.2.0-12cross1_amd64.deb ...
Unpacking gcc-14-powerpc64le-linux-gnu-base:amd64 (14.2.0-12cross1) ...
Selecting previously unselected package cpp-14-powerpc64le-linux-gnu.
Preparing to unpack .../084-cpp-14-powerpc64le-linux-gnu_14.2.0-12cross1_amd64.deb ...
Unpacking cpp-14-powerpc64le-linux-gnu (14.2.0-12cross1) ...
Selecting previously unselected package cpp-powerpc64le-linux-gnu.
Preparing to unpack .../085-cpp-powerpc64le-linux-gnu_4%3a14.2.0-1_amd64.deb ...
Unpacking cpp-powerpc64le-linux-gnu (4:14.2.0-1) ...
Selecting previously unselected package gcc-14-cross-base.
Preparing to unpack .../086-gcc-14-cross-base_14.2.0-12cross1_all.deb ...
Unpacking gcc-14-cross-base (14.2.0-12cross1) ...
Selecting previously unselected package libc6-ppc64el-cross.
Preparing to unpack .../087-libc6-ppc64el-cross_2.41-4cross1_all.deb ...
Unpacking libc6-ppc64el-cross (2.41-4cross1) ...
Selecting previously unselected package libgcc-s1-ppc64el-cross.
Preparing to unpack .../088-libgcc-s1-ppc64el-cross_14.2.0-12cross1_all.deb ...
Unpacking libgcc-s1-ppc64el-cross (14.2.0-12cross1) ...
Selecting previously unselected package libgomp1-ppc64el-cross.
Preparing to unpack .../089-libgomp1-ppc64el-cross_14.2.0-12cross1_all.deb ...
Unpacking libgomp1-ppc64el-cross (14.2.0-12cross1) ...
Selecting previously unselected package libitm1-ppc64el-cross.
Preparing to unpack .../090-libitm1-ppc64el-cross_14.2.0-12cross1_all.deb ...
Unpacking libitm1-ppc64el-cross (14.2.0-12cross1) ...
Selecting previously unselected package libatomic1-ppc64el-cross.
Preparing to unpack .../091-libatomic1-ppc64el-cross_14.2.0-12cross1_all.deb ...
Unpacking libatomic1-ppc64el-cross (14.2.0-12cross1) ...
Selecting previously unselected package libasan8-ppc64el-cross.
Preparing to unpack .../092-libasan8-ppc64el-cross_14.2.0-12cross1_all.deb ...
Unpacking libasan8-ppc64el-cross (14.2.0-12cross1) ...
Selecting previously unselected package liblsan0-ppc64el-cross.
Preparing to unpack .../093-liblsan0-ppc64el-cross_14.2.0-12cross1_all.deb ...
Unpacking liblsan0-ppc64el-cross (14.2.0-12cross1) ...
Selecting previously unselected package libtsan2-ppc64el-cross.
Preparing to unpack .../094-libtsan2-ppc64el-cross_14.2.0-12cross1_all.deb ...
Unpacking libtsan2-ppc64el-cross (14.2.0-12cross1) ...
Selecting previously unselected package libstdc++6-ppc64el-cross.
Preparing to unpack .../095-libstdc++6-ppc64el-cross_14.2.0-12cross1_all.deb ...
Unpacking libstdc++6-ppc64el-cross (14.2.0-12cross1) ...
Selecting previously unselected package libubsan1-ppc64el-cross.
Preparing to unpack .../096-libubsan1-ppc64el-cross_14.2.0-12cross1_all.deb ...
Unpacking libubsan1-ppc64el-cross (14.2.0-12cross1) ...
Selecting previously unselected package libquadmath0-ppc64el-cross.
Preparing to unpack .../097-libquadmath0-ppc64el-cross_14.2.0-12cross1_all.deb ...
Unpacking libquadmath0-ppc64el-cross (14.2.0-12cross1) ...
Selecting previously unselected package libgcc-14-dev-ppc64el-cross.
Preparing to unpack .../098-libgcc-14-dev-ppc64el-cross_14.2.0-12cross1_all.deb ...
Unpacking libgcc-14-dev-ppc64el-cross (14.2.0-12cross1) ...
Selecting previously unselected package gcc-14-powerpc64le-linux-gnu.
Preparing to unpack .../099-gcc-14-powerpc64le-linux-gnu_14.2.0-12cross1_amd64.deb ...
Unpacking gcc-14-powerpc64le-linux-gnu (14.2.0-12cross1) ...
Selecting previously unselected package gcc-powerpc64le-linux-gnu.
Preparing to unpack .../100-gcc-powerpc64le-linux-gnu_4%3a14.2.0-1_amd64.deb ...
Unpacking gcc-powerpc64le-linux-gnu (4:14.2.0-1) ...
Selecting previously unselected package linux-libc-dev-ppc64el-cross.
Preparing to unpack .../101-linux-libc-dev-ppc64el-cross_6.12.17-1cross1_all.deb ...
Unpacking linux-libc-dev-ppc64el-cross (6.12.17-1cross1) ...
Selecting previously unselected package libc6-dev-ppc64el-cross.
Preparing to unpack .../102-libc6-dev-ppc64el-cross_2.41-4cross1_all.deb ...
Unpacking libc6-dev-ppc64el-cross (2.41-4cross1) ...
Selecting previously unselected package libstdc++-14-dev-ppc64el-cross.
Preparing to unpack .../103-libstdc++-14-dev-ppc64el-cross_14.2.0-12cross1_all.deb ...
Unpacking libstdc++-14-dev-ppc64el-cross (14.2.0-12cross1) ...
Selecting previously unselected package g++-14-powerpc64le-linux-gnu.
Preparing to unpack .../104-g++-14-powerpc64le-linux-gnu_14.2.0-12cross1_amd64.deb ...
Unpacking g++-14-powerpc64le-linux-gnu (14.2.0-12cross1) ...
Selecting previously unselected package g++-powerpc64le-linux-gnu.
Preparing to unpack .../105-g++-powerpc64le-linux-gnu_4%3a14.2.0-1_amd64.deb ...
Unpacking g++-powerpc64le-linux-gnu (4:14.2.0-1) ...
Selecting previously unselected package crossbuild-essential-ppc64el.
Preparing to unpack .../106-crossbuild-essential-ppc64el_12.12_all.deb ...
Unpacking crossbuild-essential-ppc64el (12.12) ...
Selecting previously unselected package libdebhelper-perl.
Preparing to unpack .../107-libdebhelper-perl_13.24.1_all.deb ...
Unpacking libdebhelper-perl (13.24.1) ...
Selecting previously unselected package libtool.
Preparing to unpack .../108-libtool_2.5.4-4_all.deb ...
Unpacking libtool (2.5.4-4) ...
Selecting previously unselected package dh-autoreconf.
Preparing to unpack .../109-dh-autoreconf_20_all.deb ...
Unpacking dh-autoreconf (20) ...
Selecting previously unselected package libarchive-zip-perl.
Preparing to unpack .../110-libarchive-zip-perl_1.68-1_all.deb ...
Unpacking libarchive-zip-perl (1.68-1) ...
Selecting previously unselected package libfile-stripnondeterminism-perl.
Preparing to unpack .../111-libfile-stripnondeterminism-perl_1.14.1-2_all.deb ...
Unpacking libfile-stripnondeterminism-perl (1.14.1-2) ...
Selecting previously unselected package dh-strip-nondeterminism.
Preparing to unpack .../112-dh-strip-nondeterminism_1.14.1-2_all.deb ...
Unpacking dh-strip-nondeterminism (1.14.1-2) ...
Selecting previously unselected package libelf1t64:amd64.
Preparing to unpack .../113-libelf1t64_0.192-4_amd64.deb ...
Unpacking libelf1t64:amd64 (0.192-4) ...
Selecting previously unselected package dwz.
Preparing to unpack .../114-dwz_0.15-1+b1_amd64.deb ...
Unpacking dwz (0.15-1+b1) ...
Selecting previously unselected package gettext.
Preparing to unpack .../115-gettext_0.23.1-1_amd64.deb ...
Unpacking gettext (0.23.1-1) ...
Selecting previously unselected package intltool-debian.
Preparing to unpack .../116-intltool-debian_0.35.0+20060710.6_all.deb ...
Unpacking intltool-debian (0.35.0+20060710.6) ...
Selecting previously unselected package po-debconf.
Preparing to unpack .../117-po-debconf_1.0.21+nmu1_all.deb ...
Unpacking po-debconf (1.0.21+nmu1) ...
Selecting previously unselected package debhelper.
Preparing to unpack .../118-debhelper_13.24.1_all.deb ...
Unpacking debhelper (13.24.1) ...
Selecting previously unselected package dh-python.
Preparing to unpack .../119-dh-python_6.20250308_all.deb ...
Unpacking dh-python (6.20250308) ...
Selecting previously unselected package dh-ros.
Preparing to unpack .../120-dh-ros_0.14.1_all.deb ...
Unpacking dh-ros (0.14.1) ...
Selecting previously unselected package libfakeroot:amd64.
Preparing to unpack .../121-libfakeroot_1.37-1_amd64.deb ...
Unpacking libfakeroot:amd64 (1.37-1) ...
Selecting previously unselected package fakeroot.
Preparing to unpack .../122-fakeroot_1.37-1_amd64.deb ...
Unpacking fakeroot (1.37-1) ...
Selecting previously unselected package gcc-14-base:ppc64el.
Preparing to unpack .../123-gcc-14-base_14.2.0-18_ppc64el.deb ...
Unpacking gcc-14-base:ppc64el (14.2.0-18) ...
Selecting previously unselected package libgcc-s1:ppc64el.
Preparing to unpack .../124-libgcc-s1_14.2.0-18_ppc64el.deb ...
Unpacking libgcc-s1:ppc64el (14.2.0-18) ...
Selecting previously unselected package libc6:ppc64el.
Preparing to unpack .../125-libc6_2.41-4_ppc64el.deb ...
Unpacking libc6:ppc64el (2.41-4) ...
Selecting previously unselected package libasan8:ppc64el.
Preparing to unpack .../126-libasan8_14.2.0-18_ppc64el.deb ...
Unpacking libasan8:ppc64el (14.2.0-18) ...
Selecting previously unselected package libatomic1:ppc64el.
Preparing to unpack .../127-libatomic1_14.2.0-18_ppc64el.deb ...
Unpacking libatomic1:ppc64el (14.2.0-18) ...
Selecting previously unselected package libcrypt1:ppc64el.
Preparing to unpack .../128-libcrypt1_1%3a4.4.38-1_ppc64el.deb ...
Unpacking libcrypt1:ppc64el (1:4.4.38-1) ...
Selecting previously unselected package libcrypt-dev:ppc64el.
Preparing to unpack .../129-libcrypt-dev_1%3a4.4.38-1_ppc64el.deb ...
Unpacking libcrypt-dev:ppc64el (1:4.4.38-1) ...
Selecting previously unselected package libc6-dev:ppc64el.
Preparing to unpack .../130-libc6-dev_2.41-4_ppc64el.deb ...
Unpacking libc6-dev:ppc64el (2.41-4) ...
Selecting previously unselected package libgomp1:ppc64el.
Preparing to unpack .../131-libgomp1_14.2.0-18_ppc64el.deb ...
Unpacking libgomp1:ppc64el (14.2.0-18) ...
Selecting previously unselected package libitm1:ppc64el.
Preparing to unpack .../132-libitm1_14.2.0-18_ppc64el.deb ...
Unpacking libitm1:ppc64el (14.2.0-18) ...
Selecting previously unselected package liblsan0:ppc64el.
Preparing to unpack .../133-liblsan0_14.2.0-18_ppc64el.deb ...
Unpacking liblsan0:ppc64el (14.2.0-18) ...
Selecting previously unselected package libtsan2:ppc64el.
Preparing to unpack .../134-libtsan2_14.2.0-18_ppc64el.deb ...
Unpacking libtsan2:ppc64el (14.2.0-18) ...
Selecting previously unselected package libstdc++6:ppc64el.
Preparing to unpack .../135-libstdc++6_14.2.0-18_ppc64el.deb ...
Unpacking libstdc++6:ppc64el (14.2.0-18) ...
Selecting previously unselected package libubsan1:ppc64el.
Preparing to unpack .../136-libubsan1_14.2.0-18_ppc64el.deb ...
Unpacking libubsan1:ppc64el (14.2.0-18) ...
Selecting previously unselected package libquadmath0:ppc64el.
Preparing to unpack .../137-libquadmath0_14.2.0-18_ppc64el.deb ...
Unpacking libquadmath0:ppc64el (14.2.0-18) ...
Selecting previously unselected package libgcc-14-dev:ppc64el.
Preparing to unpack .../138-libgcc-14-dev_14.2.0-18_ppc64el.deb ...
Unpacking libgcc-14-dev:ppc64el (14.2.0-18) ...
Selecting previously unselected package libstdc++-14-dev:ppc64el.
Preparing to unpack .../139-libstdc++-14-dev_14.2.0-18_ppc64el.deb ...
Unpacking libstdc++-14-dev:ppc64el (14.2.0-18) ...
Selecting previously unselected package python3-empy.
Preparing to unpack .../140-python3-empy_3.3.4-2_all.deb ...
Unpacking python3-empy (3.3.4-2) ...
Selecting previously unselected package sbuild-build-depends-main-dummy:ppc64el.
Preparing to unpack .../141-sbuild-build-depends-main-dummy_0.invalid.0_ppc64el.deb ...
Unpacking sbuild-build-depends-main-dummy:ppc64el (0.invalid.0) ...
Setting up media-types (13.0.0) ...
Setting up libpipeline1:amd64 (1.5.8-1) ...
Setting up libkeyutils1:amd64 (1.6.3-4) ...
Setting up libicu72:amd64 (72.1-6) ...
Setting up bsdextrautils (2.40.4-5) ...
Setting up gcc-14-powerpc64le-linux-gnu-base:amd64 (14.2.0-12cross1) ...
Setting up libmagic-mgc (1:5.45-3+b1) ...
Setting up gcc-14-base:ppc64el (14.2.0-18) ...
Setting up libarchive-zip-perl (1.68-1) ...
Setting up libc6-ppc64el-cross (2.41-4cross1) ...
Setting up libdebhelper-perl (13.24.1) ...
Setting up libbrotli1:amd64 (1.1.0-2+b7) ...
Setting up libsqlite3-0:amd64 (3.46.1-2) ...
Setting up libuv1t64:amd64 (1.50.0-2) ...
Setting up libmagic1t64:amd64 (1:5.45-3+b1) ...
Setting up libnghttp2-14:amd64 (1.64.0-1) ...
Setting up gettext-base (0.23.1-1) ...
Setting up m4 (1.4.19-7) ...
Setting up gcc-14-cross-base (14.2.0-12cross1) ...
Setting up libcom-err2:amd64 (1.47.2-1) ...
Setting up file (1:5.45-3+b1) ...
Setting up libgomp1-ppc64el-cross (14.2.0-12cross1) ...
Setting up googletest (1.16.0-1) ...
Setting up libfakeroot:amd64 (1.37-1) ...
Setting up libelf1t64:amd64 (0.192-4) ...
Setting up libkrb5support0:amd64 (1.21.3-4) ...
Setting up libsasl2-modules-db:amd64 (2.1.28+dfsg1-9) ...
Setting up fakeroot (1.37-1) ...
update-alternatives: using /usr/bin/fakeroot-sysv to provide /usr/bin/fakeroot (fakeroot) in auto mode
Setting up autotools-dev (20220109.1) ...
Setting up libjsoncpp26:amd64 (1.9.6-3) ...
Setting up libproc2-0:amd64 (2:4.0.4-7) ...
Setting up libunistring5:amd64 (1.3-1) ...
Setting up autopoint (0.23.1-1) ...
Setting up cpp-14-powerpc64le-linux-gnu (14.2.0-12cross1) ...
Setting up libncursesw6:amd64 (6.5+20250216-2) ...
Setting up libk5crypto3:amd64 (1.21.3-4) ...
Setting up libsasl2-2:amd64 (2.1.28+dfsg1-9) ...
Setting up autoconf (2.72-3) ...
Setting up libnghttp3-9:amd64 (1.8.0-1) ...
Setting up libitm1-ppc64el-cross (14.2.0-12cross1) ...
Setting up libffi8:amd64 (3.4.7-1) ...
Setting up libatomic1-ppc64el-cross (14.2.0-12cross1) ...
Setting up dwz (0.15-1+b1) ...
Setting up sensible-utils (0.0.24) ...
Setting up libuchardet0:amd64 (0.0.8-1+b2) ...
Setting up linux-libc-dev-ppc64el-cross (6.12.17-1cross1) ...
Setting up procps (2:4.0.4-7) ...
Setting up libtasn1-6:amd64 (4.20.0-2) ...
Setting up netbase (6.4) ...
Setting up sgml-base (1.31) ...
Setting up cmake-data (3.31.6-1) ...
Setting up librhash1:amd64 (1.4.5-1) ...
Setting up libgcc-s1-ppc64el-cross (14.2.0-12cross1) ...
Setting up libkrb5-3:amd64 (1.21.3-4) ...
Setting up libssh2-1t64:amd64 (1.11.1-1) ...
Setting up binutils-powerpc64le-linux-gnu (2.44-3) ...
Setting up readline-common (8.2-6) ...
Setting up libxml2:amd64 (2.12.7+dfsg+really2.9.14-0.2+b2) ...
Setting up libldap2:amd64 (2.6.9+dfsg-2) ...
Setting up cpp-powerpc64le-linux-gnu (4:14.2.0-1) ...
Setting up automake (1:1.17-3) ...
update-alternatives: using /usr/bin/automake-1.17 to provide /usr/bin/automake (automake) in auto mode
Setting up libfile-stripnondeterminism-perl (1.14.1-2) ...
Setting up gettext (0.23.1-1) ...
Setting up libgtest-dev:amd64 (1.16.0-1) ...
Setting up libc6-dev-ppc64el-cross (2.41-4cross1) ...
Setting up libtool (2.5.4-4) ...
Setting up libquadmath0-ppc64el-cross (14.2.0-12cross1) ...
Setting up libasan8-ppc64el-cross (14.2.0-12cross1) ...
Setting up libidn2-0:amd64 (2.3.8-1) ...
Setting up liblsan0-ppc64el-cross (14.2.0-12cross1) ...
Setting up intltool-debian (0.35.0+20060710.6) ...
Setting up libtsan2-ppc64el-cross (14.2.0-12cross1) ...
Setting up dh-autoreconf (20) ...
Setting up libp11-kit0:amd64 (0.25.5-3) ...
Setting up libgssapi-krb5-2:amd64 (1.21.3-4) ...
Setting up libgmock-dev:amd64 (1.16.0-1) ...
Setting up libstdc++6-ppc64el-cross (14.2.0-12cross1) ...
Setting up libreadline8t64:amd64 (8.2-6) ...
Setting up dh-strip-nondeterminism (1.14.1-2) ...
Setting up groff-base (1.23.0-7) ...
Setting up xml-core (0.19) ...
Setting up libarchive13t64:amd64 (3.7.4-1.1) ...
Setting up libpython3.13-stdlib:amd64 (3.13.2-1) ...
Setting up libpython3-stdlib:amd64 (3.13.2-2) ...
Setting up libgnutls30t64:amd64 (3.8.9-2) ...
Setting up python3.13 (3.13.2-1) ...
Setting up libubsan1-ppc64el-cross (14.2.0-12cross1) ...
Setting up po-debconf (1.0.21+nmu1) ...
Setting up libpsl5t64:amd64 (0.21.2-1.1+b1) ...
Setting up python3 (3.13.2-2) ...
Setting up python3-zipp (3.21.0-1) ...
Setting up python3-autocommand (2.2.2-3) ...
Setting up python3-empy (3.3.4-2) ...
Setting up man-db (2.13.0-1) ...
Not building database; man-db/auto-update is not 'true'.
Setting up python3-ament-package (0.17.1-1) ...
Setting up python3-roman (5.0-1) ...
Setting up python3-packaging (24.2-1) ...
Setting up python3-pyparsing (3.1.2-1) ...
Setting up librtmp1:amd64 (2.4+20151223.gitfa8646d.1-2+b5) ...
Setting up libgcc-14-dev-ppc64el-cross (14.2.0-12cross1) ...
Setting up python3-typing-extensions (4.12.2-2) ...
Setting up python3-domain-coordinator (0.13.1-2) ...
Setting up python3-pluggy (1.5.0-1) ...
Setting up libstdc++-14-dev-ppc64el-cross (14.2.0-12cross1) ...
Setting up python3-dateutil (2.9.0-3) ...
Setting up gcc-14-powerpc64le-linux-gnu (14.2.0-12cross1) ...
Setting up dh-python (6.20250308) ...
Setting up python3-more-itertools (10.6.0-1) ...
Setting up python3-iniconfig (1.1.1-2) ...
Setting up python3-jaraco.functools (4.1.0-1) ...
Setting up g++-14-powerpc64le-linux-gnu (14.2.0-12cross1) ...
Setting up python3-jaraco.context (6.0.1-1) ...
Setting up libcurl4t64:amd64 (8.12.1-3) ...
Setting up python3-pytest (8.3.5-1) ...
Setting up python3-typeguard (4.4.2-1) ...
Setting up debhelper (13.24.1) ...
Setting up python3-inflect (7.3.1-2) ...
Setting up gcc-powerpc64le-linux-gnu (4:14.2.0-1) ...
Setting up python3-jaraco.text (4.0.0-1) ...
Setting up cmake (3.31.6-1) ...
Setting up g++-powerpc64le-linux-gnu (4:14.2.0-1) ...
Setting up python3-pkg-resources (75.8.0-1) ...
Setting up python3-setuptools (75.8.0-1) ...
Setting up crossbuild-essential-ppc64el (12.12) ...
Setting up libgcc-s1:ppc64el (14.2.0-18) ...
Setting up libc6:ppc64el (2.41-4) ...
Setting up libasan8:ppc64el (14.2.0-18) ...
Setting up libtsan2:ppc64el (14.2.0-18) ...
Setting up libstdc++6:ppc64el (14.2.0-18) ...
Setting up liblsan0:ppc64el (14.2.0-18) ...
Setting up libitm1:ppc64el (14.2.0-18) ...
Setting up libcrypt1:ppc64el (1:4.4.38-1) ...
Setting up libgomp1:ppc64el (14.2.0-18) ...
Setting up libquadmath0:ppc64el (14.2.0-18) ...
Setting up libatomic1:ppc64el (14.2.0-18) ...
Setting up libubsan1:ppc64el (14.2.0-18) ...
Setting up libcrypt-dev:ppc64el (1:4.4.38-1) ...
Setting up libc6-dev:ppc64el (2.41-4) ...
Setting up libgcc-14-dev:ppc64el (14.2.0-18) ...
Setting up libstdc++-14-dev:ppc64el (14.2.0-18) ...
Processing triggers for libc-bin (2.41-4) ...
Processing triggers for sgml-base (1.31) ...
Setting up docutils-common (0.21.2+dfsg-2) ...
Processing triggers for sgml-base (1.31) ...
Setting up python3-docutils (0.21.2+dfsg-2) ...
Setting up python3-catkin-pkg (1.0.0-2) ...
/usr/lib/python3/dist-packages/catkin_pkg/cli/prepare_release.py:234: SyntaxWarning: invalid escape sequence '\.'
  if args.version and not re.match('^(0|[1-9][0-9]*)\.(0|[1-9][0-9]*)\.(0|[1-9][0-9]*)$', args.version):
Setting up dh-ros (0.14.1) ...
Setting up ament-cmake-core (2.7.2-1) ...
Setting up ament-cmake-python (2.7.2-1) ...
Setting up python3-ament-cmake-test (2.7.2-1) ...
Setting up ament-cmake-googletest (2.7.2-1) ...
Setting up ament-cmake (2.7.2-1) ...
Setting up ament-cmake-pytest (2.7.2-1) ...
Setting up ament-cmake-ros (0.13.1-2) ...
Setting up sbuild-build-depends-main-dummy:ppc64el (0.invalid.0) ...

+------------------------------------------------------------------------------+
| Check architectures                                                          |
+------------------------------------------------------------------------------+

Arch check ok (ppc64el included in any all)

+------------------------------------------------------------------------------+
| Build environment                                                            |
+------------------------------------------------------------------------------+

Kernel: Linux 6.1.0-31-amd64 #1 SMP PREEMPT_DYNAMIC Debian 6.1.128-1 (2025-02-07) amd64 (x86_64)
Toolchain package versions: binutils_2.44-3 dpkg-dev_1.22.18 g++-14_14.2.0-18 gcc-14_14.2.0-18 libc6-dev_2.41-4 libstdc++-14-dev_14.2.0-18 libstdc++-14-dev-ppc64el-cross_14.2.0-12cross1 libstdc++6_14.2.0-18 libstdc++6-ppc64el-cross_14.2.0-12cross1 linux-libc-dev_6.12.17-1
Package versions: ament-cmake_2.7.2-1 ament-cmake-core_2.7.2-1 ament-cmake-googletest_2.7.2-1 ament-cmake-pytest_2.7.2-1 ament-cmake-python_2.7.2-1 ament-cmake-ros_0.13.1-2 apt_2.9.33 apt-utils_2.9.33 autoconf_2.72-3 automake_1:1.17-3 autopoint_0.23.1-1 autotools-dev_20220109.1 base-files_13.7 base-passwd_3.6.6 bash_5.2.37-1.1 binutils_2.44-3 binutils-common_2.44-3 binutils-powerpc64le-linux-gnu_2.44-3 binutils-x86-64-linux-gnu_2.44-3 bsdextrautils_2.40.4-5 bsdutils_1:2.40.4-5 build-essential_12.12 bzip2_1.0.8-6 cmake_3.31.6-1 cmake-data_3.31.6-1 coreutils_9.5-1+b1 cpp_4:14.2.0-1 cpp-14_14.2.0-18 cpp-14-powerpc64le-linux-gnu_14.2.0-12cross1 cpp-14-x86-64-linux-gnu_14.2.0-18 cpp-powerpc64le-linux-gnu_4:14.2.0-1 cpp-x86-64-linux-gnu_4:14.2.0-1 crossbuild-essential-ppc64el_12.12 dash_0.5.12-12 debconf_1.5.91 debhelper_13.24.1 debian-archive-keyring_2023.4 debianutils_5.21 dh-autoreconf_20 dh-python_6.20250308 dh-ros_0.14.1 dh-strip-nondeterminism_1.14.1-2 diffutils_1:3.10-2 docutils-common_0.21.2+dfsg-2 dpkg_1.22.18 dpkg-dev_1.22.18 dwz_0.15-1+b1 fakeroot_1.37-1 file_1:5.45-3+b1 findutils_4.10.0-3 g++_4:14.2.0-1 g++-14_14.2.0-18 g++-14-powerpc64le-linux-gnu_14.2.0-12cross1 g++-14-x86-64-linux-gnu_14.2.0-18 g++-powerpc64le-linux-gnu_4:14.2.0-1 g++-x86-64-linux-gnu_4:14.2.0-1 gcc_4:14.2.0-1 gcc-14_14.2.0-18 gcc-14-base_14.2.0-18 gcc-14-cross-base_14.2.0-12cross1 gcc-14-powerpc64le-linux-gnu_14.2.0-12cross1 gcc-14-powerpc64le-linux-gnu-base_14.2.0-12cross1 gcc-14-x86-64-linux-gnu_14.2.0-18 gcc-powerpc64le-linux-gnu_4:14.2.0-1 gcc-x86-64-linux-gnu_4:14.2.0-1 gettext_0.23.1-1 gettext-base_0.23.1-1 googletest_1.16.0-1 grep_3.11-4 groff-base_1.23.0-7 gzip_1.13-1 hostname_3.25 init-system-helpers_1.68 intltool-debian_0.35.0+20060710.6 libacl1_2.3.2-2+b1 libapt-pkg7.0_2.9.33 libarchive-zip-perl_1.68-1 libarchive13t64_3.7.4-1.1 libasan8_14.2.0-18 libasan8-ppc64el-cross_14.2.0-12cross1 libatomic1_14.2.0-18 libatomic1-ppc64el-cross_14.2.0-12cross1 libattr1_1:2.5.2-3 libaudit-common_1:4.0.2-2 libaudit1_1:4.0.2-2+b2 libbinutils_2.44-3 libblkid1_2.40.4-5 libbrotli1_1.1.0-2+b7 libbsd0_0.12.2-2 libbz2-1.0_1.0.8-6 libc-bin_2.41-4 libc-dev-bin_2.41-4 libc6_2.41-4 libc6-dev_2.41-4 libc6-dev-ppc64el-cross_2.41-4cross1 libc6-ppc64el-cross_2.41-4cross1 libcap-ng0_0.8.5-4+b1 libcap2_1:2.75-1 libcc1-0_14.2.0-18 libcom-err2_1.47.2-1 libcrypt-dev_1:4.4.38-1 libcrypt1_1:4.4.38-1 libctf-nobfd0_2.44-3 libctf0_2.44-3 libcurl4t64_8.12.1-3 libdb5.3t64_5.3.28+dfsg2-9 libdebconfclient0_0.277 libdebhelper-perl_13.24.1 libdpkg-perl_1.22.18 libelf1t64_0.192-4 libexpat1_2.6.4-1 libfakeroot_1.37-1 libffi8_3.4.7-1 libfile-stripnondeterminism-perl_1.14.1-2 libgcc-14-dev_14.2.0-18 libgcc-14-dev-ppc64el-cross_14.2.0-12cross1 libgcc-s1_14.2.0-18 libgcc-s1-ppc64el-cross_14.2.0-12cross1 libgdbm-compat4t64_1.24-2 libgdbm6t64_1.24-2 libgmock-dev_1.16.0-1 libgmp10_2:6.3.0+dfsg-3 libgnutls30t64_3.8.9-2 libgomp1_14.2.0-18 libgomp1-ppc64el-cross_14.2.0-12cross1 libgprofng0_2.44-3 libgssapi-krb5-2_1.21.3-4 libgtest-dev_1.16.0-1 libhogweed6t64_3.10.1-1 libhwasan0_14.2.0-18 libicu72_72.1-6 libidn2-0_2.3.8-1 libisl23_0.27-1 libitm1_14.2.0-18 libitm1-ppc64el-cross_14.2.0-12cross1 libjansson4_2.14-2+b3 libjsoncpp26_1.9.6-3 libk5crypto3_1.21.3-4 libkeyutils1_1.6.3-4 libkrb5-3_1.21.3-4 libkrb5support0_1.21.3-4 libldap2_2.6.9+dfsg-2 liblsan0_14.2.0-18 liblsan0-ppc64el-cross_14.2.0-12cross1 liblz4-1_1.10.0-4 liblzma5_5.6.4-1 libmagic-mgc_1:5.45-3+b1 libmagic1t64_1:5.45-3+b1 libmd0_1.1.0-2+b1 libmount1_2.40.4-5 libmpc3_1.3.1-1+b3 libmpfr6_4.2.1-1+b2 libncursesw6_6.5+20250216-2 libnettle8t64_3.10.1-1 libnghttp2-14_1.64.0-1 libnghttp3-9_1.8.0-1 libp11-kit0_0.25.5-3 libpam-modules_1.7.0-3 libpam-modules-bin_1.7.0-3 libpam-runtime_1.7.0-3 libpam0g_1.7.0-3 libpcre2-8-0_10.45-1 libperl5.40_5.40.1-2 libpipeline1_1.5.8-1 libproc2-0_2:4.0.4-7 libpsl5t64_0.21.2-1.1+b1 libpython3-stdlib_3.13.2-2 libpython3.13-minimal_3.13.2-1 libpython3.13-stdlib_3.13.2-1 libquadmath0_14.2.0-18 libquadmath0-ppc64el-cross_14.2.0-12cross1 libreadline8t64_8.2-6 librhash1_1.4.5-1 librtmp1_2.4+20151223.gitfa8646d.1-2+b5 libsasl2-2_2.1.28+dfsg1-9 libsasl2-modules-db_2.1.28+dfsg1-9 libseccomp2_2.5.5-2+b1 libselinux1_3.8-4 libsemanage-common_3.8-1 libsemanage2_3.8-1+b1 libsepol2_3.8-1 libsframe1_2.44-3 libsmartcols1_2.40.4-5 libsqlite3-0_3.46.1-2 libssh2-1t64_1.11.1-1 libssl3t64_3.4.1-1 libstdc++-14-dev_14.2.0-18 libstdc++-14-dev-ppc64el-cross_14.2.0-12cross1 libstdc++6_14.2.0-18 libstdc++6-ppc64el-cross_14.2.0-12cross1 libsystemd0_257.4-1 libtasn1-6_4.20.0-2 libtinfo6_6.5+20250216-2 libtool_2.5.4-4 libtsan2_14.2.0-18 libtsan2-ppc64el-cross_14.2.0-12cross1 libubsan1_14.2.0-18 libubsan1-ppc64el-cross_14.2.0-12cross1 libuchardet0_0.0.8-1+b2 libudev1_257.4-1 libunistring5_1.3-1 libuuid1_2.40.4-5 libuv1t64_1.50.0-2 libxml2_2.12.7+dfsg+really2.9.14-0.2+b2 libxxhash0_0.8.3-2 libzstd1_1.5.6+dfsg-2 linux-libc-dev_6.12.17-1 linux-libc-dev-ppc64el-cross_6.12.17-1cross1 login_1:4.16.0-2+really2.40.4-5 login.defs_1:4.17.3-1 m4_1.4.19-7 make_4.4.1-1 man-db_2.13.0-1 mawk_1.3.4.20250131-1 media-types_13.0.0 mount_2.40.4-5 ncurses-base_6.5+20250216-2 ncurses-bin_6.5+20250216-2 netbase_6.4 openssl-provider-legacy_3.4.1-1 passwd_1:4.17.3-1 patch_2.7.6-7 perl_5.40.1-2 perl-base_5.40.1-2 perl-modules-5.40_5.40.1-2 po-debconf_1.0.21+nmu1 procps_2:4.0.4-7 python3_3.13.2-2 python3-ament-cmake-test_2.7.2-1 python3-ament-package_0.17.1-1 python3-autocommand_2.2.2-3 python3-catkin-pkg_1.0.0-2 python3-dateutil_2.9.0-3 python3-docutils_0.21.2+dfsg-2 python3-domain-coordinator_0.13.1-2 python3-empy_3.3.4-2 python3-inflect_7.3.1-2 python3-iniconfig_1.1.1-2 python3-jaraco.context_6.0.1-1 python3-jaraco.functools_4.1.0-1 python3-jaraco.text_4.0.0-1 python3-minimal_3.13.2-2 python3-more-itertools_10.6.0-1 python3-packaging_24.2-1 python3-pkg-resources_75.8.0-1 python3-pluggy_1.5.0-1 python3-pyparsing_3.1.2-1 python3-pytest_8.3.5-1 python3-roman_5.0-1 python3-setuptools_75.8.0-1 python3-typeguard_4.4.2-1 python3-typing-extensions_4.12.2-2 python3-zipp_3.21.0-1 python3.13_3.13.2-1 python3.13-minimal_3.13.2-1 readline-common_8.2-6 rpcsvc-proto_1.4.3-1 sbuild-build-depends-main-dummy_0.invalid.0 sed_4.9-2 sensible-utils_0.0.24 sgml-base_1.31 sqv_1.2.1-6+b1 sysvinit-utils_3.14-4 tar_1.35+dfsg-3.1 tzdata_2025a-2 util-linux_2.40.4-5 xml-core_0.19 xz-utils_5.6.4-1 zlib1g_1:1.3.dfsg+really1.3.1-1+b1

+------------------------------------------------------------------------------+
| Build                                                                        |
+------------------------------------------------------------------------------+


Unpack source
-------------

-----BEGIN PGP SIGNED MESSAGE-----
Hash: SHA512

Format: 3.0 (quilt)
Source: ros2-rcutils
Binary: librcutils1d, librcutils-dev, python3-rcutils
Architecture: any all
Version: 6.9.4-1
Maintainer: Debian Robotics Team <team+robotics@tracker.debian.org>
Uploaders: Timo Röhling <roehling@debian.org>, Jochen Sprickerhof <jspricke@debian.org>,
Homepage: https://github.com/ros2/rcutils
Description: C Utilities and Data Structures for ROS 2
 This package is part of ROS 2, the Robot Operating System.
 It provides basic macros, functions, and data structures for the ROS 2
 codebase.
Standards-Version: 4.7.0
Vcs-Browser: https://salsa.debian.org/robotics-team/ros2-rcutils
Vcs-Git: https://salsa.debian.org/robotics-team/ros2-rcutils.git
Build-Depends: ament-cmake-python, ament-cmake-ros, cmake, debhelper-compat (= 13), dh-ros, dh-sequence-python3, python3-empy
Package-List:
 librcutils-dev deb libdevel optional arch=any
 librcutils1d deb libs optional arch=any
 python3-rcutils deb python optional arch=all
Checksums-Sha1:
 90041326bfd74173c9ce7f0a343bd5db8a6d879e 151371 ros2-rcutils_6.9.4.orig.tar.gz
 d496e193f356a3b16834a5e923db56f4be38b58b 6256 ros2-rcutils_6.9.4-1.debian.tar.xz
Checksums-Sha256:
 5a565b39e5fc2295f9793ac1ecec4be190f125a3a3c49b1fb4a97d8d20f61718 151371 ros2-rcutils_6.9.4.orig.tar.gz
 a01dc7b762d7e8dd3bb692977bc0b387e9447f4111afb506401f44e569236dcc 6256 ros2-rcutils_6.9.4-1.debian.tar.xz
Files:
 5129d4c29693a27728f7b014a7a4ce96 151371 ros2-rcutils_6.9.4.orig.tar.gz
 d8effee2919e516825b9702fc99b0eab 6256 ros2-rcutils_6.9.4-1.debian.tar.xz
Dgit: d491133c9397364d9e96c85e3b765054d7c67964 debian archive/debian/6.9.4-1 https://git.dgit.debian.org/ros2-rcutils

-----BEGIN PGP SIGNATURE-----

iQJIBAEBCgAyFiEEmwPruYMA35fCsSO/zIxr3RQD9MoFAmex42UUHHJvZWhsaW5n
QGRlYmlhbi5vcmcACgkQzIxr3RQD9MpjiRAAtXet10W2sEW8xhDfwwWLhNRQ+H50
T4X9SoPWTmivR5a48OnF7iK3TaU4BSH9PistfJXhvtgNyH9MoGfkUA5jIq6oW4w0
RhPe4cxMeLkY2UmvtLzTqkY+mRntb6Y5IWSm3EDe8U4yvLSHRHl9BVsnexiPYnPp
PA5jhbRua09TPALlNYzHwduAtEYFLAtqi7Xj0tJEig/qWfOEgS4gxeyHhc4nGJw0
bzW5jUfyXND4Wjz455/QF+1OqSzM6TAfWzHgtSyrXvk2tHKk8lwZhQanb2cL2Ahl
/+alyM/1aQmO7n+qCs8qKxxdPV/FdW46ZsDJJPPQI+SlePqlodFUNvuJKD+1Z0lQ
Qa5SBXLKg40UdBPU+UgmOkSWQ/2f59EoCNxDAds7DBY4ZL+kY3uS0xni9tin3J8z
raRFqrLqSIEdIT8EklS1B9WQCyuwwqQyvXDcvxBuyOPcLMCJqzy/DoQ3z6L9jkd/
ZR6T0+ANRzmlWKPo6AkflsGp28/BEJLfCWYpT3tOT8q2dQ57k6QZjP/Hnonp8eYM
6SG69oopGc+Zi/Hl9EzFEAWuDcxowNnp7R0oQHJtAGek1SCAk+bq706cMChb7oEH
xXpEzS3UDU+ke+rRYRg90pfUDaqxnk5MVCej57sZUqyZwklnEO+5sJi+XDizRNiz
0TvZnzdX4Z5xg0Q=
=MSbf
-----END PGP SIGNATURE-----

dpkg-source: warning: cannot verify inline signature for ./ros2-rcutils_6.9.4-1.dsc: unsupported subcommand
dpkg-source: info: extracting ros2-rcutils in /<<PKGBUILDDIR>>
dpkg-source: info: unpacking ros2-rcutils_6.9.4.orig.tar.gz
dpkg-source: info: unpacking ros2-rcutils_6.9.4-1.debian.tar.xz
dpkg-source: info: using patch list from debian/patches/series
dpkg-source: info: applying 0001-Fix-Multi-Arch-install-location.patch
dpkg-source: info: applying 0002-Set-proper-SONAME.patch
dpkg-source: info: applying 0003-Move-libatomic-test-out-of-BUILD_TESTING-conditional.patch
dpkg-source: info: applying 0004-Switch-dlopen-to-RTLD_GLOBAL.patch

Check disk space
----------------

Sufficient free space for build

User Environment
----------------

APT_CONFIG=/var/lib/sbuild/apt.conf
CONFIG_SITE=/etc/dpkg-cross/cross-config.ppc64el
DEB_BUILD_OPTIONS=nocheck
HOME=/sbuild-nonexistent
LANG=en_US.UTF-8
LC_ALL=C.UTF-8
LOGNAME=crossqa
OLDPWD=/home/crossqa
PATH=/usr/local/sbin:/usr/local/bin:/usr/sbin:/usr/bin:/sbin:/bin:/usr/games
SBUILD_CONFIG=/tmp/tmp.i99KCXJgjm/sbuild.conf
SCHROOT_ALIAS_NAME=unstable-amd64-sbuild
SCHROOT_CHROOT_NAME=sid-amd64-sbuild
SCHROOT_COMMAND=env
SCHROOT_GID=1000
SCHROOT_GROUP=crossqa
SCHROOT_SESSION_ID=sid-amd64-sbuild-629de859-f434-48c9-9a26-faa27b243eaa
SCHROOT_UID=1000
SCHROOT_USER=crossqa
SHELL=/bin/sh
USER=crossqa
XDG_SESSION_CLASS=user

dpkg-buildpackage
-----------------

Command: dpkg-buildpackage --sanitize-env -appc64el -Pcross,nocheck -us -uc -B -rfakeroot --jobs-try=1
dpkg-buildpackage: info: source package ros2-rcutils
dpkg-buildpackage: info: source version 6.9.4-1
dpkg-buildpackage: info: source distribution unstable
dpkg-buildpackage: info: source changed by Timo Röhling <roehling@debian.org>
dpkg-architecture: warning: specified GNU system type powerpc64le-linux-gnu does not match CC system type x86_64-linux-gnu, try setting a correct CC environment variable
 dpkg-source --before-build .
dpkg-buildpackage: info: host architecture ppc64el
 debian/rules clean
dh clean --buildsystem=ros
   dh_auto_clean -O--buildsystem=ros
    dh_auto_clean --sourcedir=. --builddir=obj-powerpc64le-linux-gnu/rcutils --buildsystem=cmake --
   dh_autoreconf_clean -O--buildsystem=ros
   dh_clean -O--buildsystem=ros
 debian/rules binary-arch
dh binary-arch --buildsystem=ros
   dh_update_autotools_config -a -O--buildsystem=ros
   dh_autoreconf -a -O--buildsystem=ros
   dh_auto_configure -a -O--buildsystem=ros
   dh_auto_build -a -O--buildsystem=ros
dh: command-omitted: The call to "dh_auto_test -a -O--buildsystem=ros" was omitted due to "DEB_BUILD_OPTIONS=nocheck"
   create-stamp debian/debhelper-build-stamp
   dh_testroot -a -O--buildsystem=ros
   dh_prep -a -O--buildsystem=ros
   dh_auto_install -a -O--buildsystem=ros
#############################################################################
## Detected ROS packages (in build order):                                 ##
##                                                                         ##
## - rcutils [ament_cmake]                                                 ##
#############################################################################

=============================================================================
= ROS Package rcutils                                                       =
=============================================================================
    dh_auto_configure --sourcedir=. --builddir=obj-powerpc64le-linux-gnu/rcutils --buildsystem=cmake -- --no-warn-unused-cli -DBUILD_SHARED_LIBS=ON -DBUILD_TESTING=OFF -DAMENT_LINT_AUTO=OFF -DAMENT_CMAKE_ENVIRONMENT_PACKAGE_GENERATION=OFF -DAMENT_CMAKE_ENVIRONMENT_PARENT_PREFIX_PATH_GENERATION=OFF -DBUILD_TESTING=OFF -DRCUTILS_SOVERSION=1d
	cd obj-powerpc64le-linux-gnu/rcutils && PKG_CONFIG=/usr/bin/powerpc64le-linux-gnu-pkg-config cmake -DCMAKE_INSTALL_PREFIX=/usr -DCMAKE_BUILD_TYPE=None -DCMAKE_INSTALL_SYSCONFDIR=/etc -DCMAKE_INSTALL_LOCALSTATEDIR=/var -DCMAKE_EXPORT_NO_PACKAGE_REGISTRY=ON -DCMAKE_FIND_USE_PACKAGE_REGISTRY=OFF -DCMAKE_FIND_PACKAGE_NO_PACKAGE_REGISTRY=ON -DFETCHCONTENT_FULLY_DISCONNECTED=ON -DCMAKE_INSTALL_RUNSTATEDIR=/run -DCMAKE_SKIP_INSTALL_ALL_DEPENDENCY=ON "-GUnix Makefiles" -DCMAKE_VERBOSE_MAKEFILE=ON -DCMAKE_SYSTEM_NAME=Linux -DCMAKE_SYSTEM_PROCESSOR=ppc64le -DCMAKE_C_COMPILER=powerpc64le-linux-gnu-gcc -DCMAKE_CXX_COMPILER=powerpc64le-linux-gnu-g\+\+ -DPKG_CONFIG_EXECUTABLE=/usr/bin/powerpc64le-linux-gnu-pkg-config -DPKGCONFIG_EXECUTABLE=/usr/bin/powerpc64le-linux-gnu-pkg-config -DQMAKE_EXECUTABLE=/usr/bin/powerpc64le-linux-gnu-qmake -DCMAKE_INSTALL_LIBDIR=lib/powerpc64le-linux-gnu -DBUILD_TESTING:BOOL=OFF --no-warn-unused-cli -DBUILD_SHARED_LIBS=ON -DBUILD_TESTING=OFF -DAMENT_LINT_AUTO=OFF -DAMENT_CMAKE_ENVIRONMENT_PACKAGE_GENERATION=OFF -DAMENT_CMAKE_ENVIRONMENT_PARENT_PREFIX_PATH_GENERATION=OFF -DBUILD_TESTING=OFF -DRCUTILS_SOVERSION=1d ../..
Not searching for unused variables given on the command line.
-- The C compiler identification is GNU 14.2.0
-- The CXX compiler identification is GNU 14.2.0
-- Detecting C compiler ABI info
-- Detecting C compiler ABI info - done
-- Check for working C compiler: /usr/bin/powerpc64le-linux-gnu-gcc - skipped
-- Detecting C compile features
-- Detecting C compile features - done
-- Detecting CXX compiler ABI info
-- Detecting CXX compiler ABI info - done
-- Check for working CXX compiler: /usr/bin/powerpc64le-linux-gnu-g++ - skipped
-- Detecting CXX compile features
-- Detecting CXX compile features - done
-- Found ament_cmake_python: 2.7.2 (/usr/share/ament_cmake_python/cmake)
-- Found ament_cmake_ros: 0.13.1 (/usr/share/ament_cmake_ros/cmake)
-- Found Python3: /usr/bin/python3 (found version "3.13.2") found components: Interpreter
Traceback (most recent call last):
  File "<string>", line 4, in <module>
    if sysconfig.get_config_var('base') != os.path.normpath('/usr'):
       ~~~~~~~~~~~~~~~~~~~~~~~~^^^^^^^^
  File "/usr/lib/python3.13/sysconfig/__init__.py", line 620, in get_config_var
    return get_config_vars().get(name)
           ~~~~~~~~~~~~~~~^^
  File "/usr/lib/python3.13/sysconfig/__init__.py", line 594, in get_config_vars
    _init_config_vars()
    ~~~~~~~~~~~~~~~~~^^
  File "/usr/lib/python3.13/sysconfig/__init__.py", line 531, in _init_config_vars
    _init_posix(_CONFIG_VARS)
    ~~~~~~~~~~~^^^^^^^^^^^^^^
  File "/usr/lib/python3.13/sysconfig/__init__.py", line 389, in _init_posix
    _temp = __import__(name, globals(), locals(), ['build_time_vars'], 0)
ModuleNotFoundError: No module named '_sysconfigdata__linux_powerpc64le-linux-gnu'
CMake Error at /usr/share/ament_cmake_python/cmake/ament_cmake_python-extras.cmake:71 (message):
  execute_process(/usr/bin/python3 -c 'import os

  import sysconfig

  kwargs = {'vars': {'base': '/usr'}}

  if sysconfig.get_config_var('base') != os.path.normpath('/usr'):

      schemes = sysconfig.get_scheme_names()
      if 'deb_system' in schemes or 'osx_framework_library' in schemes:
          kwargs['scheme'] = 'posix_prefix'
      elif 'rpm_prefix' in schemes:
          kwargs['scheme'] = 'rpm_prefix'

  print(os.path.relpath(sysconfig.get_path('purelib', **kwargs),
  start='/usr').replace(os.sep, '/'))') returned error code 1
Call Stack (most recent call first):
  /usr/share/ament_cmake_python/cmake/ament_cmake_python-extras.cmake:22 (_ament_cmake_python_get_python_install_dir)
  /usr/share/ament_cmake_python/cmake/ament_python_install_package.cmake:38 (_ament_cmake_python_register_environment_hook)
  CMakeLists.txt:37 (ament_python_install_package)


-- Configuring incomplete, errors occurred!
	cd obj-powerpc64le-linux-gnu/rcutils && tail -v -n \+0 CMakeCache.txt
==> CMakeCache.txt <==
# This is the CMakeCache file.
# For build in directory: /<<PKGBUILDDIR>>/obj-powerpc64le-linux-gnu/rcutils
# It was generated by CMake: /usr/bin/cmake
# You can edit this file to change values found and used by cmake.
# If you do not want to change any of the values, simply exit the editor.
# If you do want to change a value, simply edit, save, and exit the editor.
# The syntax for the file is as follows:
# KEY:TYPE=VALUE
# KEY is the name of a variable in the cache.
# TYPE is a hint to GUIs for the type of VALUE, DO NOT EDIT TYPE!.
# VALUE is the current value for the KEY.

########################
# EXTERNAL cache entries
########################

//Generate environment files in the CMAKE_INSTALL_PREFIX
AMENT_CMAKE_ENVIRONMENT_GENERATION:BOOL=OFF

//Generate environment files in the package share folder
AMENT_CMAKE_ENVIRONMENT_PACKAGE_GENERATION:BOOL=OFF

//Generate marker file containing the parent prefix path
AMENT_CMAKE_ENVIRONMENT_PARENT_PREFIX_PATH_GENERATION:BOOL=OFF

//Replace the CMake install command with a custom implementation
// using symlinks instead of copying resources
AMENT_CMAKE_SYMLINK_INSTALL:BOOL=OFF

//Generate an uninstall target to revert the effects of the install
// step
AMENT_CMAKE_UNINSTALL_TARGET:BOOL=ON

//No help, variable specified on the command line.
AMENT_LINT_AUTO:UNINITIALIZED=OFF

//The path where test results are generated
AMENT_TEST_RESULTS_DIR:PATH=/<<PKGBUILDDIR>>/obj-powerpc64le-linux-gnu/rcutils/test_results

//Global flag to cause add_library() to create shared libraries
// if on. If set to true, this will cause all libraries to be built
// shared unless the library was explicitly added as a static library.
BUILD_SHARED_LIBS:BOOL=ON

//Build the testing tree.
BUILD_TESTING:BOOL=OFF

//Path to a program.
CMAKE_ADDR2LINE:FILEPATH=/usr/bin/powerpc64le-linux-gnu-addr2line

//Path to a program.
CMAKE_AR:FILEPATH=/usr/bin/powerpc64le-linux-gnu-ar

//Choose the type of build, options are: None Debug Release RelWithDebInfo
// MinSizeRel ...
CMAKE_BUILD_TYPE:STRING=None

//Enable/Disable color output during build.
CMAKE_COLOR_MAKEFILE:BOOL=ON

//CXX compiler
CMAKE_CXX_COMPILER:STRING=/usr/bin/powerpc64le-linux-gnu-g++

//A wrapper around 'ar' adding the appropriate '--plugin' option
// for the GCC compiler
CMAKE_CXX_COMPILER_AR:FILEPATH=/usr/bin/powerpc64le-linux-gnu-gcc-ar-14

//A wrapper around 'ranlib' adding the appropriate '--plugin' option
// for the GCC compiler
CMAKE_CXX_COMPILER_RANLIB:FILEPATH=/usr/bin/powerpc64le-linux-gnu-gcc-ranlib-14

//Flags used by the CXX compiler during all build types.
CMAKE_CXX_FLAGS:STRING=-g -O2 -ffile-prefix-map=/<<PKGBUILDDIR>>=. -fstack-protector-strong -Wformat -Werror=format-security -Wdate-time -D_FORTIFY_SOURCE=2

//Flags used by the CXX compiler during DEBUG builds.
CMAKE_CXX_FLAGS_DEBUG:STRING=-g

//Flags used by the CXX compiler during MINSIZEREL builds.
CMAKE_CXX_FLAGS_MINSIZEREL:STRING=-Os -DNDEBUG

//Flags used by the CXX compiler during NONE builds.
CMAKE_CXX_FLAGS_NONE:STRING=

//Flags used by the CXX compiler during RELEASE builds.
CMAKE_CXX_FLAGS_RELEASE:STRING=-O3 -DNDEBUG

//Flags used by the CXX compiler during RELWITHDEBINFO builds.
CMAKE_CXX_FLAGS_RELWITHDEBINFO:STRING=-O2 -g -DNDEBUG

//C compiler
CMAKE_C_COMPILER:STRING=/usr/bin/powerpc64le-linux-gnu-gcc

//A wrapper around 'ar' adding the appropriate '--plugin' option
// for the GCC compiler
CMAKE_C_COMPILER_AR:FILEPATH=/usr/bin/powerpc64le-linux-gnu-gcc-ar-14

//A wrapper around 'ranlib' adding the appropriate '--plugin' option
// for the GCC compiler
CMAKE_C_COMPILER_RANLIB:FILEPATH=/usr/bin/powerpc64le-linux-gnu-gcc-ranlib-14

//Flags used by the C compiler during all build types.
CMAKE_C_FLAGS:STRING=-g -O2 -Werror=implicit-function-declaration -ffile-prefix-map=/<<PKGBUILDDIR>>=. -fstack-protector-strong -Wformat -Werror=format-security -Wdate-time -D_FORTIFY_SOURCE=2

//Flags used by the C compiler during DEBUG builds.
CMAKE_C_FLAGS_DEBUG:STRING=-g

//Flags used by the C compiler during MINSIZEREL builds.
CMAKE_C_FLAGS_MINSIZEREL:STRING=-Os -DNDEBUG

//Flags used by the C compiler during NONE builds.
CMAKE_C_FLAGS_NONE:STRING=

//Flags used by the C compiler during RELEASE builds.
CMAKE_C_FLAGS_RELEASE:STRING=-O3 -DNDEBUG

//Flags used by the C compiler during RELWITHDEBINFO builds.
CMAKE_C_FLAGS_RELWITHDEBINFO:STRING=-O2 -g -DNDEBUG

//Path to a program.
CMAKE_DLLTOOL:FILEPATH=CMAKE_DLLTOOL-NOTFOUND

//Flags used by the linker during all build types.
CMAKE_EXE_LINKER_FLAGS:STRING=-Wl,-z,relro -Wl,-z,now

//Flags used by the linker during DEBUG builds.
CMAKE_EXE_LINKER_FLAGS_DEBUG:STRING=

//Flags used by the linker during MINSIZEREL builds.
CMAKE_EXE_LINKER_FLAGS_MINSIZEREL:STRING=

//Flags used by the linker during NONE builds.
CMAKE_EXE_LINKER_FLAGS_NONE:STRING=

//Flags used by the linker during RELEASE builds.
CMAKE_EXE_LINKER_FLAGS_RELEASE:STRING=

//Flags used by the linker during RELWITHDEBINFO builds.
CMAKE_EXE_LINKER_FLAGS_RELWITHDEBINFO:STRING=

//Enable/Disable output of compile commands during generation.
CMAKE_EXPORT_COMPILE_COMMANDS:BOOL=

//No help, variable specified on the command line.
CMAKE_EXPORT_NO_PACKAGE_REGISTRY:UNINITIALIZED=ON

//No help, variable specified on the command line.
CMAKE_FIND_PACKAGE_NO_PACKAGE_REGISTRY:UNINITIALIZED=ON

//Value Computed by CMake.
CMAKE_FIND_PACKAGE_REDIRECTS_DIR:STATIC=/<<PKGBUILDDIR>>/obj-powerpc64le-linux-gnu/rcutils/CMakeFiles/pkgRedirects

//No help, variable specified on the command line.
CMAKE_FIND_USE_PACKAGE_REGISTRY:UNINITIALIZED=OFF

//User executables (bin)
CMAKE_INSTALL_BINDIR:PATH=bin

//Read-only architecture-independent data (DATAROOTDIR)
CMAKE_INSTALL_DATADIR:PATH=

//Read-only architecture-independent data root (share)
CMAKE_INSTALL_DATAROOTDIR:PATH=share

//Documentation root (DATAROOTDIR/doc/PROJECT_NAME)
CMAKE_INSTALL_DOCDIR:PATH=

//C header files (include)
CMAKE_INSTALL_INCLUDEDIR:PATH=include

//Info documentation (DATAROOTDIR/info)
CMAKE_INSTALL_INFODIR:PATH=

//Object code libraries (lib)
CMAKE_INSTALL_LIBDIR:PATH=lib/powerpc64le-linux-gnu

//Program executables (libexec)
CMAKE_INSTALL_LIBEXECDIR:PATH=libexec

//Locale-dependent data (DATAROOTDIR/locale)
CMAKE_INSTALL_LOCALEDIR:PATH=

//Modifiable single-machine data (var)
CMAKE_INSTALL_LOCALSTATEDIR:PATH=/var

//Man documentation (DATAROOTDIR/man)
CMAKE_INSTALL_MANDIR:PATH=

//C header files for non-gcc (/usr/include)
CMAKE_INSTALL_OLDINCLUDEDIR:PATH=/usr/include

//Install path prefix, prepended onto install directories.
CMAKE_INSTALL_PREFIX:PATH=/usr

//Run-time variable data (LOCALSTATEDIR/run)
CMAKE_INSTALL_RUNSTATEDIR:PATH=/run

//System admin executables (sbin)
CMAKE_INSTALL_SBINDIR:PATH=sbin

//Modifiable architecture-independent data (com)
CMAKE_INSTALL_SHAREDSTATEDIR:PATH=com

//Read-only single-machine data (etc)
CMAKE_INSTALL_SYSCONFDIR:PATH=/etc

//Path to a program.
CMAKE_LINKER:FILEPATH=/usr/bin/powerpc64le-linux-gnu-ld

//Path to a program.
CMAKE_MAKE_PROGRAM:FILEPATH=/usr/bin/gmake

//Flags used by the linker during the creation of modules during
// all build types.
CMAKE_MODULE_LINKER_FLAGS:STRING=-Wl,-z,relro -Wl,-z,now

//Flags used by the linker during the creation of modules during
// DEBUG builds.
CMAKE_MODULE_LINKER_FLAGS_DEBUG:STRING=

//Flags used by the linker during the creation of modules during
// MINSIZEREL builds.
CMAKE_MODULE_LINKER_FLAGS_MINSIZEREL:STRING=

//Flags used by the linker during the creation of modules during
// NONE builds.
CMAKE_MODULE_LINKER_FLAGS_NONE:STRING=

//Flags used by the linker during the creation of modules during
// RELEASE builds.
CMAKE_MODULE_LINKER_FLAGS_RELEASE:STRING=

//Flags used by the linker during the creation of modules during
// RELWITHDEBINFO builds.
CMAKE_MODULE_LINKER_FLAGS_RELWITHDEBINFO:STRING=

//Path to a program.
CMAKE_NM:FILEPATH=/usr/bin/powerpc64le-linux-gnu-nm

//Path to a program.
CMAKE_OBJCOPY:FILEPATH=/usr/bin/powerpc64le-linux-gnu-objcopy

//Path to a program.
CMAKE_OBJDUMP:FILEPATH=/usr/bin/powerpc64le-linux-gnu-objdump

//Value Computed by CMake
CMAKE_PROJECT_DESCRIPTION:STATIC=

//Value Computed by CMake
CMAKE_PROJECT_HOMEPAGE_URL:STATIC=

//Value Computed by CMake
CMAKE_PROJECT_NAME:STATIC=rcutils

//Path to a program.
CMAKE_RANLIB:FILEPATH=/usr/bin/powerpc64le-linux-gnu-ranlib

//Path to a program.
CMAKE_READELF:FILEPATH=/usr/bin/powerpc64le-linux-gnu-readelf

//Flags used by the linker during the creation of shared libraries
// during all build types.
CMAKE_SHARED_LINKER_FLAGS:STRING=-Wl,-z,relro -Wl,-z,now

//Flags used by the linker during the creation of shared libraries
// during DEBUG builds.
CMAKE_SHARED_LINKER_FLAGS_DEBUG:STRING=

//Flags used by the linker during the creation of shared libraries
// during MINSIZEREL builds.
CMAKE_SHARED_LINKER_FLAGS_MINSIZEREL:STRING=

//Flags used by the linker during the creation of shared libraries
// during NONE builds.
CMAKE_SHARED_LINKER_FLAGS_NONE:STRING=

//Flags used by the linker during the creation of shared libraries
// during RELEASE builds.
CMAKE_SHARED_LINKER_FLAGS_RELEASE:STRING=

//Flags used by the linker during the creation of shared libraries
// during RELWITHDEBINFO builds.
CMAKE_SHARED_LINKER_FLAGS_RELWITHDEBINFO:STRING=

//No help, variable specified on the command line.
CMAKE_SKIP_INSTALL_ALL_DEPENDENCY:UNINITIALIZED=ON

//If set, runtime paths are not added when installing shared libraries,
// but are added when building.
CMAKE_SKIP_INSTALL_RPATH:BOOL=NO

//If set, runtime paths are not added when using shared libraries.
CMAKE_SKIP_RPATH:BOOL=NO

//Flags used by the linker during the creation of static libraries
// during all build types.
CMAKE_STATIC_LINKER_FLAGS:STRING=

//Flags used by the linker during the creation of static libraries
// during DEBUG builds.
CMAKE_STATIC_LINKER_FLAGS_DEBUG:STRING=

//Flags used by the linker during the creation of static libraries
// during MINSIZEREL builds.
CMAKE_STATIC_LINKER_FLAGS_MINSIZEREL:STRING=

//Flags used by the linker during the creation of static libraries
// during NONE builds.
CMAKE_STATIC_LINKER_FLAGS_NONE:STRING=

//Flags used by the linker during the creation of static libraries
// during RELEASE builds.
CMAKE_STATIC_LINKER_FLAGS_RELEASE:STRING=

//Flags used by the linker during the creation of static libraries
// during RELWITHDEBINFO builds.
CMAKE_STATIC_LINKER_FLAGS_RELWITHDEBINFO:STRING=

//Path to a program.
CMAKE_STRIP:FILEPATH=/usr/bin/powerpc64le-linux-gnu-strip

//No help, variable specified on the command line.
CMAKE_SYSTEM_NAME:UNINITIALIZED=Linux

//No help, variable specified on the command line.
CMAKE_SYSTEM_PROCESSOR:UNINITIALIZED=ppc64le

//Path to a program.
CMAKE_TAPI:FILEPATH=CMAKE_TAPI-NOTFOUND

//If this value is on, makefiles will be generated without the
// .SILENT directive, and all commands will be echoed to the console
// during the make.  This is useful for debugging only. With Visual
// Studio IDE projects all commands are done without /nologo.
CMAKE_VERBOSE_MAKEFILE:BOOL=ON

//No help, variable specified on the command line.
FETCHCONTENT_FULLY_DISCONNECTED:UNINITIALIZED=ON

//No help, variable specified on the command line.
PKGCONFIG_EXECUTABLE:UNINITIALIZED=/usr/bin/powerpc64le-linux-gnu-pkg-config

//No help, variable specified on the command line.
PKG_CONFIG_EXECUTABLE:UNINITIALIZED=/usr/bin/powerpc64le-linux-gnu-pkg-config

//No help, variable specified on the command line.
QMAKE_EXECUTABLE:UNINITIALIZED=/usr/bin/powerpc64le-linux-gnu-qmake

//No help, variable specified on the command line.
RCUTILS_SOVERSION:UNINITIALIZED=1d

//The directory containing a CMake configuration file for ament_cmake.
ament_cmake_DIR:PATH=/usr/share/ament_cmake/cmake

//The directory containing a CMake configuration file for ament_cmake_core.
ament_cmake_core_DIR:PATH=/usr/share/ament_cmake_core/cmake

//The directory containing a CMake configuration file for ament_cmake_export_definitions.
ament_cmake_export_definitions_DIR:PATH=/usr/share/ament_cmake_export_definitions/cmake

//The directory containing a CMake configuration file for ament_cmake_export_dependencies.
ament_cmake_export_dependencies_DIR:PATH=/usr/share/ament_cmake_export_dependencies/cmake

//The directory containing a CMake configuration file for ament_cmake_export_include_directories.
ament_cmake_export_include_directories_DIR:PATH=/usr/share/ament_cmake_export_include_directories/cmake

//The directory containing a CMake configuration file for ament_cmake_export_interfaces.
ament_cmake_export_interfaces_DIR:PATH=/usr/share/ament_cmake_export_interfaces/cmake

//The directory containing a CMake configuration file for ament_cmake_export_libraries.
ament_cmake_export_libraries_DIR:PATH=/usr/share/ament_cmake_export_libraries/cmake

//The directory containing a CMake configuration file for ament_cmake_export_link_flags.
ament_cmake_export_link_flags_DIR:PATH=/usr/share/ament_cmake_export_link_flags/cmake

//The directory containing a CMake configuration file for ament_cmake_export_targets.
ament_cmake_export_targets_DIR:PATH=/usr/share/ament_cmake_export_targets/cmake

//The directory containing a CMake configuration file for ament_cmake_gen_version_h.
ament_cmake_gen_version_h_DIR:PATH=/usr/share/ament_cmake_gen_version_h/cmake

//The directory containing a CMake configuration file for ament_cmake_gmock.
ament_cmake_gmock_DIR:PATH=/usr/share/ament_cmake_gmock/cmake

//The directory containing a CMake configuration file for ament_cmake_gtest.
ament_cmake_gtest_DIR:PATH=/usr/share/ament_cmake_gtest/cmake

//The directory containing a CMake configuration file for ament_cmake_include_directories.
ament_cmake_include_directories_DIR:PATH=/usr/share/ament_cmake_include_directories/cmake

//The directory containing a CMake configuration file for ament_cmake_libraries.
ament_cmake_libraries_DIR:PATH=/usr/share/ament_cmake_libraries/cmake

//The directory containing a CMake configuration file for ament_cmake_pytest.
ament_cmake_pytest_DIR:PATH=/usr/share/ament_cmake_pytest/cmake

//The directory containing a CMake configuration file for ament_cmake_python.
ament_cmake_python_DIR:PATH=/usr/share/ament_cmake_python/cmake

//The directory containing a CMake configuration file for ament_cmake_ros.
ament_cmake_ros_DIR:PATH=/usr/share/ament_cmake_ros/cmake

//The directory containing a CMake configuration file for ament_cmake_target_dependencies.
ament_cmake_target_dependencies_DIR:PATH=/usr/share/ament_cmake_target_dependencies/cmake

//The directory containing a CMake configuration file for ament_cmake_test.
ament_cmake_test_DIR:PATH=/usr/share/ament_cmake_test/cmake

//The directory containing a CMake configuration file for ament_cmake_version.
ament_cmake_version_DIR:PATH=/usr/share/ament_cmake_version/cmake

//Value Computed by CMake
rcutils_BINARY_DIR:STATIC=/<<PKGBUILDDIR>>/obj-powerpc64le-linux-gnu/rcutils

//Value Computed by CMake
rcutils_IS_TOP_LEVEL:STATIC=ON

//Value Computed by CMake
rcutils_SOURCE_DIR:STATIC=/<<PKGBUILDDIR>>


########################
# INTERNAL cache entries
########################

//ADVANCED property for variable: CMAKE_ADDR2LINE
CMAKE_ADDR2LINE-ADVANCED:INTERNAL=1
//ADVANCED property for variable: CMAKE_AR
CMAKE_AR-ADVANCED:INTERNAL=1
//This is the directory where this CMakeCache.txt was created
CMAKE_CACHEFILE_DIR:INTERNAL=/<<PKGBUILDDIR>>/obj-powerpc64le-linux-gnu/rcutils
//Major version of cmake used to create the current loaded cache
CMAKE_CACHE_MAJOR_VERSION:INTERNAL=3
//Minor version of cmake used to create the current loaded cache
CMAKE_CACHE_MINOR_VERSION:INTERNAL=31
//Patch version of cmake used to create the current loaded cache
CMAKE_CACHE_PATCH_VERSION:INTERNAL=6
//ADVANCED property for variable: CMAKE_COLOR_MAKEFILE
CMAKE_COLOR_MAKEFILE-ADVANCED:INTERNAL=1
//Path to CMake executable.
CMAKE_COMMAND:INTERNAL=/usr/bin/cmake
//Path to cpack program executable.
CMAKE_CPACK_COMMAND:INTERNAL=/usr/bin/cpack
//Path to ctest program executable.
CMAKE_CTEST_COMMAND:INTERNAL=/usr/bin/ctest
//ADVANCED property for variable: CMAKE_CXX_COMPILER
CMAKE_CXX_COMPILER-ADVANCED:INTERNAL=1
//ADVANCED property for variable: CMAKE_CXX_COMPILER_AR
CMAKE_CXX_COMPILER_AR-ADVANCED:INTERNAL=1
//ADVANCED property for variable: CMAKE_CXX_COMPILER_RANLIB
CMAKE_CXX_COMPILER_RANLIB-ADVANCED:INTERNAL=1
//ADVANCED property for variable: CMAKE_CXX_FLAGS
CMAKE_CXX_FLAGS-ADVANCED:INTERNAL=1
//ADVANCED property for variable: CMAKE_CXX_FLAGS_DEBUG
CMAKE_CXX_FLAGS_DEBUG-ADVANCED:INTERNAL=1
//ADVANCED property for variable: CMAKE_CXX_FLAGS_MINSIZEREL
CMAKE_CXX_FLAGS_MINSIZEREL-ADVANCED:INTERNAL=1
//ADVANCED property for variable: CMAKE_CXX_FLAGS_NONE
CMAKE_CXX_FLAGS_NONE-ADVANCED:INTERNAL=1
//ADVANCED property for variable: CMAKE_CXX_FLAGS_RELEASE
CMAKE_CXX_FLAGS_RELEASE-ADVANCED:INTERNAL=1
//ADVANCED property for variable: CMAKE_CXX_FLAGS_RELWITHDEBINFO
CMAKE_CXX_FLAGS_RELWITHDEBINFO-ADVANCED:INTERNAL=1
//ADVANCED property for variable: CMAKE_C_COMPILER
CMAKE_C_COMPILER-ADVANCED:INTERNAL=1
//ADVANCED property for variable: CMAKE_C_COMPILER_AR
CMAKE_C_COMPILER_AR-ADVANCED:INTERNAL=1
//ADVANCED property for variable: CMAKE_C_COMPILER_RANLIB
CMAKE_C_COMPILER_RANLIB-ADVANCED:INTERNAL=1
//ADVANCED property for variable: CMAKE_C_FLAGS
CMAKE_C_FLAGS-ADVANCED:INTERNAL=1
//ADVANCED property for variable: CMAKE_C_FLAGS_DEBUG
CMAKE_C_FLAGS_DEBUG-ADVANCED:INTERNAL=1
//ADVANCED property for variable: CMAKE_C_FLAGS_MINSIZEREL
CMAKE_C_FLAGS_MINSIZEREL-ADVANCED:INTERNAL=1
//ADVANCED property for variable: CMAKE_C_FLAGS_NONE
CMAKE_C_FLAGS_NONE-ADVANCED:INTERNAL=1
//ADVANCED property for variable: CMAKE_C_FLAGS_RELEASE
CMAKE_C_FLAGS_RELEASE-ADVANCED:INTERNAL=1
//ADVANCED property for variable: CMAKE_C_FLAGS_RELWITHDEBINFO
CMAKE_C_FLAGS_RELWITHDEBINFO-ADVANCED:INTERNAL=1
//ADVANCED property for variable: CMAKE_DLLTOOL
CMAKE_DLLTOOL-ADVANCED:INTERNAL=1
//Executable file format
CMAKE_EXECUTABLE_FORMAT:INTERNAL=ELF
//ADVANCED property for variable: CMAKE_EXE_LINKER_FLAGS
CMAKE_EXE_LINKER_FLAGS-ADVANCED:INTERNAL=1
//ADVANCED property for variable: CMAKE_EXE_LINKER_FLAGS_DEBUG
CMAKE_EXE_LINKER_FLAGS_DEBUG-ADVANCED:INTERNAL=1
//ADVANCED property for variable: CMAKE_EXE_LINKER_FLAGS_MINSIZEREL
CMAKE_EXE_LINKER_FLAGS_MINSIZEREL-ADVANCED:INTERNAL=1
//ADVANCED property for variable: CMAKE_EXE_LINKER_FLAGS_NONE
CMAKE_EXE_LINKER_FLAGS_NONE-ADVANCED:INTERNAL=1
//ADVANCED property for variable: CMAKE_EXE_LINKER_FLAGS_RELEASE
CMAKE_EXE_LINKER_FLAGS_RELEASE-ADVANCED:INTERNAL=1
//ADVANCED property for variable: CMAKE_EXE_LINKER_FLAGS_RELWITHDEBINFO
CMAKE_EXE_LINKER_FLAGS_RELWITHDEBINFO-ADVANCED:INTERNAL=1
//ADVANCED property for variable: CMAKE_EXPORT_COMPILE_COMMANDS
CMAKE_EXPORT_COMPILE_COMMANDS-ADVANCED:INTERNAL=1
//Name of external makefile project generator.
CMAKE_EXTRA_GENERATOR:INTERNAL=
//Name of generator.
CMAKE_GENERATOR:INTERNAL=Unix Makefiles
//Generator instance identifier.
CMAKE_GENERATOR_INSTANCE:INTERNAL=
//Name of generator platform.
CMAKE_GENERATOR_PLATFORM:INTERNAL=
//Name of generator toolset.
CMAKE_GENERATOR_TOOLSET:INTERNAL=
//Source directory with the top level CMakeLists.txt file for this
// project
CMAKE_HOME_DIRECTORY:INTERNAL=/<<PKGBUILDDIR>>
//ADVANCED property for variable: CMAKE_INSTALL_BINDIR
CMAKE_INSTALL_BINDIR-ADVANCED:INTERNAL=1
//ADVANCED property for variable: CMAKE_INSTALL_DATADIR
CMAKE_INSTALL_DATADIR-ADVANCED:INTERNAL=1
//ADVANCED property for variable: CMAKE_INSTALL_DATAROOTDIR
CMAKE_INSTALL_DATAROOTDIR-ADVANCED:INTERNAL=1
//ADVANCED property for variable: CMAKE_INSTALL_DOCDIR
CMAKE_INSTALL_DOCDIR-ADVANCED:INTERNAL=1
//ADVANCED property for variable: CMAKE_INSTALL_INCLUDEDIR
CMAKE_INSTALL_INCLUDEDIR-ADVANCED:INTERNAL=1
//ADVANCED property for variable: CMAKE_INSTALL_INFODIR
CMAKE_INSTALL_INFODIR-ADVANCED:INTERNAL=1
//ADVANCED property for variable: CMAKE_INSTALL_LIBDIR
CMAKE_INSTALL_LIBDIR-ADVANCED:INTERNAL=1
//ADVANCED property for variable: CMAKE_INSTALL_LIBEXECDIR
CMAKE_INSTALL_LIBEXECDIR-ADVANCED:INTERNAL=1
//ADVANCED property for variable: CMAKE_INSTALL_LOCALEDIR
CMAKE_INSTALL_LOCALEDIR-ADVANCED:INTERNAL=1
//ADVANCED property for variable: CMAKE_INSTALL_LOCALSTATEDIR
CMAKE_INSTALL_LOCALSTATEDIR-ADVANCED:INTERNAL=1
//ADVANCED property for variable: CMAKE_INSTALL_MANDIR
CMAKE_INSTALL_MANDIR-ADVANCED:INTERNAL=1
//ADVANCED property for variable: CMAKE_INSTALL_OLDINCLUDEDIR
CMAKE_INSTALL_OLDINCLUDEDIR-ADVANCED:INTERNAL=1
//ADVANCED property for variable: CMAKE_INSTALL_RUNSTATEDIR
CMAKE_INSTALL_RUNSTATEDIR-ADVANCED:INTERNAL=1
//ADVANCED property for variable: CMAKE_INSTALL_SBINDIR
CMAKE_INSTALL_SBINDIR-ADVANCED:INTERNAL=1
//ADVANCED property for variable: CMAKE_INSTALL_SHAREDSTATEDIR
CMAKE_INSTALL_SHAREDSTATEDIR-ADVANCED:INTERNAL=1
//Install .so files without execute permission.
CMAKE_INSTALL_SO_NO_EXE:INTERNAL=1
//ADVANCED property for variable: CMAKE_INSTALL_SYSCONFDIR
CMAKE_INSTALL_SYSCONFDIR-ADVANCED:INTERNAL=1
//ADVANCED property for variable: CMAKE_LINKER
CMAKE_LINKER-ADVANCED:INTERNAL=1
//ADVANCED property for variable: CMAKE_MAKE_PROGRAM
CMAKE_MAKE_PROGRAM-ADVANCED:INTERNAL=1
//ADVANCED property for variable: CMAKE_MODULE_LINKER_FLAGS
CMAKE_MODULE_LINKER_FLAGS-ADVANCED:INTERNAL=1
//ADVANCED property for variable: CMAKE_MODULE_LINKER_FLAGS_DEBUG
CMAKE_MODULE_LINKER_FLAGS_DEBUG-ADVANCED:INTERNAL=1
//ADVANCED property for variable: CMAKE_MODULE_LINKER_FLAGS_MINSIZEREL
CMAKE_MODULE_LINKER_FLAGS_MINSIZEREL-ADVANCED:INTERNAL=1
//ADVANCED property for variable: CMAKE_MODULE_LINKER_FLAGS_NONE
CMAKE_MODULE_LINKER_FLAGS_NONE-ADVANCED:INTERNAL=1
//ADVANCED property for variable: CMAKE_MODULE_LINKER_FLAGS_RELEASE
CMAKE_MODULE_LINKER_FLAGS_RELEASE-ADVANCED:INTERNAL=1
//ADVANCED property for variable: CMAKE_MODULE_LINKER_FLAGS_RELWITHDEBINFO
CMAKE_MODULE_LINKER_FLAGS_RELWITHDEBINFO-ADVANCED:INTERNAL=1
//ADVANCED property for variable: CMAKE_NM
CMAKE_NM-ADVANCED:INTERNAL=1
//number of local generators
CMAKE_NUMBER_OF_MAKEFILES:INTERNAL=1
//ADVANCED property for variable: CMAKE_OBJCOPY
CMAKE_OBJCOPY-ADVANCED:INTERNAL=1
//ADVANCED property for variable: CMAKE_OBJDUMP
CMAKE_OBJDUMP-ADVANCED:INTERNAL=1
//Platform information initialized
CMAKE_PLATFORM_INFO_INITIALIZED:INTERNAL=1
//ADVANCED property for variable: CMAKE_RANLIB
CMAKE_RANLIB-ADVANCED:INTERNAL=1
//ADVANCED property for variable: CMAKE_READELF
CMAKE_READELF-ADVANCED:INTERNAL=1
//Path to CMake installation.
CMAKE_ROOT:INTERNAL=/usr/share/cmake-3.31
//ADVANCED property for variable: CMAKE_SHARED_LINKER_FLAGS
CMAKE_SHARED_LINKER_FLAGS-ADVANCED:INTERNAL=1
//ADVANCED property for variable: CMAKE_SHARED_LINKER_FLAGS_DEBUG
CMAKE_SHARED_LINKER_FLAGS_DEBUG-ADVANCED:INTERNAL=1
//ADVANCED property for variable: CMAKE_SHARED_LINKER_FLAGS_MINSIZEREL
CMAKE_SHARED_LINKER_FLAGS_MINSIZEREL-ADVANCED:INTERNAL=1
//ADVANCED property for variable: CMAKE_SHARED_LINKER_FLAGS_NONE
CMAKE_SHARED_LINKER_FLAGS_NONE-ADVANCED:INTERNAL=1
//ADVANCED property for variable: CMAKE_SHARED_LINKER_FLAGS_RELEASE
CMAKE_SHARED_LINKER_FLAGS_RELEASE-ADVANCED:INTERNAL=1
//ADVANCED property for variable: CMAKE_SHARED_LINKER_FLAGS_RELWITHDEBINFO
CMAKE_SHARED_LINKER_FLAGS_RELWITHDEBINFO-ADVANCED:INTERNAL=1
//ADVANCED property for variable: CMAKE_SKIP_INSTALL_RPATH
CMAKE_SKIP_INSTALL_RPATH-ADVANCED:INTERNAL=1
//ADVANCED property for variable: CMAKE_SKIP_RPATH
CMAKE_SKIP_RPATH-ADVANCED:INTERNAL=1
//ADVANCED property for variable: CMAKE_STATIC_LINKER_FLAGS
CMAKE_STATIC_LINKER_FLAGS-ADVANCED:INTERNAL=1
//ADVANCED property for variable: CMAKE_STATIC_LINKER_FLAGS_DEBUG
CMAKE_STATIC_LINKER_FLAGS_DEBUG-ADVANCED:INTERNAL=1
//ADVANCED property for variable: CMAKE_STATIC_LINKER_FLAGS_MINSIZEREL
CMAKE_STATIC_LINKER_FLAGS_MINSIZEREL-ADVANCED:INTERNAL=1
//ADVANCED property for variable: CMAKE_STATIC_LINKER_FLAGS_NONE
CMAKE_STATIC_LINKER_FLAGS_NONE-ADVANCED:INTERNAL=1
//ADVANCED property for variable: CMAKE_STATIC_LINKER_FLAGS_RELEASE
CMAKE_STATIC_LINKER_FLAGS_RELEASE-ADVANCED:INTERNAL=1
//ADVANCED property for variable: CMAKE_STATIC_LINKER_FLAGS_RELWITHDEBINFO
CMAKE_STATIC_LINKER_FLAGS_RELWITHDEBINFO-ADVANCED:INTERNAL=1
//ADVANCED property for variable: CMAKE_STRIP
CMAKE_STRIP-ADVANCED:INTERNAL=1
//ADVANCED property for variable: CMAKE_TAPI
CMAKE_TAPI-ADVANCED:INTERNAL=1
//uname command
CMAKE_UNAME:INTERNAL=/usr/bin/uname
//ADVANCED property for variable: CMAKE_VERBOSE_MAKEFILE
CMAKE_VERBOSE_MAKEFILE-ADVANCED:INTERNAL=1
//Details about finding Python3
FIND_PACKAGE_MESSAGE_DETAILS_Python3:INTERNAL=[/usr/bin/python3][cfound components: Interpreter ][v3.13.2()]
//linker supports push/pop state
_CMAKE_CXX_LINKER_PUSHPOP_STATE_SUPPORTED:INTERNAL=TRUE
//linker supports push/pop state
_CMAKE_C_LINKER_PUSHPOP_STATE_SUPPORTED:INTERNAL=TRUE
//linker supports push/pop state
_CMAKE_LINKER_PUSHPOP_STATE_SUPPORTED:INTERNAL=TRUE
//CMAKE_INSTALL_PREFIX during last run
_GNUInstallDirs_LAST_CMAKE_INSTALL_PREFIX:INTERNAL=/usr
//Compiler reason failure
_Python3_Compiler_REASON_FAILURE:INTERNAL=
//Development reason failure
_Python3_Development_REASON_FAILURE:INTERNAL=
_Python3_EXECUTABLE:INTERNAL=/usr/bin/python3
//Python3 Properties
_Python3_INTERPRETER_PROPERTIES:INTERNAL=Python;3;13;2;64;32;;;abi3;;;;
_Python3_INTERPRETER_SIGNATURE:INTERNAL=4c8bfa8951e99fa32e4000a94f8c04a2
//NumPy reason failure
_Python3_NumPy_REASON_FAILURE:INTERNAL=

dh_auto_configure: error: cd obj-powerpc64le-linux-gnu/rcutils && PKG_CONFIG=/usr/bin/powerpc64le-linux-gnu-pkg-config cmake -DCMAKE_INSTALL_PREFIX=/usr -DCMAKE_BUILD_TYPE=None -DCMAKE_INSTALL_SYSCONFDIR=/etc -DCMAKE_INSTALL_LOCALSTATEDIR=/var -DCMAKE_EXPORT_NO_PACKAGE_REGISTRY=ON -DCMAKE_FIND_USE_PACKAGE_REGISTRY=OFF -DCMAKE_FIND_PACKAGE_NO_PACKAGE_REGISTRY=ON -DFETCHCONTENT_FULLY_DISCONNECTED=ON -DCMAKE_INSTALL_RUNSTATEDIR=/run -DCMAKE_SKIP_INSTALL_ALL_DEPENDENCY=ON "-GUnix Makefiles" -DCMAKE_VERBOSE_MAKEFILE=ON -DCMAKE_SYSTEM_NAME=Linux -DCMAKE_SYSTEM_PROCESSOR=ppc64le -DCMAKE_C_COMPILER=powerpc64le-linux-gnu-gcc -DCMAKE_CXX_COMPILER=powerpc64le-linux-gnu-g\+\+ -DPKG_CONFIG_EXECUTABLE=/usr/bin/powerpc64le-linux-gnu-pkg-config -DPKGCONFIG_EXECUTABLE=/usr/bin/powerpc64le-linux-gnu-pkg-config -DQMAKE_EXECUTABLE=/usr/bin/powerpc64le-linux-gnu-qmake -DCMAKE_INSTALL_LIBDIR=lib/powerpc64le-linux-gnu -DBUILD_TESTING:BOOL=OFF --no-warn-unused-cli -DBUILD_SHARED_LIBS=ON -DBUILD_TESTING=OFF -DAMENT_LINT_AUTO=OFF -DAMENT_CMAKE_ENVIRONMENT_PACKAGE_GENERATION=OFF -DAMENT_CMAKE_ENVIRONMENT_PARENT_PREFIX_PATH_GENERATION=OFF -DBUILD_TESTING=OFF -DRCUTILS_SOVERSION=1d ../.. returned exit code 1
dh_auto_install: error: rosbuilder --sourcedir . --builddir obj-powerpc64le-linux-gnu --destdir /<<PKGBUILDDIR>>/debian/tmp returned exit code 2
make: *** [debian/rules:7: binary-arch] Error 25
dpkg-buildpackage: error: debian/rules binary-arch subprocess returned exit status 2
--------------------------------------------------------------------------------
Build finished at 2025-03-12T23:31:41Z

+------------------------------------------------------------------------------+
| Finished Timed Build Commands                                                |
+------------------------------------------------------------------------------+


rm -Rf /<<PKGBUILDDIR>>/
-----------------------------------------------------


I: Finished running 'rm -Rf /<<PKGBUILDDIR>>/'.

Finished processing commands.
--------------------------------------------------------------------------------

Finished
--------


+------------------------------------------------------------------------------+
| Cleanup                                                                      |
+------------------------------------------------------------------------------+

Purging /<<BUILDDIR>>
Not cleaning session: cloned chroot in use
E: Build failure (dpkg-buildpackage died)

+------------------------------------------------------------------------------+
| Summary                                                                      |
+------------------------------------------------------------------------------+

Build Architecture: amd64
Build Profiles: cross nocheck
Build Type: any
Build-Space: n/a
Build-Time: 2
Distribution: unstable
Fail-Stage: build
Foreign Architectures: ppc64el
Host Architecture: ppc64el
Install-Time: 18
Job: ros2-rcutils_6.9.4-1
Machine Architecture: amd64
Package: ros2-rcutils
Package-Time: 29
Source-Version: 6.9.4-1
Space: n/a
Status: attempted
Version: 6.9.4-1
--------------------------------------------------------------------------------
Finished at 2025-03-12T23:31:41Z
Build needed 00:00:29, no disk space